%YAML 1.1
%TAG !u! tag:unity3d.com,2011:
--- !u!74 &7400000
AnimationClip:
  m_ObjectHideFlags: 0
  m_CorrespondingSourceObject: {fileID: 0}
  m_PrefabInstance: {fileID: 0}
  m_PrefabAsset: {fileID: 0}
  m_Name: Player - Walking
  serializedVersion: 6
  m_Legacy: 0
  m_Compressed: 0
  m_UseHighQualityCurve: 1
  m_RotationCurves: []
  m_CompressedRotationCurves: []
  m_EulerCurves: []
  m_PositionCurves: []
  m_ScaleCurves: []
  m_FloatCurves: []
  m_PPtrCurves:
  - curve:
    - time: 0
      value: {fileID: 497394434913321410, guid: 7ebf995f2f8c2aa479aa05aec29ae6d1,
        type: 3}
    - time: 0.1
      value: {fileID: 8126528979968981486, guid: 7ebf995f2f8c2aa479aa05aec29ae6d1,
        type: 3}
    - time: 0.2
      value: {fileID: -2975397403675712219, guid: 7ebf995f2f8c2aa479aa05aec29ae6d1,
        type: 3}
    - time: 0.3
      value: {fileID: 5469852598194841770, guid: 7ebf995f2f8c2aa479aa05aec29ae6d1,
        type: 3}
    - time: 0.4
      value: {fileID: 45878478628660970, guid: 7ebf995f2f8c2aa479aa05aec29ae6d1, type: 3}
    - time: 0.5
      value: {fileID: 6148105541944609538, guid: 7ebf995f2f8c2aa479aa05aec29ae6d1,
        type: 3}
    - time: 0.6
      value: {fileID: 9200238640206788070, guid: 7ebf995f2f8c2aa479aa05aec29ae6d1,
        type: 3}
    - time: 0.7
      value: {fileID: 5866028796149428683, guid: 7ebf995f2f8c2aa479aa05aec29ae6d1,
        type: 3}
    - time: 0.8
      value: {fileID: -1685358898804459016, guid: 7ebf995f2f8c2aa479aa05aec29ae6d1,
        type: 3}
    - time: 0.9
      value: {fileID: -6751380181678565474, guid: 7ebf995f2f8c2aa479aa05aec29ae6d1,
        type: 3}
    attribute: m_Sprite
    path: Body
    classID: 212
    script: {fileID: 0}
  m_SampleRate: 10
  m_WrapMode: 0
  m_Bounds:
    m_Center: {x: 0, y: 0, z: 0}
    m_Extent: {x: 0, y: 0, z: 0}
  m_ClipBindingConstant:
    genericBindings:
    - serializedVersion: 2
      path: 2073732236
      attribute: 0
      script: {fileID: 0}
      typeID: 212
      customType: 23
      isPPtrCurve: 1
    pptrCurveMapping:
    - {fileID: 497394434913321410, guid: 7ebf995f2f8c2aa479aa05aec29ae6d1, type: 3}
    - {fileID: 8126528979968981486, guid: 7ebf995f2f8c2aa479aa05aec29ae6d1, type: 3}
    - {fileID: -2975397403675712219, guid: 7ebf995f2f8c2aa479aa05aec29ae6d1, type: 3}
    - {fileID: 5469852598194841770, guid: 7ebf995f2f8c2aa479aa05aec29ae6d1, type: 3}
    - {fileID: 45878478628660970, guid: 7ebf995f2f8c2aa479aa05aec29ae6d1, type: 3}
    - {fileID: 6148105541944609538, guid: 7ebf995f2f8c2aa479aa05aec29ae6d1, type: 3}
    - {fileID: 9200238640206788070, guid: 7ebf995f2f8c2aa479aa05aec29ae6d1, type: 3}
    - {fileID: 5866028796149428683, guid: 7ebf995f2f8c2aa479aa05aec29ae6d1, type: 3}
    - {fileID: -1685358898804459016, guid: 7ebf995f2f8c2aa479aa05aec29ae6d1, type: 3}
    - {fileID: -6751380181678565474, guid: 7ebf995f2f8c2aa479aa05aec29ae6d1, type: 3}
  m_AnimationClipSettings:
    serializedVersion: 2
    m_AdditiveReferencePoseClip: {fileID: 0}
    m_AdditiveReferencePoseTime: 0
    m_StartTime: 0
    m_StopTime: 1
    m_OrientationOffsetY: 0
    m_Level: 0
    m_CycleOffset: 0
    m_HasAdditiveReferencePose: 0
    m_LoopTime: 1
    m_LoopBlend: 0
    m_LoopBlendOrientation: 0
    m_LoopBlendPositionY: 0
    m_LoopBlendPositionXZ: 0
    m_KeepOriginalOrientation: 0
    m_KeepOriginalPositionY: 1
    m_KeepOriginalPositionXZ: 0
    m_HeightFromFeet: 0
    m_Mirror: 0
  m_EditorCurves: []
  m_EulerEditorCurves: []
  m_HasGenericRootTransform: 0
  m_HasMotionFloatCurves: 0
  m_Events: []
