%!PS-Adobe-2.0 EPSF-2.0
%%Title: reprise_froid.fig
%%Creator: fig2dev Version 3.2 Patchlevel 4
%%CreationDate: Thu Mar 20 08:43:09 2008
%%For: Administrateur@Philippe (U-PHILIPPE\Administrateur,S-1-5-21-240424045-550034411-556413602-500)
%%BoundingBox: 0 0 199 125
%%Magnification: 1.0000
%%EndComments
/$F2psDict 200 dict def
$F2psDict begin
$F2psDict /mtrx matrix put
/col-1 {0 setgray} bind def
/col0 {0.000 0.000 0.000 srgb} bind def
/col1 {0.000 0.000 1.000 srgb} bind def
/col2 {0.000 1.000 0.000 srgb} bind def
/col3 {0.000 1.000 1.000 srgb} bind def
/col4 {1.000 0.000 0.000 srgb} bind def
/col5 {1.000 0.000 1.000 srgb} bind def
/col6 {1.000 1.000 0.000 srgb} bind def
/col7 {1.000 1.000 1.000 srgb} bind def
/col8 {0.000 0.000 0.560 srgb} bind def
/col9 {0.000 0.000 0.690 srgb} bind def
/col10 {0.000 0.000 0.820 srgb} bind def
/col11 {0.530 0.810 1.000 srgb} bind def
/col12 {0.000 0.560 0.000 srgb} bind def
/col13 {0.000 0.690 0.000 srgb} bind def
/col14 {0.000 0.820 0.000 srgb} bind def
/col15 {0.000 0.560 0.560 srgb} bind def
/col16 {0.000 0.690 0.690 srgb} bind def
/col17 {0.000 0.820 0.820 srgb} bind def
/col18 {0.560 0.000 0.000 srgb} bind def
/col19 {0.690 0.000 0.000 srgb} bind def
/col20 {0.820 0.000 0.000 srgb} bind def
/col21 {0.560 0.000 0.560 srgb} bind def
/col22 {0.690 0.000 0.690 srgb} bind def
/col23 {0.820 0.000 0.820 srgb} bind def
/col24 {0.500 0.190 0.000 srgb} bind def
/col25 {0.630 0.250 0.000 srgb} bind def
/col26 {0.750 0.380 0.000 srgb} bind def
/col27 {1.000 0.500 0.500 srgb} bind def
/col28 {1.000 0.630 0.630 srgb} bind def
/col29 {1.000 0.750 0.750 srgb} bind def
/col30 {1.000 0.880 0.880 srgb} bind def
/col31 {1.000 0.840 0.000 srgb} bind def

end
save
newpath 0 125 moveto 0 0 lineto 199 0 lineto 199 125 lineto closepath clip newpath
-25.0 131.2 translate
1 -1 scale

/cp {closepath} bind def
/ef {eofill} bind def
/gr {grestore} bind def
/gs {gsave} bind def
/sa {save} bind def
/rs {restore} bind def
/l {lineto} bind def
/m {moveto} bind def
/rm {rmoveto} bind def
/n {newpath} bind def
/s {stroke} bind def
/sh {show} bind def
/slc {setlinecap} bind def
/slj {setlinejoin} bind def
/slw {setlinewidth} bind def
/srgb {setrgbcolor} bind def
/rot {rotate} bind def
/sc {scale} bind def
/sd {setdash} bind def
/ff {findfont} bind def
/sf {setfont} bind def
/scf {scalefont} bind def
/sw {stringwidth} bind def
/tr {translate} bind def
/tnt {dup dup currentrgbcolor
  4 -2 roll dup 1 exch sub 3 -1 roll mul add
  4 -2 roll dup 1 exch sub 3 -1 roll mul add
  4 -2 roll dup 1 exch sub 3 -1 roll mul add srgb}
  bind def
/shd {dup dup currentrgbcolor 4 -2 roll mul 4 -2 roll mul
  4 -2 roll mul srgb} bind def
/reencdict 12 dict def /ReEncode { reencdict begin
/newcodesandnames exch def /newfontname exch def /basefontname exch def
/basefontdict basefontname findfont def /newfont basefontdict maxlength dict def
basefontdict { exch dup /FID ne { dup /Encoding eq
{ exch dup length array copy newfont 3 1 roll put }
{ exch newfont 3 1 roll put } ifelse } { pop pop } ifelse } forall
newfont /FontName newfontname put newcodesandnames aload pop
128 1 255 { newfont /Encoding get exch /.notdef put } for
newcodesandnames length 2 idiv { newfont /Encoding get 3 1 roll put } repeat
newfontname newfont definefont pop end } def
/isovec [
8#055 /minus 8#200 /grave 8#201 /acute 8#202 /circumflex 8#203 /tilde
8#204 /macron 8#205 /breve 8#206 /dotaccent 8#207 /dieresis
8#210 /ring 8#211 /cedilla 8#212 /hungarumlaut 8#213 /ogonek 8#214 /caron
8#220 /dotlessi 8#230 /oe 8#231 /OE
8#240 /space 8#241 /exclamdown 8#242 /cent 8#243 /sterling
8#244 /currency 8#245 /yen 8#246 /brokenbar 8#247 /section 8#250 /dieresis
8#251 /copyright 8#252 /ordfeminine 8#253 /guillemotleft 8#254 /logicalnot
8#255 /hyphen 8#256 /registered 8#257 /macron 8#260 /degree 8#261 /plusminus
8#262 /twosuperior 8#263 /threesuperior 8#264 /acute 8#265 /mu 8#266 /paragraph
8#267 /periodcentered 8#270 /cedilla 8#271 /onesuperior 8#272 /ordmasculine
8#273 /guillemotright 8#274 /onequarter 8#275 /onehalf
8#276 /threequarters 8#277 /questiondown 8#300 /Agrave 8#301 /Aacute
8#302 /Acircumflex 8#303 /Atilde 8#304 /Adieresis 8#305 /Aring
8#306 /AE 8#307 /Ccedilla 8#310 /Egrave 8#311 /Eacute
8#312 /Ecircumflex 8#313 /Edieresis 8#314 /Igrave 8#315 /Iacute
8#316 /Icircumflex 8#317 /Idieresis 8#320 /Eth 8#321 /Ntilde 8#322 /Ograve
8#323 /Oacute 8#324 /Ocircumflex 8#325 /Otilde 8#326 /Odieresis 8#327 /multiply
8#330 /Oslash 8#331 /Ugrave 8#332 /Uacute 8#333 /Ucircumflex
8#334 /Udieresis 8#335 /Yacute 8#336 /Thorn 8#337 /germandbls 8#340 /agrave
8#341 /aacute 8#342 /acircumflex 8#343 /atilde 8#344 /adieresis 8#345 /aring
8#346 /ae 8#347 /ccedilla 8#350 /egrave 8#351 /eacute
8#352 /ecircumflex 8#353 /edieresis 8#354 /igrave 8#355 /iacute
8#356 /icircumflex 8#357 /idieresis 8#360 /eth 8#361 /ntilde 8#362 /ograve
8#363 /oacute 8#364 /ocircumflex 8#365 /otilde 8#366 /odieresis 8#367 /divide
8#370 /oslash 8#371 /ugrave 8#372 /uacute 8#373 /ucircumflex
8#374 /udieresis 8#375 /yacute 8#376 /thorn 8#377 /ydieresis] def
/Times-Italic /Times-Italic-iso isovec ReEncode
/Times-Roman /Times-Roman-iso isovec ReEncode
/$F2psBegin {$F2psDict begin /$F2psEnteredState save def} def
/$F2psEnd {$F2psEnteredState restore end} def

$F2psBegin
10 setmiterlimit
0 slj 0 slc
 0.06000 0.06000 sc
%
% Fig objects follow
%
% 
% here starts figure with depth 50
/Times-Roman-iso ff 150.00 scf sf
525 1725 m
gs 1 -1 sc  90.0 rot (Fichiers journaux) col0 sh gr
% Polyline
7.500 slw
n 750 300 m 1050 300 l 1050 600 l 750 600 l
 cp gs col0 s gr 
% Polyline
n 750 1200 m 1050 1200 l 1050 1500 l 750 1500 l
 cp gs col0 s gr 
% Polyline
n 750 1650 m 1050 1650 l 1050 1950 l 750 1950 l
 cp gs col0 s gr 
% Polyline
gs  clippath
2280 435 m 2220 435 l 2220 552 l 2250 462 l 2280 552 l cp
eoclip
n 2250 1800 m
 2250 450 l gs col0 s gr gr

% arrowhead
n 2280 552 m 2250 462 l 2220 552 l 2250 582 l 2280 552 l 
 cp gs 0.00 setgray ef gr  col0 s
% Polyline
 [15 15] 15 sd
gs  clippath
3180 135 m 3120 135 l 3120 252 l 3150 162 l 3180 252 l cp
eoclip
n 3150 1875 m
 3150 150 l gs col0 s gr gr
 [] 0 sd
% arrowhead
n 3180 252 m 3150 162 l 3120 252 l 3150 282 l 3180 252 l 
 cp gs 0.00 setgray ef gr  col0 s
% Polyline
 [15 15] 15 sd
n 2325 450 m
 3150 450 l gs col0 s gr  [] 0 sd
% Polyline
n 900 1500 m
 900 1650 l gs col0 s gr 
% Polyline
n 900 1050 m
 900 1200 l gs col0 s gr 
% Polyline
n 900 600 m
 900 750 l gs col0 s gr 
% Polyline
 [15 15] 15 sd
n 900 1950 m
 900 2175 l gs col0 s gr  [] 0 sd
% Polyline
2 slj
n 2350 1775 m 2390 1775 l 2430 1776 l 2469 1777 l 2508 1779 l 2547 1781 l
 2586 1783 l 2624 1787 l 2661 1790 l 2697 1794 l 2733 1799 l
 2766 1803 l 2798 1809 l 2828 1814 l 2855 1820 l 2880 1826 l
 2902 1833 l 2922 1839 l 2938 1846 l 2952 1853 l 2963 1859 l
 2970 1866 l 2975 1873 l 2976 1880 l 2975 1888 l 2971 1894 l
 2965 1901 l 2956 1908 l 2944 1915 l 2930 1922 l 2913 1929 l
 2894 1936 l 2872 1944 l 2848 1951 l 2821 1958 l 2793 1965 l
 2762 1972 l 2730 1979 l 2696 1985 l 2661 1991 l 2625 1997 l
 2588 2002 l 2551 2007 l 2513 2011 l 2475 2015 l 2437 2018 l
 2399 2020 l 2362 2022 l 2324 2024 l 2287 2025 l 2250 2025 l
 2213 2025 l 2176 2024 l 2138 2022 l 2101 2020 l 2063 2018 l
 2026 2015 l 1988 2011 l 1951 2007 l 1914 2002 l 1878 1997 l
 1843 1991 l 1809 1985 l 1777 1979 l 1746 1972 l 1718 1965 l
 1692 1958 l 1668 1951 l 1646 1944 l 1627 1936 l 1611 1929 l
 1598 1922 l 1588 1915 l 1580 1908 l 1576 1901 l 1574 1894 l
 1575 1888 l 1579 1881 l 1586 1874 l 1596 1868 l 1609 1862 l
 1625 1855 l 1643 1849 l 1665 1843 l 1689 1837 l 1716 1831 l
 1745 1825 l 1776 1819 l 1810 1814 l 1845 1809 l 1882 1804 l
 1920 1799 l 1959 1795 l 1998 1791 l 2038 1788 l 2079 1785 l
 2119 1782 l 2158 1780 l 2198 1778 l 2237 1777 l 2275 1776 l
 2313 1775 l
 cp gs col0 s gr 
/Times-Italic-iso ff 150.00 scf sf
3225 225 m
gs 1 -1 sc (temps) col0 sh gr
/Times-Italic-iso ff 150.00 scf sf
3225 1950 m
gs 1 -1 sc (15 mars) col0 sh gr
/Times-Italic-iso ff 150.00 scf sf
3225 525 m
gs 1 -1 sc (18 mars) col0 sh gr
/Times-Italic-iso ff 150.00 scf sf
2100 375 m
gs 1 -1 sc (panne) col0 sh gr
/Times-Italic-iso ff 150.00 scf sf
2325 1125 m
gs 1 -1 sc (mises  \340 jour) col0 sh gr
/Times-Italic-iso ff 150.00 scf sf
1950 1950 m
gs 1 -1 sc (sauvegarde) col0 sh gr
/Times-Roman-iso ff 150.00 scf sf
825 1875 m
gs 1 -1 sc (15) col0 sh gr
/Times-Roman-iso ff 150.00 scf sf
825 1425 m
gs 1 -1 sc (16) col0 sh gr
/Times-Roman-iso ff 150.00 scf sf
825 975 m
gs 1 -1 sc (17) col0 sh gr
/Times-Roman-iso ff 150.00 scf sf
825 525 m
gs 1 -1 sc (18) col0 sh gr
% Polyline
0 slj
n 750 750 m 1050 750 l 1050 1050 l 750 1050 l
 cp gs col0 s gr 
% here ends figure;
$F2psEnd
rs
showpage
