\boolfalse {citerequest}\boolfalse {citetracker}\boolfalse {pagetracker}\boolfalse {backtracker}\relax 
\babel@toc {french}{}
\addvspace {10\p@ }
\contentsline {table}{\numberline {\relax 1.1}{\ignorespaces Comparaison des diff\IeC {\'e}rentes repr\IeC {\'e}sentations (sur $n$ bits).\relax }}{25}{table.caption.19}% 
