#FIG 3.2  Produced by xfig version 3.2.5-alpha5
Portrait
Center
Inches
A4      
100.00
Single
-2
1200 2
5 1 0 1 0 7 50 -1 -1 0.000 0 0 1 0 7762.500 3412.500 7725 3150 8025 3375 7800 3675
	1 1 1.00 60.00 120.00
5 1 0 1 0 7 50 -1 -1 0.000 0 0 1 0 7612.500 3412.500 7650 3675 7350 3450 7650 3150
	1 1 1.00 60.00 120.00
5 1 0 1 0 7 50 -1 -1 0.000 0 0 1 0 4012.500 3412.500 3975 3150 4275 3375 4050 3675
	1 1 1.00 60.00 120.00
5 1 0 1 0 7 50 -1 -1 0.000 0 0 1 0 3862.500 3412.500 3900 3675 3600 3450 3900 3150
	1 1 1.00 60.00 120.00
5 1 0 1 0 7 50 -1 -1 0.000 0 0 1 0 2925.000 3084.375 2400 2775 2925 2475 3450 2775
	1 1 1.00 60.00 120.00
5 1 0 1 0 7 50 -1 -1 0.000 0 0 1 0 2925.000 2465.625 3450 2775 2925 3075 2400 2775
	1 1 1.00 60.00 120.00
6 7275 3600 8175 4350
1 1 0 1 -1 -1 0 0 -1 0.000 1 0.0000 7725 3675 449 74 7725 3675 8174 3749
1 1 0 1 -1 -1 0 0 -1 0.000 1 0.0000 7725 4275 449 74 7725 4275 8174 4349
2 1 0 1 0 7 50 -1 -1 0.000 0 0 -1 0 0 2
	 7275 3675 7275 4275
2 1 0 1 0 7 50 -1 -1 0.000 0 0 -1 0 0 2
	 8175 3675 8175 4275
-6
6 3525 3600 4425 4350
1 1 0 1 -1 -1 0 0 -1 0.000 1 0.0000 3975 3675 449 74 3975 3675 4424 3749
1 1 0 1 -1 -1 0 0 -1 0.000 1 0.0000 3975 4275 449 74 3975 4275 4424 4349
2 1 0 1 0 7 50 -1 -1 0.000 0 0 -1 0 0 2
	 3525 3675 3525 4275
2 1 0 1 0 7 50 -1 -1 0.000 0 0 -1 0 0 2
	 4425 3675 4425 4275
-6
2 4 0 1 0 7 50 -1 -1 0.000 0 0 7 0 0 5
	 2400 3225 2400 2400 1425 2400 1425 3225 2400 3225
2 4 0 1 0 7 50 -1 -1 0.000 0 0 7 0 0 5
	 4350 3150 4350 2400 3450 2400 3450 3150 4350 3150
2 1 0 1 0 7 50 -1 -1 1.000 0 0 7 0 0 2
	 4800 2100 4800 4725
2 4 0 1 0 7 50 -1 -1 0.000 0 0 7 0 0 5
	 6000 3225 6000 2400 5025 2400 5025 3225 6000 3225
2 4 0 1 0 7 50 -1 -1 1.000 0 0 7 0 0 5
	 8100 3150 8100 2400 7200 2400 7200 3150 8100 3150
2 1 0 1 0 7 50 -1 -1 1.000 0 0 -1 1 0 2
	1 1 1.00 60.00 120.00
	 6000 2700 7200 2700
4 0 0 50 -1 0 10 0.0000 4 150 2745 1500 4650 Communications avec un programme externe\001
4 0 0 50 -1 0 10 0.0000 4 105 195 7650 4050 BD\001
4 0 0 50 -1 0 10 0.0000 4 120 360 7500 3450 Acc\350s\001
4 0 0 50 -1 0 10 0.0000 4 165 555 2625 2400 Requ\352tes\001
4 0 0 50 -1 0 10 0.0000 4 120 600 2625 3300 R\351sultats\001
4 0 0 50 -1 0 10 0.0000 4 120 360 3750 3450 Acc\350s\001
4 0 0 50 -1 0 10 0.0000 4 105 795 1500 2700 Connexion +\001
4 0 0 50 -1 0 10 0.0000 4 105 630 1575 2925 succession\001
4 0 0 50 -1 0 10 0.0000 4 135 795 1500 3150 d'ordres SQL\001
4 0 0 50 -1 0 10 0.0000 4 135 570 3600 2700 analyse +\001
4 0 0 50 -1 0 10 0.0000 4 150 750 3525 2925 compilation\001
4 0 0 50 -1 0 10 0.0000 4 165 2685 5175 4650 Communications avec une proc\351dure stock\351e\001
4 0 0 50 -1 0 10 0.0000 4 105 795 5100 2700 Connexion +\001
4 0 0 50 -1 0 10 0.0000 4 150 330 5100 2925 appel\001
4 0 0 50 -1 0 10 0.0000 4 165 600 5100 3150 proc\351dure\001
4 0 10 50 -1 2 10 0.0000 4 105 420 1725 2325 Client\001
4 0 10 50 -1 2 10 0.0000 4 105 510 3675 2325 Serveur\001
4 0 10 50 -1 2 10 0.0000 4 105 420 5250 2325 Client\001
4 0 10 50 -1 2 10 0.0000 4 105 510 7425 2325 Serveur\001
4 0 10 50 -1 2 10 0.0000 4 120 465 2700 2850 R\351seau\001
4 0 10 50 -1 2 10 0.0000 4 105 225 3900 4050 BD\001
4 0 0 50 -1 0 10 0.0000 4 120 510 7350 3000   stock\351e\001
4 0 0 50 -1 0 10 0.0000 4 165 600 7425 2775 proc\351dure\001
4 0 0 50 -1 0 10 0.0000 4 150 390 6375 2625 Appel\001
4 0 10 50 -1 2 10 0.0000 4 120 465 6375 3000 R\351seau\001
