#FIG 3.2  Produced by xfig version 3.2.5-alpha5
Landscape
Center
Metric
A4      
100.00
Single
-2
1200 2
6 225 765 1035 1215
1 2 0 1 0 7 100 0 -1 0.000 1 0.0000 630 1035 405 90 225 945 1035 1125
1 2 0 1 0 7 100 0 -1 0.000 1 0.0000 630 945 405 90 225 855 1035 1035
1 2 0 1 0 7 100 0 -1 0.000 1 0.0000 630 855 405 90 225 765 1035 945
1 2 0 1 0 7 100 0 -1 0.000 1 0.0000 630 1125 405 90 225 1035 1035 1215
-6
6 1980 315 4275 1620
6 2205 585 4095 720
2 2 0 1 0 7 100 0 -1 0.000 0 0 -1 0 0 5
	 2205 585 4095 585 4095 720 2205 720 2205 585
2 1 0 1 0 7 100 0 -1 0.000 0 0 -1 0 0 2
	 2430 585 2430 720
2 1 0 1 0 7 100 0 -1 0.000 0 0 -1 0 0 2
	 2655 585 2655 720
2 1 0 1 0 7 100 0 -1 0.000 0 0 -1 0 0 2
	 2880 585 2880 720
2 1 0 1 0 7 100 0 -1 0.000 0 0 -1 0 0 2
	 3105 585 3105 720
2 1 0 1 0 7 100 0 -1 0.000 0 0 -1 0 0 2
	 3330 585 3330 720
2 1 0 1 0 7 100 0 -1 0.000 0 0 -1 0 0 2
	 3555 585 3555 720
2 1 0 1 0 7 100 0 -1 0.000 0 0 -1 0 0 2
	 3780 585 3780 720
-6
2 4 0 1 0 7 100 0 -1 0.000 0 0 7 0 0 5
	 2475 1080 2475 900 2205 900 2205 1080 2475 1080
2 4 0 1 0 7 100 0 -1 0.000 0 0 7 0 0 5
	 2475 1395 2475 1215 2205 1215 2205 1395 2475 1395
2 4 0 1 0 7 100 0 -1 0.000 0 0 7 0 0 5
	 3150 1080 3150 900 2880 900 2880 1080 3150 1080
2 4 0 1 0 7 100 0 -1 0.000 0 0 7 0 0 5
	 3780 1080 3780 900 3510 900 3510 1080 3780 1080
2 1 0 1 0 7 100 0 -1 0.000 0 0 -1 0 0 2
	 2340 720 2340 900
2 1 0 1 0 7 100 0 -1 0.000 0 0 -1 0 0 2
	 2340 1080 2340 1215
2 1 0 1 0 7 100 0 -1 0.000 0 0 -1 0 0 2
	 2970 720 2970 900
2 1 0 1 0 7 100 0 -1 0.000 0 0 -1 0 0 2
	 3645 720 3645 900
2 4 0 1 0 7 100 0 -1 0.000 0 0 7 0 0 5
	 4275 1620 4275 315 1980 315 1980 1620 4275 1620
4 0 0 100 0 0 10 0.0000 4 135 1005 2700 495 Table de hachage\001
-6
6 3645 1215 4230 1575
4 0 0 100 0 0 10 0.0000 4 120 570 3645 1350 M\351moire\001
4 0 0 100 0 0 10 0.0000 4 105 495 3645 1545 centrale\001
-6
2 1 0 1 0 7 100 0 -1 0.000 0 0 -1 1 0 2
	1 1 1.00 60.00 120.00
	 5220 1080 4275 1080
2 1 0 1 0 7 100 0 -1 0.000 0 0 -1 1 0 2
	1 1 1.00 60.00 120.00
	 1980 1035 1170 1035
4 0 0 100 0 0 10 0.0000 4 120 1860 2115 225 Gestionnaire de m\351moire cache\001
4 0 0 100 0 0 10 0.0000 4 150 960 4410 945 Lecture logique\001
4 0 0 100 0 0 10 0.0000 4 105 330 2565 1035 blocs\001
4 0 0 100 0 0 10 0.0000 4 105 495 1350 720 Lecture \001
4 0 0 100 0 0 10 0.0000 4 150 540 1350 915 physique\001
