\relax 
\providecommand\hyper@newdestlabel[2]{}
\@writefile{toc}{\contentsline {chapter}{\numberline {1}Leçon 1 -- Introduction: Qu'est-ce qu'un ordinateur ?}{17}{chapter.1}\protected@file@percent }
\@writefile{lof}{\addvspace {10\p@ }}
\@writefile{lot}{\addvspace {10\p@ }}
\@writefile{lol}{\addvspace {10\p@ }}
\newlabel{cha:intro}{{1}{17}{Leçon 1 -- Introduction: Qu'est-ce qu'un ordinateur ?}{chapter.1}{}}
\@writefile{toc}{\contentsline {section}{\numberline {1.1}Définitions et étymologie}{17}{section.1.1}\protected@file@percent }
\@writefile{lof}{\contentsline {figure}{\numberline {\relax 1.1}{\ignorespaces Lettre de J. \textsc  {Perret}.}}{18}{figure.caption.6}\protected@file@percent }
\providecommand*\caption@xref[2]{\@setref\relax\@undefined{#1}}
\newlabel{fig:lettre}{{\relax 1.1}{18}{Lettre de J. \textsc {Perret}}{figure.caption.6}{}}
\@writefile{toc}{\contentsline {section}{\numberline {1.2}Un premier modèle: l'architecture de \textsc  {von Neumann}}{19}{section.1.2}\protected@file@percent }
\@writefile{lol}{\contentsline {lstlisting}{chapters/01\textendash exemple.py}{20}{lstlisting.1.-1}\protected@file@percent }
\@writefile{lof}{\contentsline {figure}{\numberline {\relax 1.2}{\ignorespaces Un exemple de programme écrit en langage Python.\relax }}{20}{figure.caption.7}\protected@file@percent }
\newlabel{fig:ex-prog}{{\relax 1.2}{20}{Un exemple de programme écrit en langage Python.\relax }{figure.caption.7}{}}
\newlabel{fig:vonneumann}{{\caption@xref {fig:vonneumann}{ on input line 204}}{21}{Un premier modèle: l'architecture de \textsc {von Neumann}}{figure.caption.8}{}}
\@writefile{lof}{\contentsline {figure}{\numberline {\relax 1.3}{\ignorespaces L'architecture \textsc  {von Neumann}, un premier modèle d'ordinateur.\relax }}{23}{figure.caption.9}\protected@file@percent }
\newlabel{fig:vnarch}{{\relax 1.3}{23}{L'architecture \textsc {von Neumann}, un premier modèle d'ordinateur.\relax }{figure.caption.9}{}}
\@writefile{toc}{\contentsline {section}{\numberline {1.3}Une vision différente: structure en niveaux et traductions}{24}{section.1.3}\protected@file@percent }
\newlabel{sec:une-visi-diff}{{1.3}{24}{Une vision différente: structure en niveaux et traductions}{section.1.3}{}}
\@writefile{toc}{\contentsline {paragraph}{\nonumberline Différents niveaux}{24}{section*.11}\protected@file@percent }
\newlabel{RF1}{25}
\@writefile{lof}{\contentsline {figure}{\numberline {\relax 1.4}{\ignorespaces L'architecture de l'i486}}{25}{figure.caption.10}\protected@file@percent }
\newlabel{fig:i486-arch}{{\relax 1.4}{25}{L'architecture de l'i486}{figure.caption.10}{}}
\@writefile{toc}{\contentsline {paragraph}{\nonumberline Interprétation et Compilation}{27}{section*.12}\protected@file@percent }
\@writefile{toc}{\contentsline {paragraph}{\nonumberline Matériel et logiciel}{27}{section*.13}\protected@file@percent }
\@writefile{lof}{\contentsline {figure}{\numberline {\relax 1.5}{\ignorespaces Les 6 couches décrivant le fonctionnement d'un ordinateur.\relax }}{28}{figure.caption.14}\protected@file@percent }
\newlabel{fig:couches}{{\relax 1.5}{28}{Les 6 couches décrivant le fonctionnement d'un ordinateur.\relax }{figure.caption.14}{}}
\@setckpt{chapters/01-introduction}{
\setcounter{page}{29}
\setcounter{equation}{0}
\setcounter{enumi}{3}
\setcounter{enumii}{0}
\setcounter{enumiii}{0}
\setcounter{enumiv}{0}
\setcounter{footnote}{5}
\setcounter{mpfootnote}{0}
\setcounter{part}{1}
\setcounter{chapter}{1}
\setcounter{section}{3}
\setcounter{subsection}{0}
\setcounter{subsubsection}{0}
\setcounter{paragraph}{0}
\setcounter{subparagraph}{0}
\setcounter{figure}{5}
\setcounter{table}{0}
\setcounter{FBcaption@count}{0}
\setcounter{parentequation}{0}
\setcounter{lstnumber}{1}
\setcounter{exo}{0}
\setcounter{exercice}{0}
\setcounter{questnum}{0}
\setcounter{Item}{18}
\setcounter{Hfootnote}{5}
\setcounter{Hy@AnnotLevel}{0}
\setcounter{bookmark@seq@number}{0}
\setcounter{r@tfl@t}{1}
\setcounter{tabx@nest}{0}
\setcounter{listtotal}{0}
\setcounter{listcount}{0}
\setcounter{liststart}{0}
\setcounter{liststop}{0}
\setcounter{citecount}{0}
\setcounter{citetotal}{0}
\setcounter{multicitecount}{0}
\setcounter{multicitetotal}{0}
\setcounter{instcount}{9}
\setcounter{maxnames}{3}
\setcounter{minnames}{1}
\setcounter{maxitems}{3}
\setcounter{minitems}{1}
\setcounter{citecounter}{0}
\setcounter{maxcitecounter}{0}
\setcounter{savedcitecounter}{0}
\setcounter{uniquelist}{0}
\setcounter{uniquename}{0}
\setcounter{refsection}{0}
\setcounter{refsegment}{0}
\setcounter{maxextratitle}{0}
\setcounter{maxextratitleyear}{0}
\setcounter{maxextraname}{2}
\setcounter{maxextradate}{0}
\setcounter{maxextraalpha}{0}
\setcounter{abbrvpenalty}{50}
\setcounter{highnamepenalty}{50}
\setcounter{lownamepenalty}{25}
\setcounter{maxparens}{3}
\setcounter{parenlevel}{0}
\setcounter{mincomprange}{10}
\setcounter{maxcomprange}{100000}
\setcounter{mincompwidth}{1}
\setcounter{afterword}{0}
\setcounter{savedafterword}{0}
\setcounter{annotator}{0}
\setcounter{savedannotator}{0}
\setcounter{author}{0}
\setcounter{savedauthor}{0}
\setcounter{bookauthor}{0}
\setcounter{savedbookauthor}{0}
\setcounter{commentator}{0}
\setcounter{savedcommentator}{0}
\setcounter{editor}{0}
\setcounter{savededitor}{0}
\setcounter{editora}{0}
\setcounter{savededitora}{0}
\setcounter{editorb}{0}
\setcounter{savededitorb}{0}
\setcounter{editorc}{0}
\setcounter{savededitorc}{0}
\setcounter{foreword}{0}
\setcounter{savedforeword}{0}
\setcounter{holder}{0}
\setcounter{savedholder}{0}
\setcounter{introduction}{0}
\setcounter{savedintroduction}{0}
\setcounter{namea}{0}
\setcounter{savednamea}{0}
\setcounter{nameb}{0}
\setcounter{savednameb}{0}
\setcounter{namec}{0}
\setcounter{savednamec}{0}
\setcounter{translator}{0}
\setcounter{savedtranslator}{0}
\setcounter{shortauthor}{0}
\setcounter{savedshortauthor}{0}
\setcounter{shorteditor}{0}
\setcounter{savedshorteditor}{0}
\setcounter{labelname}{0}
\setcounter{savedlabelname}{0}
\setcounter{institution}{0}
\setcounter{savedinstitution}{0}
\setcounter{lista}{0}
\setcounter{savedlista}{0}
\setcounter{listb}{0}
\setcounter{savedlistb}{0}
\setcounter{listc}{0}
\setcounter{savedlistc}{0}
\setcounter{listd}{0}
\setcounter{savedlistd}{0}
\setcounter{liste}{0}
\setcounter{savedliste}{0}
\setcounter{listf}{0}
\setcounter{savedlistf}{0}
\setcounter{location}{0}
\setcounter{savedlocation}{0}
\setcounter{organization}{0}
\setcounter{savedorganization}{0}
\setcounter{origlocation}{0}
\setcounter{savedoriglocation}{0}
\setcounter{origpublisher}{0}
\setcounter{savedorigpublisher}{0}
\setcounter{publisher}{0}
\setcounter{savedpublisher}{0}
\setcounter{language}{0}
\setcounter{savedlanguage}{0}
\setcounter{origlanguage}{0}
\setcounter{savedoriglanguage}{0}
\setcounter{pageref}{0}
\setcounter{savedpageref}{0}
\setcounter{textcitecount}{0}
\setcounter{textcitetotal}{0}
\setcounter{textcitemaxnames}{0}
\setcounter{biburlnumpenalty}{0}
\setcounter{biburlucpenalty}{0}
\setcounter{biburllcpenalty}{0}
\setcounter{smartand}{1}
\setcounter{bbx:relatedcount}{0}
\setcounter{bbx:relatedtotal}{0}
\setcounter{ifsymcnt}{0}
\setcounter{caption@flags}{0}
\setcounter{ContinuedFloat}{0}
\setcounter{@todonotes@numberoftodonotes}{0}
\setcounter{tikztiming@nrows}{0}
\setcounter{tikztimingrows}{0}
\setcounter{tikztimingtrans}{0}
\setcounter{tikztimingtranspos}{0}
\setcounter{theorem}{0}
\setcounter{lstlisting}{0}
\setcounter{section@level}{4}
}
