%!PS-Adobe-2.0 EPSF-2.0
%%Title: sortmerge.eps
%%Creator: fig2dev Version 3.2.3 Patchlevel 
%%CreationDate: Thu May  9 23:08:17 2002
%%For: rigaux@cartier (Philippe Rigaux)
%%BoundingBox: 0 0 269 245
%%Magnification: 1.0000
%%EndComments
/$F2psDict 200 dict def
$F2psDict begin
$F2psDict /mtrx matrix put
/col-1 {0 setgray} bind def
/col0 {0.000 0.000 0.000 srgb} bind def
/col1 {0.000 0.000 1.000 srgb} bind def
/col2 {0.000 1.000 0.000 srgb} bind def
/col3 {0.000 1.000 1.000 srgb} bind def
/col4 {1.000 0.000 0.000 srgb} bind def
/col5 {1.000 0.000 1.000 srgb} bind def
/col6 {1.000 1.000 0.000 srgb} bind def
/col7 {1.000 1.000 1.000 srgb} bind def
/col8 {0.000 0.000 0.560 srgb} bind def
/col9 {0.000 0.000 0.690 srgb} bind def
/col10 {0.000 0.000 0.820 srgb} bind def
/col11 {0.530 0.810 1.000 srgb} bind def
/col12 {0.000 0.560 0.000 srgb} bind def
/col13 {0.000 0.690 0.000 srgb} bind def
/col14 {0.000 0.820 0.000 srgb} bind def
/col15 {0.000 0.560 0.560 srgb} bind def
/col16 {0.000 0.690 0.690 srgb} bind def
/col17 {0.000 0.820 0.820 srgb} bind def
/col18 {0.560 0.000 0.000 srgb} bind def
/col19 {0.690 0.000 0.000 srgb} bind def
/col20 {0.820 0.000 0.000 srgb} bind def
/col21 {0.560 0.000 0.560 srgb} bind def
/col22 {0.690 0.000 0.690 srgb} bind def
/col23 {0.820 0.000 0.820 srgb} bind def
/col24 {0.500 0.190 0.000 srgb} bind def
/col25 {0.630 0.250 0.000 srgb} bind def
/col26 {0.750 0.380 0.000 srgb} bind def
/col27 {1.000 0.500 0.500 srgb} bind def
/col28 {1.000 0.630 0.630 srgb} bind def
/col29 {1.000 0.750 0.750 srgb} bind def
/col30 {1.000 0.880 0.880 srgb} bind def
/col31 {1.000 0.840 0.000 srgb} bind def

end
save
newpath 0 245 moveto 0 0 lineto 269 0 lineto 269 245 lineto closepath clip newpath
-49.0 252.0 translate
1 -1 scale

/cp {closepath} bind def
/ef {eofill} bind def
/gr {grestore} bind def
/gs {gsave} bind def
/sa {save} bind def
/rs {restore} bind def
/l {lineto} bind def
/m {moveto} bind def
/rm {rmoveto} bind def
/n {newpath} bind def
/s {stroke} bind def
/sh {show} bind def
/slc {setlinecap} bind def
/slj {setlinejoin} bind def
/slw {setlinewidth} bind def
/srgb {setrgbcolor} bind def
/rot {rotate} bind def
/sc {scale} bind def
/sd {setdash} bind def
/ff {findfont} bind def
/sf {setfont} bind def
/scf {scalefont} bind def
/sw {stringwidth} bind def
/tr {translate} bind def
/tnt {dup dup currentrgbcolor
  4 -2 roll dup 1 exch sub 3 -1 roll mul add
  4 -2 roll dup 1 exch sub 3 -1 roll mul add
  4 -2 roll dup 1 exch sub 3 -1 roll mul add srgb}
  bind def
/shd {dup dup currentrgbcolor 4 -2 roll mul 4 -2 roll mul
  4 -2 roll mul srgb} bind def
 /DrawEllipse {
	/endangle exch def
	/startangle exch def
	/yrad exch def
	/xrad exch def
	/y exch def
	/x exch def
	/savematrix mtrx currentmatrix def
	x y tr xrad yrad sc 0 0 1 startangle endangle arc
	closepath
	savematrix setmatrix
	} def

/$F2psBegin {$F2psDict begin /$F2psEnteredState save def} def
/$F2psEnd {$F2psEnteredState restore end} def

$F2psBegin
%%Page: 1 1
10 setmiterlimit
 0.06000 0.06000 sc
/Times-Italic ff 150.00 scf sf
4425 3900 m
gs 1 -1 sc (TRI) col0 sh gr
/Times-Italic ff 150.00 scf sf
1275 3900 m
gs 1 -1 sc (TRI) col0 sh gr
/Times-Italic ff 150.00 scf sf
2475 225 m
gs 1 -1 sc (Allen Annie Hall        1977) col0 sh gr
/Times-Italic ff 150.00 scf sf
2400 450 m
gs 1 -1 sc (Spielberg Jurassic Park  1992) col0 sh gr
/Times-Italic ff 150.00 scf sf
2475 675 m
gs 1 -1 sc (Allen Manhattan        1979) col0 sh gr
/Times-Italic ff 150.00 scf sf
3075 1425 m
gs 1 -1 sc (FUSION) col0 sh gr
/Times-Italic ff 150.00 scf sf
900 1800 m
gs 1 -1 sc (Allen                Annie Hall) col0 sh gr
/Times-Italic ff 150.00 scf sf
825 2475 m
gs 1 -1 sc (Lang                Metropolis) col0 sh gr
/Times-Italic ff 150.00 scf sf
825 2700 m
gs 1 -1 sc (Hitchcock       Psychose) col0 sh gr
/Times-Italic ff 150.00 scf sf
825 2025 m
gs 1 -1 sc (Spielberg        Jurassic Park) col0 sh gr
/Times-Italic ff 150.00 scf sf
825 2250 m
gs 1 -1 sc ( Allen                Manhattan) col0 sh gr
/Times-Italic ff 150.00 scf sf
825 2925 m
gs 1 -1 sc (Kubrik             Shining) col0 sh gr
/Times-Italic ff 150.00 scf sf
825 3150 m
gs 1 -1 sc (Hitchcock        Vertigo) col0 sh gr
/Times-Italic ff 150.00 scf sf
4050 1800 m
gs 1 -1 sc (Annie Hall        1977) col0 sh gr
/Times-Italic ff 150.00 scf sf
4050 2025 m
gs 1 -1 sc (Brazil                1984) col0 sh gr
/Times-Italic ff 150.00 scf sf
4050 2250 m
gs 1 -1 sc (Easy Rider   1969) col0 sh gr
/Times-Italic ff 150.00 scf sf
4050 2475 m
gs 1 -1 sc (Greystoke     1984) col0 sh gr
/Times-Italic ff 150.00 scf sf
4050 2700 m
gs 1 -1 sc (Jurassic Park  1992) col0 sh gr
/Times-Italic ff 150.00 scf sf
4050 2925 m
gs 1 -1 sc (Manhattan   1979) col0 sh gr
/Times-Italic ff 150.00 scf sf
4050 3150 m
gs 1 -1 sc (Metropolis    1926) col0 sh gr
/Times-Italic ff 150.00 scf sf
4050 3375 m
gs 1 -1 sc (Psychose       1960) col0 sh gr
/Times-Italic ff 150.00 scf sf
1050 4200 m
gs 1 -1 sc (Fichiers Artistes) col0 sh gr
/Times-Italic ff 150.00 scf sf
4200 4200 m
gs 1 -1 sc (Fichier films) col0 sh gr
7.500 slw
% Ellipse
n 4575 3825 449 149 0 360 DrawEllipse gs col-1 s gr

% Polyline
gs  clippath
4605 3436 m 4545 3436 l 4545 3587 l 4575 3467 l 4605 3587 l cp
eoclip
n 4575 3676 m
 4575 3451 l gs col-1 s gr gr

% arrowhead
n 4605 3587 m 4575 3467 l 4545 3587 l 4605 3587 l  cp gs 0.00 setgray ef gr  col-1 s
% Ellipse
n 1425 3825 449 149 0 360 DrawEllipse gs col-1 s gr

% Polyline
gs  clippath
1455 3436 m 1395 3436 l 1395 3587 l 1425 3467 l 1455 3587 l cp
eoclip
n 1425 3676 m
 1425 3451 l gs col-1 s gr gr

% arrowhead
n 1455 3587 m 1425 3467 l 1395 3587 l 1455 3587 l  cp gs 0.00 setgray ef gr  col-1 s
% Ellipse
n 3300 1350 449 149 0 360 DrawEllipse gs col-1 s gr

% Polyline
gs  clippath
2876 1370 m 2850 1316 l 2715 1383 l 2836 1357 l 2742 1437 l cp
eoclip
n 2250 1650 m
 2850 1350 l gs col-1 s gr gr

% arrowhead
n 2742 1437 m 2836 1357 l 2715 1383 l 2742 1437 l  cp gs 0.00 setgray ef gr  col-1 s
% Polyline
gs  clippath
3745 1316 m 3726 1373 l 3869 1421 l 3765 1355 l 3888 1364 l cp
eoclip
n 3750 1350 m
 4425 1575 l gs col-1 s gr gr

% arrowhead
n 3888 1364 m 3765 1355 l 3869 1421 l 3888 1364 l  cp gs 0.00 setgray ef gr  col-1 s
% Polyline
gs  clippath
3331 961 m 3271 961 l 3271 1112 l 3301 992 l 3331 1112 l cp
eoclip
n 3301 1201 m
 3301 976 l gs col-1 s gr gr

% arrowhead
n 3331 1112 m 3301 992 l 3271 1112 l 3331 1112 l  cp gs 0.00 setgray ef gr  col-1 s
/Times-Roman ff 180.00 scf sf
900 375 m
gs 1 -1 sc (  ) col-1 sh gr
/Times-Bold ff 180.00 scf sf
3225 825 m
gs 1 -1 sc (....) col-1 sh gr
$F2psEnd
rs
