#FIG 3.2
Portrait
Center
Inches
Letter  
100.00
Single
-2
1200 2
6 1124 299 2324 524
2 1 0 1 -1 7 0 0 -1 0.000 0 0 -1 0 0 2
	 1275 300 1275 450
2 1 0 1 -1 7 0 0 -1 0.000 0 0 -1 0 0 2
	 1425 300 1425 450
2 1 0 1 -1 7 0 0 -1 0.000 0 0 -1 0 0 2
	 1575 300 1575 450
2 1 0 1 -1 7 0 0 -1 0.000 0 0 -1 0 0 2
	 1725 300 1725 450
2 1 0 1 -1 7 0 0 -1 0.000 0 0 -1 0 0 2
	 1875 300 1875 450
2 2 0 1 -1 7 0 0 -1 0.000 0 0 0 0 0 5
	 1125 300 2250 300 2250 450 1125 450 1125 300
4 0 -1 0 0 1 10 0.0000 4 15 135 2025 375 ...\001
-6
6 1125 1125 2325 1350
2 1 0 1 -1 7 0 0 -1 0.000 0 0 -1 0 0 2
	 1276 1126 1276 1276
2 1 0 1 -1 7 0 0 -1 0.000 0 0 -1 0 0 2
	 1426 1126 1426 1276
2 1 0 1 -1 7 0 0 -1 0.000 0 0 -1 0 0 2
	 1576 1126 1576 1276
2 1 0 1 -1 7 0 0 -1 0.000 0 0 -1 0 0 2
	 1726 1126 1726 1276
2 1 0 1 -1 7 0 0 -1 0.000 0 0 -1 0 0 2
	 1876 1126 1876 1276
2 2 0 1 -1 7 0 0 -1 0.000 0 0 0 0 0 5
	 1126 1126 2251 1126 2251 1276 1126 1276 1126 1126
4 0 -1 0 0 1 10 0.0000 4 15 135 2026 1201 ...\001
-6
6 2325 1125 3525 1350
2 1 0 1 -1 7 0 0 -1 0.000 0 0 -1 0 0 2
	 2476 1126 2476 1276
2 1 0 1 -1 7 0 0 -1 0.000 0 0 -1 0 0 2
	 2626 1126 2626 1276
2 1 0 1 -1 7 0 0 -1 0.000 0 0 -1 0 0 2
	 2776 1126 2776 1276
2 1 0 1 -1 7 0 0 -1 0.000 0 0 -1 0 0 2
	 2926 1126 2926 1276
2 1 0 1 -1 7 0 0 -1 0.000 0 0 -1 0 0 2
	 3076 1126 3076 1276
2 2 0 1 -1 7 0 0 -1 0.000 0 0 0 0 0 5
	 2326 1126 3451 1126 3451 1276 2326 1276 2326 1126
4 0 -1 0 0 1 10 0.0000 4 15 135 3226 1201 ...\001
-6
6 3525 1125 4725 1350
2 1 0 1 -1 7 0 0 -1 0.000 0 0 -1 0 0 2
	 3676 1126 3676 1276
2 1 0 1 -1 7 0 0 -1 0.000 0 0 -1 0 0 2
	 3826 1126 3826 1276
2 1 0 1 -1 7 0 0 -1 0.000 0 0 -1 0 0 2
	 3976 1126 3976 1276
2 1 0 1 -1 7 0 0 -1 0.000 0 0 -1 0 0 2
	 4126 1126 4126 1276
2 1 0 1 -1 7 0 0 -1 0.000 0 0 -1 0 0 2
	 4276 1126 4276 1276
2 2 0 1 -1 7 0 0 -1 0.000 0 0 0 0 0 5
	 3526 1126 4651 1126 4651 1276 3526 1276 3526 1126
4 0 -1 0 0 1 10 0.0000 4 15 135 4426 1201 ...\001
-6
2 1 1 1 -1 7 0 0 -1 4.000 0 0 -1 1 0 2
	1 1 1.00 60.00 120.00
	 1650 450 1200 1125
2 1 1 1 -1 7 0 0 -1 4.000 0 0 -1 1 0 2
	1 1 1.00 60.00 120.00
	 1725 450 2700 1125
2 1 1 1 -1 7 0 0 -1 4.000 0 0 -1 1 0 2
	1 1 1.00 60.00 120.00
	 1800 450 3900 1125
2 1 1 1 -1 7 0 0 -1 4.000 0 0 7 0 0 2
	 1875 450 4200 825
2 1 2 1 -1 7 0 0 -1 3.000 0 0 -1 0 0 2
	 4200 825 4650 900
3 0 0 1 -1 7 0 0 -1 0.000 0 0 0 4
	 825 675 1800 675 2625 600 2850 150
	 0.000 1.000 1.000 0.000
4 0 -1 0 0 1 10 0.0000 4 15 135 4875 1275 ...\001
4 0 0 100 0 0 10 0.0000 6 120 1095 300 600 M\351moire centrale\001
4 0 0 100 0 0 10 0.0000 6 135 420 375 1275 Disque\001
4 0 0 100 0 0 10 0.0000 6 120 915 1200 1500 Les 'runs' tri\351s\001
4 0 0 100 0 0 10 0.0000 6 135 945 1275 225 Pages du buffer\001
