#FIG 3.2
Portrait
Center
Inches
A4      
100.00
Single
-2
1200 2
2 1 0 1 -1 7 0 0 -1 0.000 0 0 -1 0 0 2
	 375 600 1425 600
2 1 0 1 0 7 100 0 -1 0.000 0 0 7 0 0 2
	 1425 750 2700 750
2 1 0 1 -1 7 0 0 -1 0.000 0 0 -1 0 0 2
	 2701 601 3526 601
2 4 0 1 -1 7 0 0 -1 0.000 0 0 7 0 0 5
	 3526 1575 3526 301 2700 301 2700 1575 3526 1575
2 4 0 1 -1 7 0 0 -1 0.000 0 0 7 0 0 5
	 1425 1650 1425 300 375 300 375 1650 1425 1650
4 0 0 100 0 0 10 0.0000 6 105 315 2926 526 Film\001
4 0 0 100 0 0 10 0.0000 6 120 705 450 525 R\351alisateur\001
4 0 0 100 0 2 10 0.0000 2 120 135 450 825 id\001
4 0 -1 0 0 -1 10 0.0000 4 75 270 450 1050 nom\001
4 0 -1 0 0 -1 10 0.0000 4 150 465 450 1275 pr\351nom\001
4 0 0 100 0 0 10 0.0000 4 120 930 450 1500 ann\351eNaissance\001
4 0 0 100 0 2 10 0.0000 2 120 135 2850 825 id\001
4 0 0 100 0 0 10 0.0000 4 105 330 2850 1500 genre\001
4 0 0 100 0 0 10 0.0000 6 105 285 2850 1050 titre\001
4 0 0 100 0 0 10 0.0000 6 120 330 2850 1275 ann\351e\001
4 0 0 50 0 0 10 0.0000 4 105 240 2475 675 0..n\001
4 0 0 100 0 3 10 0.0000 2 120 465 1725 900 R\351alise\001
4 0 0 50 0 0 10 0.0000 4 105 240 1500 675 0..1\001
