#FIG 3.1
Landscape
Center
Inches
1200 2
6 225 1950 675 3525
2 1 0 1 -1 7 0 0 -1 0.000 0 0 -1 0 0 2
	 226 2251 601 2251
2 1 0 1 -1 7 0 0 -1 0.000 0 0 -1 0 0 2
	 226 2551 601 2551
2 1 0 1 -1 7 0 0 -1 0.000 0 0 -1 0 0 2
	 226 2851 601 2851
2 1 0 1 -1 7 0 0 -1 0.000 0 0 -1 0 0 2
	 226 3151 601 3151
2 1 0 1 -1 7 0 0 -1 0.000 0 0 -1 0 0 2
	 226 3451 601 3451
2 2 0 1 -1 7 0 0 -1 0.000 0 0 0 0 0 5
	 226 1951 601 1951 601 3451 226 3451 226 1951
4 0 -1 0 0 0 12 0.0000000 4 135 90 376 2476 1\001
4 0 -1 0 0 0 12 0.0000000 4 135 90 376 2176 0\001
4 0 -1 0 0 0 12 0.0000000 4 135 90 376 2776 2\001
4 0 -1 0 0 0 12 0.0000000 4 135 90 376 3076 3\001
4 0 -1 0 0 0 12 0.0000000 4 135 90 376 3376 4\001
-6
2 2 0 1 -1 7 0 0 -1 0.000 0 0 0 0 0 5
	 2850 375 4500 375 4500 1800 2850 1800 2850 375
2 2 0 1 -1 7 0 0 -1 0.000 0 0 0 0 0 5
	 825 300 2400 300 2400 1725 825 1725 825 300
2 2 0 1 -1 7 0 0 -1 0.000 0 0 0 0 0 5
	 4200 2175 5775 2175 5775 3600 4200 3600 4200 2175
2 2 0 1 -1 7 0 0 -1 0.000 0 0 0 0 0 5
	 2850 3750 4575 3750 4575 5175 2850 5175 2850 3750
2 2 0 1 -1 7 0 0 -1 0.000 0 0 0 0 0 5
	 825 4050 2400 4050 2400 5475 825 5475 825 4050
2 1 0 1 -1 7 0 0 -1 0.000 0 0 -1 1 0 3
	1 1 1.00 60.00 120.00
	 600 3300 1575 3300 1575 4050
2 1 0 1 -1 7 0 0 -1 0.000 0 0 -1 1 0 3
	1 1 1.00 60.00 120.00
	 600 3000 3375 3000 3375 3750
2 1 0 1 -1 7 0 0 -1 0.000 0 0 -1 1 0 2
	1 1 1.00 60.00 120.00
	 600 2700 4200 2700
2 1 0 1 -1 7 0 0 -1 0.000 0 0 -1 1 0 3
	1 1 1.00 60.00 120.00
	 600 2400 3525 2400 3525 1800
2 1 0 1 -1 7 0 0 -1 0.000 0 0 -1 1 0 3
	1 1 1.00 60.00 120.00
	 600 2100 1575 2100 1575 1725
2 2 0 1 -1 7 0 0 -1 0.000 0 0 0 0 0 5
	 5175 3750 6900 3750 6900 5175 5175 5175 5175 3750
2 1 0 1 -1 7 0 0 -1 0.000 0 0 -1 1 0 2
	1 1 1.00 60.00 120.00
	 4575 4050 5175 4050
4 0 -1 0 0 3 12 0.0000000 4 255 2475 3000 600 Annie Hall 1977\001
4 0 -1 0 0 3 12 0.0000000 4 285 2955 900 525 Jurassic Park 1992\001
4 0 -1 0 0 3 12 0.0000000 4 330 2640 975 4275 Impitoyable 1992\001
4 0 -1 0 0 3 12 0.0000000 4 330 3135 2925 4875 Reservoir Dogs 1992\001
4 0 -1 0 0 3 12 0.0000000 4 330 2850 3000 900 Underground 1995\001
4 0 -1 0 0 3 12 0.0000000 4 330 2175 3000 1200 Psychose 1960\001
4 0 -1 0 0 3 12 0.0000000 4 285 1830 4350 2400 Brazil  1984\001
4 0 -1 0 0 3 12 0.0000000 4 330 1935 4350 2700 Vertigo 1958\001
4 0 -1 0 0 3 12 0.0000000 4 330 2340 4350 3000 Greystoke 1984\001
4 0 -1 0 0 3 12 0.0000000 4 255 2550 2925 3975 Manhattan 1979\001
4 0 -1 0 0 3 12 0.0000000 4 255 2595 900 825 Twin Peaks 1990\001
4 0 -1 0 0 3 12 0.0000000 4 330 2505 900 1125 Easy Rider 1969\001
4 0 -1 0 0 3 12 0.0000000 4 255 1830 975 4875 Smoke 1995\001
4 0 -1 0 0 3 12 0.0000000 4 330 1980 975 4575 Shining 1980\001
4 0 -1 0 0 3 12 0.0000000 4 330 2475 2925 4275 Metropolis 1926\001
4 0 -1 0 0 3 12 0.0000000 4 255 2610 2925 4575 Casablanca 1942\001
4 0 -1 0 0 0 12 0.0000000 4 180 735 75 3675 Repertoire\001
4 0 -1 0 0 3 12 0.0000000 4 135 1350 5250 3975 Citizen Kane 1941\001
