%!PS-Adobe-2.0 EPSF-2.0
%%Title: mathfi.fig
%%Creator: fig2dev Version 3.2 Patchlevel 5-alpha5
%%CreationDate: Fri Oct  8 15:12:34 2004
%%For: philippe@pc (Philippe Rigaux)
%%BoundingBox: 0 0 283 84
%Magnification: 1.0000
%%EndComments
/$F2psDict 200 dict def
$F2psDict begin
$F2psDict /mtrx matrix put
/col-1 {0 setgray} bind def
/col0 {0.000 0.000 0.000 srgb} bind def
/col1 {0.000 0.000 1.000 srgb} bind def
/col2 {0.000 1.000 0.000 srgb} bind def
/col3 {0.000 1.000 1.000 srgb} bind def
/col4 {1.000 0.000 0.000 srgb} bind def
/col5 {1.000 0.000 1.000 srgb} bind def
/col6 {1.000 1.000 0.000 srgb} bind def
/col7 {1.000 1.000 1.000 srgb} bind def
/col8 {0.000 0.000 0.560 srgb} bind def
/col9 {0.000 0.000 0.690 srgb} bind def
/col10 {0.000 0.000 0.820 srgb} bind def
/col11 {0.530 0.810 1.000 srgb} bind def
/col12 {0.000 0.560 0.000 srgb} bind def
/col13 {0.000 0.690 0.000 srgb} bind def
/col14 {0.000 0.820 0.000 srgb} bind def
/col15 {0.000 0.560 0.560 srgb} bind def
/col16 {0.000 0.690 0.690 srgb} bind def
/col17 {0.000 0.820 0.820 srgb} bind def
/col18 {0.560 0.000 0.000 srgb} bind def
/col19 {0.690 0.000 0.000 srgb} bind def
/col20 {0.820 0.000 0.000 srgb} bind def
/col21 {0.560 0.000 0.560 srgb} bind def
/col22 {0.690 0.000 0.690 srgb} bind def
/col23 {0.820 0.000 0.820 srgb} bind def
/col24 {0.500 0.190 0.000 srgb} bind def
/col25 {0.630 0.250 0.000 srgb} bind def
/col26 {0.750 0.380 0.000 srgb} bind def
/col27 {1.000 0.500 0.500 srgb} bind def
/col28 {1.000 0.630 0.630 srgb} bind def
/col29 {1.000 0.750 0.750 srgb} bind def
/col30 {1.000 0.880 0.880 srgb} bind def
/col31 {1.000 0.840 0.000 srgb} bind def

end
save
newpath 0 84 moveto 0 0 lineto 283 0 lineto 283 84 lineto closepath clip newpath
-13.2 86.0 translate
1 -1 scale

/cp {closepath} bind def
/ef {eofill} bind def
/gr {grestore} bind def
/gs {gsave} bind def
/sa {save} bind def
/rs {restore} bind def
/l {lineto} bind def
/m {moveto} bind def
/rm {rmoveto} bind def
/n {newpath} bind def
/s {stroke} bind def
/sh {show} bind def
/slc {setlinecap} bind def
/slj {setlinejoin} bind def
/slw {setlinewidth} bind def
/srgb {setrgbcolor} bind def
/rot {rotate} bind def
/sc {scale} bind def
/sd {setdash} bind def
/ff {findfont} bind def
/sf {setfont} bind def
/scf {scalefont} bind def
/sw {stringwidth} bind def
/tr {translate} bind def
/tnt {dup dup currentrgbcolor
  4 -2 roll dup 1 exch sub 3 -1 roll mul add
  4 -2 roll dup 1 exch sub 3 -1 roll mul add
  4 -2 roll dup 1 exch sub 3 -1 roll mul add srgb}
  bind def
/shd {dup dup currentrgbcolor 4 -2 roll mul 4 -2 roll mul
  4 -2 roll mul srgb} bind def
/$F2psBegin {$F2psDict begin /$F2psEnteredState save def} def
/$F2psEnd {$F2psEnteredState restore end} def

$F2psBegin
10 setmiterlimit
0 slj 0 slc
 0.06299 0.06299 sc
%
% Fig objects follow
%
% 
% here starts figure with depth 50
% Polyline
0 slj
0 slc
7.500 slw
gs  clippath
4528 930 m 4695 930 l 4695 870 l 4528 870 l 4528 870 l 4648 900 l 4528 930 l cp
eoclip
n 450 900 m
 4680 900 l gs col0 s gr gr

% arrowhead
n 4528 930 m 4648 900 l 4528 870 l 4528 930 l  cp gs 0.00 setgray ef gr  col0 s
% Polyline
gs  clippath
480 422 m 480 255 l 420 255 l 420 422 l 420 422 l 450 302 l 480 422 l cp
eoclip
n 450 900 m
 450 270 l gs col0 s gr gr

% arrowhead
n 480 422 m 450 302 l 420 422 l 480 422 l  cp gs 0.00 setgray ef gr  col0 s
% Polyline
gs  clippath
645 1063 m 645 1230 l 705 1230 l 705 1063 l 705 1063 l 675 1183 l 645 1063 l cp
eoclip
n 675 900 m
 675 1215 l gs col0 s gr gr

% arrowhead
n 645 1063 m 675 1183 l 705 1063 l 645 1063 l  cp gs 0.00 setgray ef gr  col0 s
% Polyline
gs  clippath
1095 1063 m 1095 1230 l 1155 1230 l 1155 1063 l 1155 1063 l 1125 1183 l 1095 1063 l cp
eoclip
n 1125 900 m
 1125 1215 l gs col0 s gr gr

% arrowhead
n 1095 1063 m 1125 1183 l 1155 1063 l 1095 1063 l  cp gs 0.00 setgray ef gr  col0 s
% Polyline
gs  clippath
1545 1063 m 1545 1230 l 1605 1230 l 1605 1063 l 1605 1063 l 1575 1183 l 1545 1063 l cp
eoclip
n 1575 900 m
 1575 1215 l gs col0 s gr gr

% arrowhead
n 1545 1063 m 1575 1183 l 1605 1063 l 1545 1063 l  cp gs 0.00 setgray ef gr  col0 s
% Polyline
gs  clippath
2895 1063 m 2895 1230 l 2955 1230 l 2955 1063 l 2955 1063 l 2925 1183 l 2895 1063 l cp
eoclip
n 2925 900 m
 2925 1215 l gs col0 s gr gr

% arrowhead
n 2895 1063 m 2925 1183 l 2955 1063 l 2895 1063 l  cp gs 0.00 setgray ef gr  col0 s
% Polyline
gs  clippath
2445 1063 m 2445 1230 l 2505 1230 l 2505 1063 l 2505 1063 l 2475 1183 l 2445 1063 l cp
eoclip
n 2475 900 m
 2475 1215 l gs col0 s gr gr

% arrowhead
n 2445 1063 m 2475 1183 l 2505 1063 l 2445 1063 l  cp gs 0.00 setgray ef gr  col0 s
/Times-Roman ff 158.75 scf sf
2160 1125 m
gs 1 -1 sc (...) col0 sh gr
/Times-Roman ff 158.75 scf sf
225 180 m
gs 1 -1 sc (Capital) col0 sh gr
/Times-Roman ff 158.75 scf sf
630 1350 m
gs 1 -1 sc (a) col0 sh gr
/Times-Roman ff 158.75 scf sf
1080 1350 m
gs 1 -1 sc (a) col0 sh gr
/Times-Roman ff 158.75 scf sf
1530 1350 m
gs 1 -1 sc (a) col0 sh gr
/Times-Roman ff 158.75 scf sf
2880 1350 m
gs 1 -1 sc (a) col0 sh gr
/Times-Roman ff 158.75 scf sf
630 855 m
gs 1 -1 sc (1) col0 sh gr
/Times-Roman ff 158.75 scf sf
1080 855 m
gs 1 -1 sc (2) col0 sh gr
/Times-Roman ff 158.75 scf sf
1530 855 m
gs 1 -1 sc (3) col0 sh gr
/Times-Roman ff 158.75 scf sf
2880 810 m
gs 1 -1 sc (n) col0 sh gr
/Times-Roman ff 158.75 scf sf
2430 1350 m
gs 1 -1 sc (a) col0 sh gr
/Times-Roman ff 158.75 scf sf
2385 810 m
gs 1 -1 sc (n-1) col0 sh gr
% here ends figure;
$F2psEnd
rs
showpage
%%Trailer
%EOF
