<?xml version="1.0" encoding="UTF-8" standalone="no"?>
<!-- Created with Inkscape (http://www.inkscape.org/) -->

<svg
   xmlns:dc="http://purl.org/dc/elements/1.1/"
   xmlns:cc="http://creativecommons.org/ns#"
   xmlns:rdf="http://www.w3.org/1999/02/22-rdf-syntax-ns#"
   xmlns:svg="http://www.w3.org/2000/svg"
   xmlns="http://www.w3.org/2000/svg"
   xmlns:sodipodi="http://sodipodi.sourceforge.net/DTD/sodipodi-0.dtd"
   xmlns:inkscape="http://www.inkscape.org/namespaces/inkscape"
   width="277.1875"
   height="742.9375"
   id="svg2"
   version="1.1"
   inkscape:version="0.48.4 r9939"
   sodipodi:docname="schema_v1.1.svg">
  <defs
     id="defs4">
    <clipPath
       clipPathUnits="userSpaceOnUse"
       id="clipPath11059">
      <rect
         style="fill:#000000;fill-opacity:0.99579827;stroke:#000000;stroke-width:0.62890524;stroke-miterlimit:4;stroke-opacity:1;stroke-dasharray:none;stroke-dashoffset:0"
         id="rect11061"
         width="103.95181"
         height="511.09467"
         x="217.30983"
         y="276.10059"
         clip-path="none" />
    </clipPath>
    <clipPath
       clipPathUnits="userSpaceOnUse"
       id="clipPath11063">
      <rect
         style="fill:#000000;fill-opacity:0.99579827;stroke:#000000;stroke-width:0.62890524;stroke-miterlimit:4;stroke-opacity:1;stroke-dasharray:none;stroke-dashoffset:0"
         id="rect11065"
         width="103.95181"
         height="511.09467"
         x="217.30983"
         y="276.10059"
         clip-path="none" />
    </clipPath>
    <clipPath
       clipPathUnits="userSpaceOnUse"
       id="clipPath11067">
      <rect
         style="fill:#000000;fill-opacity:0.99579827;stroke:#000000;stroke-width:0.62890524;stroke-miterlimit:4;stroke-opacity:1;stroke-dasharray:none;stroke-dashoffset:0"
         id="rect11069"
         width="103.95181"
         height="511.09467"
         x="217.30983"
         y="276.10059"
         clip-path="none" />
    </clipPath>
    <clipPath
       clipPathUnits="userSpaceOnUse"
       id="clipPath11071">
      <rect
         style="fill:#000000;fill-opacity:0.99579827;stroke:#000000;stroke-width:0.62890524;stroke-miterlimit:4;stroke-opacity:1;stroke-dasharray:none;stroke-dashoffset:0"
         id="rect11073"
         width="103.95181"
         height="511.09467"
         x="217.30983"
         y="276.10059"
         clip-path="none" />
    </clipPath>
    <clipPath
       clipPathUnits="userSpaceOnUse"
       id="clipPath11075">
      <rect
         style="fill:#000000;fill-opacity:0.99579827;stroke:#000000;stroke-width:0.62890524;stroke-miterlimit:4;stroke-opacity:1;stroke-dasharray:none;stroke-dashoffset:0"
         id="rect11077"
         width="103.95181"
         height="511.09467"
         x="217.30983"
         y="276.10059"
         clip-path="none" />
    </clipPath>
    <clipPath
       clipPathUnits="userSpaceOnUse"
       id="clipPath11079">
      <rect
         style="fill:#000000;fill-opacity:0.99579827;stroke:#000000;stroke-width:0.62890524;stroke-miterlimit:4;stroke-opacity:1;stroke-dasharray:none;stroke-dashoffset:0"
         id="rect11081"
         width="103.95181"
         height="511.09467"
         x="217.30983"
         y="276.10059"
         clip-path="none" />
    </clipPath>
    <clipPath
       clipPathUnits="userSpaceOnUse"
       id="clipPath11083">
      <rect
         style="fill:#000000;fill-opacity:0.99579827;stroke:#000000;stroke-width:0.62890524;stroke-miterlimit:4;stroke-opacity:1;stroke-dasharray:none;stroke-dashoffset:0"
         id="rect11085"
         width="103.95181"
         height="511.09467"
         x="217.30983"
         y="276.10059"
         clip-path="none" />
    </clipPath>
    <clipPath
       clipPathUnits="userSpaceOnUse"
       id="clipPath11087">
      <rect
         style="fill:#000000;fill-opacity:0.99579827;stroke:#000000;stroke-width:0.62890524;stroke-miterlimit:4;stroke-opacity:1;stroke-dasharray:none;stroke-dashoffset:0"
         id="rect11089"
         width="103.95181"
         height="511.09467"
         x="217.30983"
         y="276.10059"
         clip-path="none" />
    </clipPath>
    <clipPath
       clipPathUnits="userSpaceOnUse"
       id="clipPath11091">
      <rect
         style="fill:#000000;fill-opacity:0.99579827;stroke:#000000;stroke-width:0.62890524;stroke-miterlimit:4;stroke-opacity:1;stroke-dasharray:none;stroke-dashoffset:0"
         id="rect11093"
         width="103.95181"
         height="511.09467"
         x="217.30983"
         y="276.10059"
         clip-path="none" />
    </clipPath>
    <clipPath
       clipPathUnits="userSpaceOnUse"
       id="clipPath11095">
      <rect
         style="fill:#000000;fill-opacity:0.99579827;stroke:#000000;stroke-width:0.62890524;stroke-miterlimit:4;stroke-opacity:1;stroke-dasharray:none;stroke-dashoffset:0"
         id="rect11097"
         width="103.95181"
         height="511.09467"
         x="217.30983"
         y="276.10059"
         clip-path="none" />
    </clipPath>
    <clipPath
       clipPathUnits="userSpaceOnUse"
       id="clipPath11107">
      <rect
         style="fill:#000000;fill-opacity:0.99579827;stroke:#000000;stroke-width:0.29499999;stroke-miterlimit:4;stroke-opacity:1;stroke-dasharray:none;stroke-dashoffset:0"
         id="rect11109"
         width="63.57143"
         height="44.642857"
         x="3.5714285"
         y="216.64789" />
    </clipPath>
    <clipPath
       clipPathUnits="userSpaceOnUse"
       id="clipPath11181">
      <rect
         clip-path="none"
         y="276.10059"
         x="217.30983"
         height="511.09467"
         width="103.95181"
         id="rect11183"
         style="fill:#000000;fill-opacity:0.99579827;stroke:#000000;stroke-width:0.62890524;stroke-miterlimit:4;stroke-opacity:1;stroke-dasharray:none;stroke-dashoffset:0" />
    </clipPath>
  </defs>
  <sodipodi:namedview
     id="base"
     pagecolor="#ffffff"
     bordercolor="#666666"
     borderopacity="1.0"
     inkscape:pageopacity="0.0"
     inkscape:pageshadow="2"
     inkscape:zoom="1.4"
     inkscape:cx="203.94413"
     inkscape:cy="459.15917"
     inkscape:document-units="px"
     inkscape:current-layer="layer1"
     showgrid="false"
     showguides="true"
     inkscape:window-width="1827"
     inkscape:window-height="1051"
     inkscape:window-x="84"
     inkscape:window-y="-9"
     inkscape:window-maximized="1"
     fit-margin-top="0"
     fit-margin-left="0"
     fit-margin-right="0"
     fit-margin-bottom="0">
    <inkscape:grid
       type="xygrid"
       id="grid3762"
       empspacing="5"
       visible="true"
       enabled="true"
       snapvisiblegridlinesonly="true"
       originx="28.78125px"
       originy="-27.643433px" />
  </sodipodi:namedview>
  <metadata
     id="metadata7">
    <rdf:RDF>
      <cc:Work
         rdf:about="">
        <dc:format>image/svg+xml</dc:format>
        <dc:type
           rdf:resource="http://purl.org/dc/dcmitype/StillImage" />
        <dc:title />
      </cc:Work>
    </rdf:RDF>
  </metadata>
  <g
     inkscape:label="Layer 1"
     inkscape:groupmode="layer"
     id="layer1"
     transform="translate(28.78125,-281.78125)">
    <rect
       style="fill:none;stroke:#000000;stroke-width:0.1906731;stroke-miterlimit:4;stroke-opacity:1;stroke-dasharray:0.19067311, 0.19067311;stroke-dashoffset:0"
       id="rect9308"
       width="99.809326"
       height="49.809326"
       x="61.595337"
       y="281.87451" />
    <rect
       y="940.92755"
       x="114.34526"
       height="49.809326"
       width="99.809326"
       id="rect9338"
       style="fill:none;stroke:#000000;stroke-width:0.1906731;stroke-miterlimit:4;stroke-opacity:1;stroke-dasharray:0.19067311, 0.19067311;stroke-dashoffset:0" />
    <path
       style="fill:none;stroke:#000000;stroke-width:1px;stroke-linecap:butt;stroke-linejoin:miter;stroke-opacity:1"
       d="m 80.906175,837.78704 34.343745,69.71875 48.5,0 1,0 48.5,0 34.34375,-69.71875 -48,0.5 -11.09375,14.65625 -23.75,0 -1,0 -23.75,0 -11.09375,-14.65625 -47.999995,-0.5 z"
       id="path10955"
       inkscape:connector-curvature="0" />
    <rect
       y="855.15118"
       x="114.34526"
       height="49.809326"
       width="99.809326"
       id="rect10957"
       style="fill:none;stroke:#000000;stroke-width:0.1906731;stroke-miterlimit:4;stroke-opacity:1;stroke-dasharray:0.19067311, 0.19067311;stroke-dashoffset:0" />
    <rect
       y="331.87451"
       x="61.595337"
       height="49.809326"
       width="99.809326"
       id="rect10985"
       style="fill:none;stroke:#000000;stroke-width:0.1906731;stroke-miterlimit:4;stroke-opacity:1;stroke-dasharray:0.19067311, 0.19067311;stroke-dashoffset:0" />
    <rect
       style="fill:none;stroke:#000000;stroke-width:0.1906731;stroke-miterlimit:4;stroke-opacity:1;stroke-dasharray:0.19067311, 0.19067311;stroke-dashoffset:0"
       id="rect10987"
       width="99.809326"
       height="49.809326"
       x="61.595337"
       y="431.87451" />
    <rect
       style="fill:none;stroke:#000000;stroke-width:0.1906731;stroke-miterlimit:4;stroke-opacity:1;stroke-dasharray:0.19067311, 0.19067311;stroke-dashoffset:0"
       id="rect10989"
       width="99.809326"
       height="49.809326"
       x="61.595337"
       y="381.87451" />
    <rect
       y="481.87451"
       x="61.595337"
       height="49.809326"
       width="99.809326"
       id="rect10991"
       style="fill:none;stroke:#000000;stroke-width:0.1906731;stroke-miterlimit:4;stroke-opacity:1;stroke-dasharray:0.19067311, 0.19067311;stroke-dashoffset:0" />
    <rect
       y="381.87451"
       x="61.595337"
       height="49.809326"
       width="99.809326"
       id="rect10993"
       style="fill:none;stroke:#000000;stroke-width:0.1906731;stroke-miterlimit:4;stroke-opacity:1;stroke-dasharray:0.19067311, 0.19067311;stroke-dashoffset:0" />
    <rect
       y="531.87451"
       x="61.595337"
       height="49.809326"
       width="99.809326"
       id="rect10995"
       style="fill:none;stroke:#000000;stroke-width:0.1906731;stroke-miterlimit:4;stroke-opacity:1;stroke-dasharray:0.19067311, 0.19067311;stroke-dashoffset:0" />
    <rect
       style="fill:none;stroke:#000000;stroke-width:0.1906731;stroke-miterlimit:4;stroke-opacity:1;stroke-dasharray:0.19067311, 0.19067311;stroke-dashoffset:0"
       id="rect10997"
       width="99.809326"
       height="49.809326"
       x="61.595337"
       y="581.87451" />
    <rect
       style="fill:none;stroke:#000000;stroke-width:0.1906731;stroke-miterlimit:4;stroke-opacity:1;stroke-dasharray:0.19067311, 0.19067311;stroke-dashoffset:0"
       id="rect10999"
       width="99.809326"
       height="49.809326"
       x="61.595337"
       y="631.87451" />
    <rect
       y="681.87451"
       x="61.595337"
       height="49.809326"
       width="99.809326"
       id="rect11001"
       style="fill:none;stroke:#000000;stroke-width:0.1906731;stroke-miterlimit:4;stroke-opacity:1;stroke-dasharray:0.19067311, 0.19067311;stroke-dashoffset:0" />
    <rect
       y="731.87451"
       x="61.595337"
       height="49.809326"
       width="99.809326"
       id="rect11003"
       style="fill:none;stroke:#000000;stroke-width:0.1906731;stroke-miterlimit:4;stroke-opacity:1;stroke-dasharray:0.19067311, 0.19067311;stroke-dashoffset:0" />
    <path
       inkscape:connector-curvature="0"
       style="fill:#000000;fill-opacity:1;stroke:#000000;stroke-width:0.08282488;stroke-miterlimit:4;stroke-opacity:1"
       d="m 272.31627,300.57796 -0.0422,7.69046 -71.95317,0 0,9.35496 71.8689,0 -0.0421,7.7326 10.76663,-6.11023 10.78771,-6.13129 -10.70343,-6.27878 -10.68235,-6.25772 z"
       id="path11005"
       clip-path="url(#clipPath11095)"
       transform="matrix(0.71918417,0,0,0.71918417,-149.78579,93.308812)" />
    <path
       transform="matrix(0.71918417,0,0,0.71918417,-149.78579,143.30881)"
       clip-path="url(#clipPath11095)"
       id="path11185"
       d="m 272.31627,300.57796 -0.0422,7.69046 -71.95317,0 0,9.35496 71.8689,0 -0.0421,7.7326 10.76663,-6.11023 10.78771,-6.13129 -10.70343,-6.27878 -10.68235,-6.25772 z"
       style="fill:#000000;fill-opacity:1;stroke:#000000;stroke-width:0.08282488;stroke-miterlimit:4;stroke-opacity:1"
       inkscape:connector-curvature="0" />
    <path
       transform="matrix(0.71918417,0,0,0.71918417,-149.78579,193.30881)"
       clip-path="url(#clipPath11095)"
       id="path11187"
       d="m 272.31627,300.57796 -0.0422,7.69046 -71.95317,0 0,9.35496 71.8689,0 -0.0421,7.7326 10.76663,-6.11023 10.78771,-6.13129 -10.70343,-6.27878 -10.68235,-6.25772 z"
       style="fill:#000000;fill-opacity:1;stroke:#000000;stroke-width:0.08282488;stroke-miterlimit:4;stroke-opacity:1"
       inkscape:connector-curvature="0" />
    <path
       inkscape:connector-curvature="0"
       style="fill:#000000;fill-opacity:1;stroke:#000000;stroke-width:0.08282488;stroke-miterlimit:4;stroke-opacity:1"
       d="m 272.31627,300.57796 -0.0422,7.69046 -71.95317,0 0,9.35496 71.8689,0 -0.0421,7.7326 10.76663,-6.11023 10.78771,-6.13129 -10.70343,-6.27878 -10.68235,-6.25772 z"
       id="path11191"
       clip-path="url(#clipPath11095)"
       transform="matrix(0.71918417,0,0,0.71918417,-149.78579,293.30881)" />
    <path
       transform="matrix(0.71918417,0,0,0.71918417,-149.78579,343.30881)"
       clip-path="url(#clipPath11095)"
       id="path11193"
       d="m 272.31627,300.57796 -0.0422,7.69046 -71.95317,0 0,9.35496 71.8689,0 -0.0421,7.7326 10.76663,-6.11023 10.78771,-6.13129 -10.70343,-6.27878 -10.68235,-6.25772 z"
       style="fill:#000000;fill-opacity:1;stroke:#000000;stroke-width:0.08282488;stroke-miterlimit:4;stroke-opacity:1"
       inkscape:connector-curvature="0" />
    <path
       transform="matrix(0.71918417,0,0,0.71918417,-149.78579,393.30881)"
       clip-path="url(#clipPath11095)"
       id="path11195"
       d="m 272.31627,300.57796 -0.0422,7.69046 -71.95317,0 0,9.35496 71.8689,0 -0.0421,7.7326 10.76663,-6.11023 10.78771,-6.13129 -10.70343,-6.27878 -10.68235,-6.25772 z"
       style="fill:#000000;fill-opacity:1;stroke:#000000;stroke-width:0.08282488;stroke-miterlimit:4;stroke-opacity:1"
       inkscape:connector-curvature="0" />
    <path
       inkscape:connector-curvature="0"
       style="fill:#000000;fill-opacity:1;stroke:#000000;stroke-width:0.08282488;stroke-miterlimit:4;stroke-opacity:1"
       d="m 272.31627,300.57796 -0.0422,7.69046 -71.95317,0 0,9.35496 71.8689,0 -0.0421,7.7326 10.76663,-6.11023 10.78771,-6.13129 -10.70343,-6.27878 -10.68235,-6.25772 z"
       id="path11197"
       clip-path="url(#clipPath11095)"
       transform="matrix(0.71918417,0,0,0.71918417,-149.78579,443.30881)" />
    <path
       transform="matrix(0.71918417,0,0,0.71918417,-149.78579,543.30881)"
       clip-path="url(#clipPath11095)"
       id="path11199"
       d="m 272.31627,300.57796 -0.0422,7.69046 -71.95317,0 0,9.35496 71.8689,0 -0.0421,7.7326 10.76663,-6.11023 10.78771,-6.13129 -10.70343,-6.27878 -10.68235,-6.25772 z"
       style="fill:#000000;fill-opacity:1;stroke:#000000;stroke-width:0.08282488;stroke-miterlimit:4;stroke-opacity:1"
       inkscape:connector-curvature="0" />
    <path
       inkscape:connector-curvature="0"
       style="fill:#000000;fill-opacity:1;stroke:#000000;stroke-width:0.08282488;stroke-miterlimit:4;stroke-opacity:1"
       d="m 272.31627,300.57796 -0.0422,7.69046 -71.95317,0 0,9.35496 71.8689,0 -0.0421,7.7326 10.76663,-6.11023 10.78771,-6.13129 -10.70343,-6.27878 -10.68235,-6.25772 z"
       id="path11201"
       clip-path="url(#clipPath11095)"
       transform="matrix(0.71918417,0,0,0.71918417,-149.78579,493.30881)" />
    <path
       inkscape:connector-curvature="0"
       style="fill:#000000;fill-opacity:0.54901961;stroke:#000000;stroke-width:0.08282488;stroke-miterlimit:4;stroke-opacity:1"
       d="m 272.31627,300.57796 -0.0422,7.69046 -71.95317,0 0,9.35496 71.8689,0 -0.0421,7.7326 10.76663,-6.11023 10.78771,-6.13129 -10.70343,-6.27878 -10.68235,-6.25772 z"
       id="path11205"
       clip-path="url(#clipPath11095)"
       transform="matrix(0.71918417,0,0,0.71918417,5.21421,143.30881)" />
    <path
       inkscape:connector-curvature="0"
       style="fill:#000000;fill-opacity:0.54901961;stroke:#000000;stroke-width:0.08282488;stroke-miterlimit:4;stroke-opacity:1"
       d="m 272.31627,300.57796 -0.0422,7.69046 -71.95317,0 0,9.35496 71.8689,0 -0.0421,7.7326 10.76663,-6.11023 10.78771,-6.13129 -10.70343,-6.27878 -10.68235,-6.25772 z"
       id="path11207"
       clip-path="url(#clipPath11095)"
       transform="matrix(0.71918417,0,0,0.71918417,5.21421,193.30881)" />
    <path
       transform="matrix(0.71918417,0,0,0.71918417,5.21421,243.30881)"
       clip-path="url(#clipPath11095)"
       id="path11209"
       d="m 272.31627,300.57796 -0.0422,7.69046 -71.95317,0 0,9.35496 71.8689,0 -0.0421,7.7326 10.76663,-6.11023 10.78771,-6.13129 -10.70343,-6.27878 -10.68235,-6.25772 z"
       style="fill:#000000;fill-opacity:0.54901961;stroke:#000000;stroke-width:0.08282488;stroke-miterlimit:4;stroke-opacity:1"
       inkscape:connector-curvature="0" />
    <path
       transform="matrix(0.71918417,0,0,0.71918417,5.21421,293.30881)"
       clip-path="url(#clipPath11095)"
       id="path11211"
       d="m 272.31627,300.57796 -0.0422,7.69046 -71.95317,0 0,9.35496 71.8689,0 -0.0421,7.7326 10.76663,-6.11023 10.78771,-6.13129 -10.70343,-6.27878 -10.68235,-6.25772 z"
       style="fill:#000000;fill-opacity:0.54901961;stroke:#000000;stroke-width:0.08282488;stroke-miterlimit:4;stroke-opacity:1"
       inkscape:connector-curvature="0" />
    <path
       inkscape:connector-curvature="0"
       style="fill:#000000;fill-opacity:0.54901961;stroke:#000000;stroke-width:0.08282488;stroke-miterlimit:4;stroke-opacity:1"
       d="m 272.31627,300.57796 -0.0422,7.69046 -71.95317,0 0,9.35496 71.8689,0 -0.0421,7.7326 10.76663,-6.11023 10.78771,-6.13129 -10.70343,-6.27878 -10.68235,-6.25772 z"
       id="path11213"
       clip-path="url(#clipPath11095)"
       transform="matrix(0.71918417,0,0,0.71918417,5.21421,343.30881)" />
    <path
       inkscape:connector-curvature="0"
       style="fill:#000000;fill-opacity:0.54901961;stroke:#000000;stroke-width:0.08282488;stroke-miterlimit:4;stroke-opacity:1"
       d="m 272.31627,300.57796 -0.0422,7.69046 -71.95317,0 0,9.35496 71.8689,0 -0.0421,7.7326 10.76663,-6.11023 10.78771,-6.13129 -10.70343,-6.27878 -10.68235,-6.25772 z"
       id="path11215"
       clip-path="url(#clipPath11095)"
       transform="matrix(0.71918417,0,0,0.71918417,5.21421,393.30881)" />
    <path
       transform="matrix(0.71918417,0,0,0.71918417,5.21421,443.30881)"
       clip-path="url(#clipPath11095)"
       id="path11217"
       d="m 272.31627,300.57796 -0.0422,7.69046 -71.95317,0 0,9.35496 71.8689,0 -0.0421,7.7326 10.76663,-6.11023 10.78771,-6.13129 -10.70343,-6.27878 -10.68235,-6.25772 z"
       style="fill:#000000;fill-opacity:0.54901961;stroke:#000000;stroke-width:0.08282488;stroke-miterlimit:4;stroke-opacity:1"
       inkscape:connector-curvature="0" />
    <path
       inkscape:connector-curvature="0"
       style="fill:#000000;fill-opacity:0.54901961;stroke:#000000;stroke-width:0.08282488;stroke-miterlimit:4;stroke-opacity:1"
       d="m 272.31627,300.57796 -0.0422,7.69046 -71.95317,0 0,9.35496 71.8689,0 -0.0421,7.7326 10.76663,-6.11023 10.78771,-6.13129 -10.70343,-6.27878 -10.68235,-6.25772 z"
       id="path11219"
       clip-path="url(#clipPath11095)"
       transform="matrix(0.71918417,0,0,0.71918417,5.21421,543.30881)" />
    <path
       transform="matrix(0.71918417,0,0,0.71918417,5.21421,493.30881)"
       clip-path="url(#clipPath11095)"
       id="path11221"
       d="m 272.31627,300.57796 -0.0422,7.69046 -71.95317,0 0,9.35496 71.8689,0 -0.0421,7.7326 10.76663,-6.11023 10.78771,-6.13129 -10.70343,-6.27878 -10.68235,-6.25772 z"
       style="fill:#000000;fill-opacity:0.54901961;stroke:#000000;stroke-width:0.08282488;stroke-miterlimit:4;stroke-opacity:1"
       inkscape:connector-curvature="0" />
    <path
       transform="matrix(0,0.71918417,-0.71918417,0,336.58089,625.60047)"
       clip-path="url(#clipPath11095)"
       id="path11223"
       d="m 272.31627,300.57796 -0.0422,7.69046 -71.95317,0 0,9.35496 71.8689,0 -0.0421,7.7326 10.76663,-6.11023 10.78771,-6.13129 -10.70343,-6.27878 -10.68235,-6.25772 z"
       style="fill:#000000;fill-opacity:0.54901961;stroke:#000000;stroke-width:0.08282488;stroke-miterlimit:4;stroke-opacity:0.47058824"
       inkscape:connector-curvature="0" />
    <path
       style="fill:#000000;fill-opacity:1;stroke:#000000;stroke-width:0.395156;stroke-miterlimit:4;stroke-opacity:1"
       d="m 0.2178442,1024.5071 6.4080616,0 0,-709.26499 -6.4080616,0 0,709.26499 z"
       id="path11229"
       inkscape:connector-curvature="0" />
    <path
       style="fill:#000000;fill-opacity:0.54901961;stroke:#000000;stroke-width:0.33700657;stroke-miterlimit:4;stroke-opacity:1"
       d="m 217.125,315.21875 0,454.8125 -0.125,0 0,51.6875 -5.5625,-0.0312 4.40625,7.75 4.40625,7.75 4.53125,-7.6875 4.5,-7.6875 -5.53125,-0.0312 0,-51.75 -0.15625,0 0,-454.8125 -6.46875,0 z"
       id="path11252"
       inkscape:connector-curvature="0" />
    <path
       style="fill:#000000;fill-opacity:0.54901961;stroke:#000000;stroke-width:0.06;stroke-miterlimit:4;stroke-opacity:1;stroke-dasharray:none"
       clip-path="none"
       d="m 160.87492,907.86161 0,17.5 -5.53125,0.0312 4.5,7.6875 4.5,7.6875 4.40625,-7.75 4.40625,-7.75 -5.5625,0.0312 0,-17.4375 -2.84375,0 -1,0 -2.875,0 z"
       id="path3903"
       inkscape:connector-curvature="0" />
    <path
       inkscape:connector-curvature="0"
       id="path3905"
       d="m 160.89261,1024.6604 6.71462,0 0,-34.03209 -6.71462,0 0,34.03209 z"
       style="fill:#000000;fill-opacity:1;stroke:#000000;stroke-width:0.08860444;stroke-miterlimit:4;stroke-opacity:1" />
    <path
       style="fill:#000000;fill-opacity:1;stroke:#000000;stroke-width:0.19188014;stroke-miterlimit:4;stroke-opacity:1"
       d="m 5.1623157,1018.0061 0,6.6119 162.0812543,0 0,-6.6119 -162.0812543,0 z"
       id="path3907"
       inkscape:connector-curvature="0" />
    <path
       style="fill:none;stroke:#000000;stroke-width:0.80000001;stroke-miterlimit:4;stroke-opacity:1;stroke-dasharray:none"
       clip-path="none"
       d="m -12.562301,286.27157 -7.6875,4.5 -7.71875,4.5 7.78125,4.40625 7.71875,4.40625 -0.03125,-5.5625 11.50000045,0 40.18749955,0 21.71875,0 0,-6.71875 -21.71875,0 -40.18749955,0 -11.53125045,0 -0.03125,-5.53125 z"
       id="path3919"
       inkscape:connector-curvature="0" />
    <path
       style="fill:none;stroke:#000000;stroke-width:0.8;stroke-miterlimit:4;stroke-opacity:1;stroke-dasharray:none"
       clip-path="none"
       d="m 45.500199,436.27125 7.6875,4.5 7.71875,4.5 -7.78125,4.40625 -7.71875,4.40625 0.03125,-5.5625 -11.5,0 -40.1875,0 -21.71875,0 0,-6.71875 21.71875,0 40.1875,0 11.53125,0 0.03125,-5.53125 z"
       id="path3928"
       inkscape:connector-curvature="0" />
    <path
       inkscape:connector-curvature="0"
       id="path3930"
       d="m -12.562301,386.27125 -7.6875,4.5 -7.71875,4.5 7.78125,4.40625 7.71875,4.40625 -0.03125,-5.5625 11.50000045,0 40.18749955,0 21.71875,0 0,-6.71875 -21.71875,0 -40.18749955,0 -11.53125045,0 -0.03125,-5.53125 z"
       clip-path="none"
       style="fill:none;stroke:#000000;stroke-width:0.80000001;stroke-miterlimit:4;stroke-opacity:1;stroke-dasharray:none" />
    <path
       style="fill:none;stroke:#000000;stroke-width:0.80000001;stroke-miterlimit:4;stroke-opacity:1;stroke-dasharray:none"
       clip-path="none"
       d="m 45.590232,336.33583 -0.03125,5.46875 -0.0625,0 0,0.0312 -11.5,0 -2.0625,0 -12.84375,0 -20.0937497,0 -11.4375003,0 -0.09375,0 -0.03125,-5.46875 -7.59375,4.4375 -1.78125,1.03125 -0.09375,0 -5.84375,3.40625 0,-0.0312 0,-0.0625 -0.09375,0.0625 0.09375,0.0625 0,0.0312 0,0.0625 5.65625,3.1875 0.09375,0 2.03125,1.15625 7.625,4.34375 -0.03125,-5.5 0.09375,0 11.4062503,0 20.0937497,0 12.84375,0 0,-0.0312 2.09375,0 5.25,0 6.25,0 0,0.0312 0.03125,5.5 2.46875,-1.40625 5.21875,-3.0625 7.71875,-4.5 -5.78125,-3.28125 -0.125,0 -1.78125,-1.03125 -2.78125,-1.625 -4.90625,-2.8125 z"
       id="path4010"
       inkscape:connector-curvature="0" />
  </g>
</svg>
