%!PS-Adobe-2.0 EPSF-2.0
%%Title: orgadisk.eps
%%Creator: fig2dev Version 3.2.3 Patchlevel 
%%CreationDate: Thu Jan  4 19:28:00 2001
%%For: rigaux@cartier (Philippe Rigaux)
%%BoundingBox: 0 0 261 129
%%Magnification: 1.0000
%%EndComments
/$F2psDict 200 dict def
$F2psDict begin
$F2psDict /mtrx matrix put
/col-1 {0 setgray} bind def
/col0 {0.000 0.000 0.000 srgb} bind def
/col1 {0.000 0.000 1.000 srgb} bind def
/col2 {0.000 1.000 0.000 srgb} bind def
/col3 {0.000 1.000 1.000 srgb} bind def
/col4 {1.000 0.000 0.000 srgb} bind def
/col5 {1.000 0.000 1.000 srgb} bind def
/col6 {1.000 1.000 0.000 srgb} bind def
/col7 {1.000 1.000 1.000 srgb} bind def
/col8 {0.000 0.000 0.560 srgb} bind def
/col9 {0.000 0.000 0.690 srgb} bind def
/col10 {0.000 0.000 0.820 srgb} bind def
/col11 {0.530 0.810 1.000 srgb} bind def
/col12 {0.000 0.560 0.000 srgb} bind def
/col13 {0.000 0.690 0.000 srgb} bind def
/col14 {0.000 0.820 0.000 srgb} bind def
/col15 {0.000 0.560 0.560 srgb} bind def
/col16 {0.000 0.690 0.690 srgb} bind def
/col17 {0.000 0.820 0.820 srgb} bind def
/col18 {0.560 0.000 0.000 srgb} bind def
/col19 {0.690 0.000 0.000 srgb} bind def
/col20 {0.820 0.000 0.000 srgb} bind def
/col21 {0.560 0.000 0.560 srgb} bind def
/col22 {0.690 0.000 0.690 srgb} bind def
/col23 {0.820 0.000 0.820 srgb} bind def
/col24 {0.500 0.190 0.000 srgb} bind def
/col25 {0.630 0.250 0.000 srgb} bind def
/col26 {0.750 0.380 0.000 srgb} bind def
/col27 {1.000 0.500 0.500 srgb} bind def
/col28 {1.000 0.630 0.630 srgb} bind def
/col29 {1.000 0.750 0.750 srgb} bind def
/col30 {1.000 0.880 0.880 srgb} bind def
/col31 {1.000 0.840 0.000 srgb} bind def

end
save
newpath 0 129 moveto 0 0 lineto 261 0 lineto 261 129 lineto closepath clip newpath
-55.0 126.0 translate
1 -1 scale

/cp {closepath} bind def
/ef {eofill} bind def
/gr {grestore} bind def
/gs {gsave} bind def
/sa {save} bind def
/rs {restore} bind def
/l {lineto} bind def
/m {moveto} bind def
/rm {rmoveto} bind def
/n {newpath} bind def
/s {stroke} bind def
/sh {show} bind def
/slc {setlinecap} bind def
/slj {setlinejoin} bind def
/slw {setlinewidth} bind def
/srgb {setrgbcolor} bind def
/rot {rotate} bind def
/sc {scale} bind def
/sd {setdash} bind def
/ff {findfont} bind def
/sf {setfont} bind def
/scf {scalefont} bind def
/sw {stringwidth} bind def
/tr {translate} bind def
/tnt {dup dup currentrgbcolor
  4 -2 roll dup 1 exch sub 3 -1 roll mul add
  4 -2 roll dup 1 exch sub 3 -1 roll mul add
  4 -2 roll dup 1 exch sub 3 -1 roll mul add srgb}
  bind def
/shd {dup dup currentrgbcolor 4 -2 roll mul 4 -2 roll mul
  4 -2 roll mul srgb} bind def
 /DrawEllipse {
	/endangle exch def
	/startangle exch def
	/yrad exch def
	/xrad exch def
	/y exch def
	/x exch def
	/savematrix mtrx currentmatrix def
	x y tr xrad yrad sc 0 0 1 startangle endangle arc
	closepath
	savematrix setmatrix
	} def

/$F2psBegin {$F2psDict begin /$F2psEnteredState save def} def
/$F2psEnd {$F2psEnteredState restore end} def

$F2psBegin
%%Page: 1 1
10 setmiterlimit
 0.06000 0.06000 sc
7.500 slw
% Ellipse
n 1895 920 955 955 0 360 DrawEllipse gs col0 s gr

% Ellipse
n 1895 920 855 855 0 360 DrawEllipse gs col0 s gr

% Ellipse
n 1895 920 742 742 0 360 DrawEllipse gs col0 s gr

% Ellipse
n 1895 920 636 636 0 360 DrawEllipse gs col0 s gr

% Ellipse
n 1895 920 530 530 0 360 DrawEllipse gs col0 s gr

% Ellipse
n 1895 920 424 424 0 360 DrawEllipse gs col0 s gr

% Polyline
n 2255 1317 m 2322 1400 l 2412 1295 l 2322 1212 l
 cp gs col7 0.00 shd ef gr gs col0 s gr 
% Polyline
n 1392 1610 m 1325 1700 l 1430 1745 l 1482 1662 l
 cp gs col7 0.00 shd ef gr gs col0 s gr 
% Polyline
n 1257 530 m 1332 590 l 1422 492 l 1355 417 l
 cp gs col7 0.00 shd ef gr gs col0 s gr 
% Polyline
n 1820 1670 m 1827 1775 l 1970 1767 l 1970 1670 l
 cp gs col7 0.00 shd ef gr gs col0 s gr 
% Polyline
n 2172 590 m 2255 522 l 2322 612 l 2247 680 l
 cp gs col7 0.00 shd ef gr gs col0 s gr 
% Ellipse
n 4295 920 955 955 0 360 DrawEllipse gs col0 s gr

% Ellipse
n 4295 920 855 855 0 360 DrawEllipse gs col0 s gr

% Polyline
n 4220 1670 m 4227 1775 l 4370 1767 l 4370 1670 l
 cp gs col7 0.00 shd ef gr gs col0 s gr 
% Polyline
n 4387 1665 m 4552 1620 l 4597 1725 l 4477 1755 l 4380 1777 l
 cp gs col7 0.00 shd ef gr gs col0 s gr 
/Times-Roman ff 150.00 scf sf
4275 2100 m
gs 1 -1 sc (\(b\)) col0 sh gr
/Times-Roman ff 150.00 scf sf
1875 2100 m
gs 1 -1 sc (\(a\)) col0 sh gr
% Ellipse
n 4295 920 742 742 0 360 DrawEllipse gs col7 1.00 shd ef gr gs col0 s gr

% Ellipse
n 4295 920 636 636 0 360 DrawEllipse gs col7 1.00 shd ef gr gs col0 s gr

% Ellipse
n 4295 920 530 530 0 360 DrawEllipse gs col7 1.00 shd ef gr gs col0 s gr

% Ellipse
n 4295 920 424 424 0 360 DrawEllipse gs col7 1.00 shd ef gr gs col0 s gr

$F2psEnd
rs
