%!PS-Adobe-2.0 EPSF-2.0
%%Title: ijpc00.eps
%%Creator: fig2dev Version 3.2 Patchlevel 1
%%CreationDate: Mon Jun 19 15:27:06 2000
%%For: rigaux@humboldt (Philippe Rigaux)
%%Orientation: Portrait
%%BoundingBox: 0 0 232 65
%%Pages: 0
%%BeginSetup
%%EndSetup
%%Magnification: 1.0000
%%EndComments
/$F2psDict 200 dict def
$F2psDict begin
$F2psDict /mtrx matrix put
/col-1 {0 setgray} bind def
/col0 {0.000 0.000 0.000 srgb} bind def
/col1 {0.000 0.000 1.000 srgb} bind def
/col2 {0.000 1.000 0.000 srgb} bind def
/col3 {0.000 1.000 1.000 srgb} bind def
/col4 {1.000 0.000 0.000 srgb} bind def
/col5 {1.000 0.000 1.000 srgb} bind def
/col6 {1.000 1.000 0.000 srgb} bind def
/col7 {1.000 1.000 1.000 srgb} bind def
/col8 {0.000 0.000 0.560 srgb} bind def
/col9 {0.000 0.000 0.690 srgb} bind def
/col10 {0.000 0.000 0.820 srgb} bind def
/col11 {0.530 0.810 1.000 srgb} bind def
/col12 {0.000 0.560 0.000 srgb} bind def
/col13 {0.000 0.690 0.000 srgb} bind def
/col14 {0.000 0.820 0.000 srgb} bind def
/col15 {0.000 0.560 0.560 srgb} bind def
/col16 {0.000 0.690 0.690 srgb} bind def
/col17 {0.000 0.820 0.820 srgb} bind def
/col18 {0.560 0.000 0.000 srgb} bind def
/col19 {0.690 0.000 0.000 srgb} bind def
/col20 {0.820 0.000 0.000 srgb} bind def
/col21 {0.560 0.000 0.560 srgb} bind def
/col22 {0.690 0.000 0.690 srgb} bind def
/col23 {0.820 0.000 0.820 srgb} bind def
/col24 {0.500 0.190 0.000 srgb} bind def
/col25 {0.630 0.250 0.000 srgb} bind def
/col26 {0.750 0.380 0.000 srgb} bind def
/col27 {1.000 0.500 0.500 srgb} bind def
/col28 {1.000 0.630 0.630 srgb} bind def
/col29 {1.000 0.750 0.750 srgb} bind def
/col30 {1.000 0.880 0.880 srgb} bind def
/col31 {1.000 0.840 0.000 srgb} bind def

end
save
-27.0 123.0 translate
1 -1 scale

/cp {closepath} bind def
/ef {eofill} bind def
/gr {grestore} bind def
/gs {gsave} bind def
/sa {save} bind def
/rs {restore} bind def
/l {lineto} bind def
/m {moveto} bind def
/rm {rmoveto} bind def
/n {newpath} bind def
/s {stroke} bind def
/sh {show} bind def
/slc {setlinecap} bind def
/slj {setlinejoin} bind def
/slw {setlinewidth} bind def
/srgb {setrgbcolor} bind def
/rot {rotate} bind def
/sc {scale} bind def
/sd {setdash} bind def
/ff {findfont} bind def
/sf {setfont} bind def
/scf {scalefont} bind def
/sw {stringwidth} bind def
/tr {translate} bind def
/tnt {dup dup currentrgbcolor
  4 -2 roll dup 1 exch sub 3 -1 roll mul add
  4 -2 roll dup 1 exch sub 3 -1 roll mul add
  4 -2 roll dup 1 exch sub 3 -1 roll mul add srgb}
  bind def
/shd {dup dup currentrgbcolor 4 -2 roll mul 4 -2 roll mul
  4 -2 roll mul srgb} bind def
/$F2psBegin {$F2psDict begin /$F2psEnteredState save def} def
/$F2psEnd {$F2psEnteredState restore end} def
%%EndProlog

$F2psBegin
10 setmiterlimit
n -1000 2947 m -1000 -1000 l 5107 -1000 l 5107 2947 l cp clip
 0.06299 0.06299 sc
/Times-Roman ff 150.00 scf sf
495 1845 m
gs 1 -1 sc (2 ) col0 sh gr
/Times-Roman ff 150.00 scf sf
720 1845 m
gs 1 -1 sc (3) col0 sh gr
/Times-Roman ff 150.00 scf sf
900 1845 m
gs 1 -1 sc (5) col0 sh gr
/Times-Roman ff 150.00 scf sf
1170 1845 m
gs 1 -1 sc (7) col0 sh gr
/Times-Roman ff 150.00 scf sf
1305 1845 m
gs 1 -1 sc (11) col0 sh gr
/Times-Roman ff 150.00 scf sf
1665 1845 m
gs 1 -1 sc (13) col0 sh gr
/Times-Roman ff 150.00 scf sf
1890 1845 m
gs 1 -1 sc (17) col0 sh gr
/Times-Roman ff 150.00 scf sf
2115 1845 m
gs 1 -1 sc (19) col0 sh gr
/Times-Roman ff 150.00 scf sf
2385 1845 m
gs 1 -1 sc (23) col0 sh gr
/Times-Roman ff 150.00 scf sf
2610 1845 m
gs 1 -1 sc (29) col0 sh gr
/Times-Roman ff 150.00 scf sf
2880 1845 m
gs 1 -1 sc (31) col0 sh gr
/Times-Roman ff 150.00 scf sf
3105 1845 m
gs 1 -1 sc (37) col0 sh gr
/Times-Roman ff 150.00 scf sf
3330 1845 m
gs 1 -1 sc (41) col0 sh gr
/Times-Roman ff 150.00 scf sf
3645 1845 m
gs 1 -1 sc (43) col0 sh gr
/Times-Roman ff 150.00 scf sf
3870 1845 m
gs 1 -1 sc (47) col0 sh gr
% Polyline
7.500 slw
n 450 1665 m 1035 1665 l 1035 1935 l 450 1935 l cp gs col0 s gr 
% Polyline
n 1125 1665 m 1530 1665 l 1530 1935 l 1125 1935 l cp gs col0 s gr 
% Polyline
n 1620 1665 m 2295 1665 l 2295 1935 l 1620 1935 l cp gs col0 s gr 
% Polyline
n 2340 1665 m 2790 1665 l 2790 1935 l 2340 1935 l cp gs col0 s gr 
% Polyline
n 2835 1665 m 3510 1665 l 3510 1935 l 2835 1935 l cp gs col0 s gr 
% Polyline
n 3600 1665 m 4095 1665 l 4095 1935 l 3600 1935 l cp gs col0 s gr 
% Polyline
n 990 1305 m 1440 1305 l 1440 1485 l 990 1485 l cp gs col0 s gr 
% Polyline
n 2700 1260 m 3330 1260 l 3330 1485 l 2700 1485 l cp gs col0 s gr 
% Polyline
n 1800 945 m 2385 945 l 2385 1125 l 1800 1125 l cp gs col0 s gr 
% Polyline
n 1035 1485 m 855 1665 l gs col0 s gr 
% Polyline
n 1260 1485 m 1260 1665 l gs col0 s gr 
% Polyline
n 1440 1485 m 1755 1665 l gs col0 s gr 
% Polyline
n 1800 1125 m 1440 1305 l gs col0 s gr 
% Polyline
n 2385 1125 m 2700 1260 l gs col0 s gr 
% Polyline
n 2700 1485 m 2565 1665 l gs col0 s gr 
% Polyline
n 3330 1485 m 3735 1665 l gs col0 s gr 
% Polyline
n 3015 1485 m 3015 1665 l gs col0 s gr 
/Times-Roman ff 150.00 scf sf
1260 1440 m
gs 1 -1 sc (11) col0 sh gr
/Times-Roman ff 150.00 scf sf
1035 1440 m
gs 1 -1 sc (5) col0 sh gr
/Times-Roman ff 150.00 scf sf
2160 1080 m
gs 1 -1 sc (19) col0 sh gr
/Times-Roman ff 150.00 scf sf
2790 1440 m
gs 1 -1 sc (29) col0 sh gr
/Times-Roman ff 150.00 scf sf
3105 1440 m
gs 1 -1 sc (41) col0 sh gr
$F2psEnd
rs
