%!PS-Adobe-2.0 EPSF-2.0
%%Title: eval-sortphase.eps
%%Creator: fig2dev Version 3.2 Patchlevel 1
%%CreationDate: Fri Mar  9 11:58:51 2001
%%For: rigaux@cartier ()
%%Orientation: Portrait
%%BoundingBox: 0 0 283 83
%%Pages: 0
%%BeginSetup
%%EndSetup
%%Magnification: 1.0000
%%EndComments
/$F2psDict 200 dict def
$F2psDict begin
$F2psDict /mtrx matrix put
/col-1 {0 setgray} bind def
/col0 {0.000 0.000 0.000 srgb} bind def
/col1 {0.000 0.000 1.000 srgb} bind def
/col2 {0.000 1.000 0.000 srgb} bind def
/col3 {0.000 1.000 1.000 srgb} bind def
/col4 {1.000 0.000 0.000 srgb} bind def
/col5 {1.000 0.000 1.000 srgb} bind def
/col6 {1.000 1.000 0.000 srgb} bind def
/col7 {1.000 1.000 1.000 srgb} bind def
/col8 {0.000 0.000 0.560 srgb} bind def
/col9 {0.000 0.000 0.690 srgb} bind def
/col10 {0.000 0.000 0.820 srgb} bind def
/col11 {0.530 0.810 1.000 srgb} bind def
/col12 {0.000 0.560 0.000 srgb} bind def
/col13 {0.000 0.690 0.000 srgb} bind def
/col14 {0.000 0.820 0.000 srgb} bind def
/col15 {0.000 0.560 0.560 srgb} bind def
/col16 {0.000 0.690 0.690 srgb} bind def
/col17 {0.000 0.820 0.820 srgb} bind def
/col18 {0.560 0.000 0.000 srgb} bind def
/col19 {0.690 0.000 0.000 srgb} bind def
/col20 {0.820 0.000 0.000 srgb} bind def
/col21 {0.560 0.000 0.560 srgb} bind def
/col22 {0.690 0.000 0.690 srgb} bind def
/col23 {0.820 0.000 0.820 srgb} bind def
/col24 {0.500 0.190 0.000 srgb} bind def
/col25 {0.630 0.250 0.000 srgb} bind def
/col26 {0.750 0.380 0.000 srgb} bind def
/col27 {1.000 0.500 0.500 srgb} bind def
/col28 {1.000 0.630 0.630 srgb} bind def
/col29 {1.000 0.750 0.750 srgb} bind def
/col30 {1.000 0.880 0.880 srgb} bind def
/col31 {1.000 0.840 0.000 srgb} bind def

end
save
-18.0 90.0 translate
1 -1 scale

/cp {closepath} bind def
/ef {eofill} bind def
/gr {grestore} bind def
/gs {gsave} bind def
/sa {save} bind def
/rs {restore} bind def
/l {lineto} bind def
/m {moveto} bind def
/rm {rmoveto} bind def
/n {newpath} bind def
/s {stroke} bind def
/sh {show} bind def
/slc {setlinecap} bind def
/slj {setlinejoin} bind def
/slw {setlinewidth} bind def
/srgb {setrgbcolor} bind def
/rot {rotate} bind def
/sc {scale} bind def
/sd {setdash} bind def
/ff {findfont} bind def
/sf {setfont} bind def
/scf {scalefont} bind def
/sw {stringwidth} bind def
/tr {translate} bind def
/tnt {dup dup currentrgbcolor
  4 -2 roll dup 1 exch sub 3 -1 roll mul add
  4 -2 roll dup 1 exch sub 3 -1 roll mul add
  4 -2 roll dup 1 exch sub 3 -1 roll mul add srgb}
  bind def
/shd {dup dup currentrgbcolor 4 -2 roll mul 4 -2 roll mul
  4 -2 roll mul srgb} bind def
/reencdict 12 dict def /ReEncode { reencdict begin
/newcodesandnames exch def /newfontname exch def /basefontname exch def
/basefontdict basefontname findfont def /newfont basefontdict maxlength dict def
basefontdict { exch dup /FID ne { dup /Encoding eq
{ exch dup length array copy newfont 3 1 roll put }
{ exch newfont 3 1 roll put } ifelse } { pop pop } ifelse } forall
newfont /FontName newfontname put newcodesandnames aload pop
128 1 255 { newfont /Encoding get exch /.notdef put } for
newcodesandnames length 2 idiv { newfont /Encoding get 3 1 roll put } repeat
newfontname newfont definefont pop end } def
/isovec [
8#200 /grave 8#201 /acute 8#202 /circumflex 8#203 /tilde
8#204 /macron 8#205 /breve 8#206 /dotaccent 8#207 /dieresis
8#210 /ring 8#211 /cedilla 8#212 /hungarumlaut 8#213 /ogonek 8#214 /caron
8#220 /dotlessi 8#230 /oe 8#231 /OE
8#240 /space 8#241 /exclamdown 8#242 /cent 8#243 /sterling
8#244 /currency 8#245 /yen 8#246 /brokenbar 8#247 /section 8#250 /dieresis
8#251 /copyright 8#252 /ordfeminine 8#253 /guillemotleft 8#254 /logicalnot
8#255 /endash 8#256 /registered 8#257 /macron 8#260 /degree 8#261 /plusminus
8#262 /twosuperior 8#263 /threesuperior 8#264 /acute 8#265 /mu 8#266 /paragraph
8#267 /periodcentered 8#270 /cedilla 8#271 /onesuperior 8#272 /ordmasculine
8#273 /guillemotright 8#274 /onequarter 8#275 /onehalf
8#276 /threequarters 8#277 /questiondown 8#300 /Agrave 8#301 /Aacute
8#302 /Acircumflex 8#303 /Atilde 8#304 /Adieresis 8#305 /Aring
8#306 /AE 8#307 /Ccedilla 8#310 /Egrave 8#311 /Eacute
8#312 /Ecircumflex 8#313 /Edieresis 8#314 /Igrave 8#315 /Iacute
8#316 /Icircumflex 8#317 /Idieresis 8#320 /Eth 8#321 /Ntilde 8#322 /Ograve
8#323 /Oacute 8#324 /Ocircumflex 8#325 /Otilde 8#326 /Odieresis 8#327 /multiply
8#330 /Oslash 8#331 /Ugrave 8#332 /Uacute 8#333 /Ucircumflex
8#334 /Udieresis 8#335 /Yacute 8#336 /Thorn 8#337 /germandbls 8#340 /agrave
8#341 /aacute 8#342 /acircumflex 8#343 /atilde 8#344 /adieresis 8#345 /aring
8#346 /ae 8#347 /ccedilla 8#350 /egrave 8#351 /eacute
8#352 /ecircumflex 8#353 /edieresis 8#354 /igrave 8#355 /iacute
8#356 /icircumflex 8#357 /idieresis 8#360 /eth 8#361 /ntilde 8#362 /ograve
8#363 /oacute 8#364 /ocircumflex 8#365 /otilde 8#366 /odieresis 8#367 /divide
8#370 /oslash 8#371 /ugrave 8#372 /uacute 8#373 /ucircumflex
8#374 /udieresis 8#375 /yacute 8#376 /thorn 8#377 /ydieresis] def
/Times-Italic /Times-Italic-iso isovec ReEncode
/Times-Roman /Times-Roman-iso isovec ReEncode
/$F2psBegin {$F2psDict begin /$F2psEnteredState save def} def
/$F2psEnd {$F2psEnteredState restore end} def
%%EndProlog

$F2psBegin
10 setmiterlimit
n -1000 2500 m -1000 -1000 l 6013 -1000 l 6013 2500 l cp clip
 0.06000 0.06000 sc
/Times-Roman-iso ff 150.00 scf sf
300 600 m
gs 1 -1 sc (M\351moire centrale) col0 sh gr
/Times-Roman-iso ff 150.00 scf sf
375 1275 m
gs 1 -1 sc (Disque) col0 sh gr
/Times-Roman-iso ff 150.00 scf sf
1200 1500 m
gs 1 -1 sc (Les 'runs' tri\351s) col0 sh gr
/Times-Roman-iso ff 150.00 scf sf
1275 225 m
gs 1 -1 sc (Pages du buffer) col0 sh gr
% Polyline
7.500 slw
n 1275 300 m 1275 450 l gs col-1 s gr 
% Polyline
n 1425 300 m 1425 450 l gs col-1 s gr 
% Polyline
n 1575 300 m 1575 450 l gs col-1 s gr 
% Polyline
n 1725 300 m 1725 450 l gs col-1 s gr 
% Polyline
n 1875 300 m 1875 450 l gs col-1 s gr 
% Polyline
n 1125 300 m 2250 300 l 2250 450 l 1125 450 l cp gs col-1 s gr 
/Times-Italic-iso ff 150.00 scf sf
2025 375 m
gs 1 -1 sc (...) col-1 sh gr
% Polyline
n 1276 1126 m 1276 1276 l gs col-1 s gr 
% Polyline
n 1426 1126 m 1426 1276 l gs col-1 s gr 
% Polyline
n 1576 1126 m 1576 1276 l gs col-1 s gr 
% Polyline
n 1726 1126 m 1726 1276 l gs col-1 s gr 
% Polyline
n 1876 1126 m 1876 1276 l gs col-1 s gr 
% Polyline
n 1126 1126 m 2251 1126 l 2251 1276 l 1126 1276 l cp gs col-1 s gr 
/Times-Italic-iso ff 150.00 scf sf
2026 1201 m
gs 1 -1 sc (...) col-1 sh gr
% Polyline
n 2476 1126 m 2476 1276 l gs col-1 s gr 
% Polyline
n 2626 1126 m 2626 1276 l gs col-1 s gr 
% Polyline
n 2776 1126 m 2776 1276 l gs col-1 s gr 
% Polyline
n 2926 1126 m 2926 1276 l gs col-1 s gr 
% Polyline
n 3076 1126 m 3076 1276 l gs col-1 s gr 
% Polyline
n 2326 1126 m 3451 1126 l 3451 1276 l 2326 1276 l cp gs col-1 s gr 
/Times-Italic-iso ff 150.00 scf sf
3226 1201 m
gs 1 -1 sc (...) col-1 sh gr
% Polyline
n 3676 1126 m 3676 1276 l gs col-1 s gr 
% Polyline
n 3826 1126 m 3826 1276 l gs col-1 s gr 
% Polyline
n 3976 1126 m 3976 1276 l gs col-1 s gr 
% Polyline
n 4126 1126 m 4126 1276 l gs col-1 s gr 
% Polyline
n 4276 1126 m 4276 1276 l gs col-1 s gr 
% Polyline
n 3526 1126 m 4651 1126 l 4651 1276 l 3526 1276 l cp gs col-1 s gr 
/Times-Italic-iso ff 150.00 scf sf
4426 1201 m
gs 1 -1 sc (...) col-1 sh gr
% Polyline
 [60] 0 sd
gs  clippath
1292 1042 m 1200 1125 l 1242 1009 l 1167 1121 l 1217 1154 l cp
clip
n 1650 450 m 1200 1125 l gs col-1 s gr gr
 [] 0 sd
% arrowhead
n 1292 1042 m 1200 1125 l 1242 1009 l 1267 1025 l 1292 1042 l  cp gs 0.00 setgray ef gr  col-1 s
% Polyline
 [60] 0 sd
gs  clippath
2618 1032 m 2700 1125 l 2584 1081 l 2695 1158 l 2729 1109 l cp
clip
n 1725 450 m 2700 1125 l gs col-1 s gr gr
 [] 0 sd
% arrowhead
n 2618 1032 m 2700 1125 l 2584 1081 l 2601 1057 l 2618 1032 l  cp gs 0.00 setgray ef gr  col-1 s
% Polyline
 [60] 0 sd
gs  clippath
3795 1060 m 3900 1125 l 3777 1117 l 3905 1158 l 3923 1101 l cp
clip
n 1800 450 m 3900 1125 l gs col-1 s gr gr
 [] 0 sd
% arrowhead
n 3795 1060 m 3900 1125 l 3777 1117 l 3786 1088 l 3795 1060 l  cp gs 0.00 setgray ef gr  col-1 s
% Polyline
 [60] 0 sd
n 1875 450 m 4200 825 l gs col-1 s gr  [] 0 sd
% Polyline
 [15 45] 45 sd
n 4200 825 m 4650 900 l gs col-1 s gr  [] 0 sd
% Polyline
n 825 675 m 827 675 l 832 675 l 842 675 l 856 675 l 876 675 l
 902 675 l 933 675 l 970 674 l 1011 674 l 1055 674 l
 1102 674 l 1150 674 l 1198 673 l 1246 673 l 1292 672 l
 1338 672 l 1381 672 l 1423 671 l 1462 671 l 1500 670 l
 1535 669 l 1569 669 l 1601 668 l 1632 667 l 1662 666 l
 1691 666 l 1720 665 l 1747 664 l 1775 663 l 1807 661 l
 1838 660 l 1870 658 l 1902 656 l 1934 654 l 1967 652 l
 1999 649 l 2032 646 l 2065 643 l 2098 640 l 2131 636 l
 2163 632 l 2195 627 l 2227 622 l 2257 617 l 2287 611 l
 2316 606 l 2344 599 l 2371 593 l 2396 586 l 2420 579 l
 2443 571 l 2465 563 l 2486 555 l 2506 547 l 2525 538 l
 2546 526 l 2567 514 l 2586 501 l 2605 486 l 2623 470 l
 2641 453 l 2660 433 l 2678 412 l 2697 388 l 2716 362 l
 2735 335 l 2754 307 l 2772 279 l 2790 251 l 2806 224 l
 2820 201 l 2831 182 l 2840 168 l 2845 158 l 2849 153 l
 2850 150 l gs col-1 s gr 
/Times-Italic-iso ff 150.00 scf sf
4875 1275 m
gs 1 -1 sc (...) col-1 sh gr
$F2psEnd
rs
