\relax 
\providecommand\hyper@newdestlabel[2]{}
\@writefile{toc}{\contentsline {chapter}{\numberline {3}Leçon 5 \& 6 -- Organisation de l'ordinateur}{65}{chapter.3}\protected@file@percent }
\@writefile{lof}{\addvspace {10\p@ }}
\@writefile{lot}{\addvspace {10\p@ }}
\@writefile{lol}{\addvspace {10\p@ }}
\newlabel{cha:orga}{{3}{65}{Leçon 5 \& 6 -- Organisation de l'ordinateur}{chapter.3}{}}
\newlabel{sec:memoire-primaire}{{3.1}{65}{Mémoire primaire}{section.3.1}{}}
\@writefile{toc}{\contentsline {section}{\numberline {3.1}Mémoire primaire}{65}{section.3.1}\protected@file@percent }
\@writefile{lof}{\contentsline {figure}{\numberline {\relax 3.1}{\ignorespaces Un modèle simple de l'organisation d'un ordinateur.\relax }}{65}{figure.caption.44}\protected@file@percent }
\newlabel{fig:orga}{{\relax 3.1}{65}{Un modèle simple de l'organisation d'un ordinateur.\relax }{figure.caption.44}{}}
\@writefile{toc}{\contentsline {subsection}{\numberline {3.1.1}Structure et adresses}{66}{subsection.3.1.1}\protected@file@percent }
\@writefile{toc}{\contentsline {subsection}{\numberline {3.1.2}Mémoire cache}{67}{subsection.3.1.2}\protected@file@percent }
\@writefile{toc}{\contentsline {subsection}{\numberline {3.1.3}Ordre des octets dans les mots}{68}{subsection.3.1.3}\protected@file@percent }
\@writefile{lof}{\contentsline {figure}{\numberline {\relax 3.2}{\ignorespaces Petit et gros boutistes.\relax }}{69}{figure.caption.45}\protected@file@percent }
\newlabel{fig:pbgb}{{\relax 3.2}{69}{Petit et gros boutistes.\relax }{figure.caption.45}{}}
\@writefile{toc}{\contentsline {subsection}{\numberline {3.1.4}Réalisation de la mémoire primaire}{70}{subsection.3.1.4}\protected@file@percent }
\@writefile{toc}{\contentsline {paragraph}{\nonumberline Les tubes de Williams}{70}{section*.46}\protected@file@percent }
\@writefile{toc}{\contentsline {paragraph}{\nonumberline Les mémoires à lignes à délai}{70}{section*.48}\protected@file@percent }
\@writefile{toc}{\contentsline {paragraph}{\nonumberline Les mémoires à tores magnétiques}{70}{section*.50}\protected@file@percent }
\@writefile{lof}{\contentsline {figure}{\numberline {\relax 3.3}{\ignorespaces Un tube Williams.\relax }}{71}{figure.caption.47}\protected@file@percent }
\newlabel{fig:williams}{{\relax 3.3}{71}{Un tube Williams.\relax }{figure.caption.47}{}}
\@writefile{lof}{\contentsline {figure}{\numberline {\relax 3.4}{\ignorespaces Deux mémoires à lignes de délai}}{72}{figure.caption.49}\protected@file@percent }
\newlabel{fig:mm}{{\relax 3.4}{72}{Deux mémoires à lignes de délai}{figure.caption.49}{}}
\@writefile{lof}{\contentsline {figure}{\numberline {\relax 3.5}{\ignorespaces Détail d'une mémoire à tores de ferrite.\relax }}{73}{figure.caption.51}\protected@file@percent }
\newlabel{fig:toreferite}{{\relax 3.5}{73}{Détail d'une mémoire à tores de ferrite.\relax }{figure.caption.51}{}}
\newlabel{sec:le-processeur}{{3.2}{74}{Le processeur}{section.3.2}{}}
\@writefile{toc}{\contentsline {section}{\numberline {3.2}Le processeur}{74}{section.3.2}\protected@file@percent }
\@writefile{toc}{\contentsline {subsection}{\numberline {3.2.1}Composants du processeur}{74}{subsection.3.2.1}\protected@file@percent }
\@writefile{lof}{\contentsline {figure}{\numberline {\relax 3.6}{\ignorespaces Un exemple de programme en langage machine i486.\relax }}{76}{figure.caption.52}\protected@file@percent }
\newlabel{fig:exemple-lg-machine}{{\relax 3.6}{76}{Un exemple de programme en langage machine i486.\relax }{figure.caption.52}{}}
\newlabel{exemple:machine-asm}{{3.2.1}{76}{Composants du processeur}{Item.39}{}}
\@writefile{toc}{\contentsline {subsection}{\numberline {3.2.2}Le chemin des données -- \textit  {datapath}}{76}{subsection.3.2.2}\protected@file@percent }
\newlabel{sec:data-path}{{3.2.2}{76}{Le chemin des données -- \textit {datapath}}{subsection.3.2.2}{}}
\@writefile{lof}{\contentsline {figure}{\numberline {\relax 3.7}{\ignorespaces Le chemin des données}}{77}{figure.caption.53}\protected@file@percent }
\newlabel{fig:datapath}{{\relax 3.7}{77}{Le chemin des données}{figure.caption.53}{}}
\@writefile{toc}{\contentsline {subsection}{\numberline {3.2.3}Exécution des instructions}{77}{subsection.3.2.3}\protected@file@percent }
\newlabel{sec:exec-des-instr}{{3.2.3}{77}{Exécution des instructions}{subsection.3.2.3}{}}
\@writefile{lof}{\contentsline {figure}{\numberline {\relax 3.8}{\ignorespaces La boucle d'interprétation du CPU.\relax }}{78}{figure.caption.54}\protected@file@percent }
\newlabel{fig:boucleint}{{\relax 3.8}{78}{La boucle d'interprétation du CPU.\relax }{figure.caption.54}{}}
\newlabel{item:2}{{1}{78}{Exécution des instructions}{Item.40}{}}
\newlabel{item:4}{{4}{78}{Exécution des instructions}{Item.43}{}}
\@writefile{toc}{\contentsline {subsection}{\numberline {3.2.4}Machine à pile}{78}{subsection.3.2.4}\protected@file@percent }
\newlabel{sec:machine-pile}{{3.2.4}{78}{Machine à pile}{subsection.3.2.4}{}}
\@writefile{lof}{\contentsline {figure}{\numberline {\relax 3.9}{\ignorespaces Un exemple de pile.\relax }}{79}{figure.caption.56}\protected@file@percent }
\newlabel{fig:pile}{{\relax 3.9}{79}{Un exemple de pile.\relax }{figure.caption.56}{}}
\@writefile{toc}{\contentsline {paragraph}{\nonumberline La pile comme structure de données}{79}{section*.55}\protected@file@percent }
\@writefile{toc}{\contentsline {paragraph}{\nonumberline Implémentation d'une pile}{80}{section*.57}\protected@file@percent }
\@writefile{toc}{\contentsline {paragraph}{\nonumberline Utilisation dans le langage machine}{80}{section*.58}\protected@file@percent }
\@writefile{toc}{\contentsline {subsection}{\numberline {3.2.5}Choix du jeu d'instructions machine}{80}{subsection.3.2.5}\protected@file@percent }
\@writefile{lof}{\contentsline {figure}{\numberline {\relax 3.10}{\ignorespaces Un exemple de langage machine i486 utilisant le FPU.\relax }}{81}{figure.caption.59}\protected@file@percent }
\newlabel{fig:exemple-FPU}{{\relax 3.10}{81}{Un exemple de langage machine i486 utilisant le FPU.\relax }{figure.caption.59}{}}
\@writefile{lof}{\contentsline {figure}{\numberline {\relax 3.11}{\ignorespaces Sir Maurice \textsc  {Wilkes} en 1980. \relax }}{82}{figure.caption.60}\protected@file@percent }
\newlabel{fig:wilkes}{{\relax 3.11}{82}{Sir Maurice \textsc {Wilkes} en 1980. \relax }{figure.caption.60}{}}
\@writefile{toc}{\contentsline {subsection}{\numberline {3.2.6}Techniques pour améliorer l'efficacité des processeurs}{82}{subsection.3.2.6}\protected@file@percent }
\@writefile{toc}{\contentsline {paragraph}{\nonumberline Exécution en parallèle des instructions}{82}{section*.61}\protected@file@percent }
\@writefile{lof}{\contentsline {figure}{\numberline {\relax 3.12}{\ignorespaces Illustration d'un \textit  {pipeline} à cinq étages.\relax }}{83}{figure.caption.62}\protected@file@percent }
\newlabel{fig:pipeline}{{\relax 3.12}{83}{Illustration d'un \textit {pipeline} à cinq étages.\relax }{figure.caption.62}{}}
\@writefile{toc}{\contentsline {paragraph}{\nonumberline Architectures superscalaires}{83}{section*.63}\protected@file@percent }
\@writefile{lof}{\contentsline {figure}{\numberline {\relax 3.13}{\ignorespaces Un \textit  {pipelie} superscalaire}}{84}{figure.caption.64}\protected@file@percent }
\newlabel{fig:pipeline-super}{{\relax 3.13}{84}{Un \textit {pipelie} superscalaire}{figure.caption.64}{}}
\@writefile{toc}{\contentsline {paragraph}{\nonumberline Processeurs vectoriels ou SIMD}{84}{section*.66}\protected@file@percent }
\@writefile{toc}{\contentsline {paragraph}{\nonumberline Multiprocesseurs}{84}{section*.69}\protected@file@percent }
\@writefile{lof}{\contentsline {figure}{\numberline {\relax 3.14}{\ignorespaces Un ordinateur CDC 6600.\relax }}{85}{figure.caption.65}\protected@file@percent }
\newlabel{fig:cdc6600}{{\relax 3.14}{85}{Un ordinateur CDC 6600.\relax }{figure.caption.65}{}}
\@writefile{lof}{\contentsline {figure}{\numberline {\relax 3.15}{\ignorespaces L'ILLIAC IV}}{86}{figure.caption.67}\protected@file@percent }
\newlabel{fig:illiac4}{{\relax 3.15}{86}{L'ILLIAC IV}{figure.caption.67}{}}
\@writefile{lof}{\contentsline {figure}{\numberline {\relax 3.16}{\ignorespaces Une Cray 1}}{87}{figure.caption.68}\protected@file@percent }
\newlabel{fig:cray1}{{\relax 3.16}{87}{Une Cray 1}{figure.caption.68}{}}
\@writefile{lof}{\contentsline {figure}{\numberline {\relax 3.17}{\ignorespaces L'organisation d'un ordinateur avec 2 CPUs\relax }}{88}{figure.caption.70}\protected@file@percent }
\newlabel{fig:orga-multi}{{\relax 3.17}{88}{L'organisation d'un ordinateur avec 2 CPUs\relax }{figure.caption.70}{}}
\@writefile{toc}{\contentsline {paragraph}{\nonumberline Systèmes multi-c\oe urs}{88}{section*.71}\protected@file@percent }
\@writefile{toc}{\contentsline {paragraph}{\nonumberline Grappes et fermes de calcul}{88}{section*.72}\protected@file@percent }
\@writefile{toc}{\contentsline {section}{\numberline {3.3}Les périphériques}{89}{section.3.3}\protected@file@percent }
\@writefile{toc}{\contentsline {subsection}{\numberline {3.3.1}Mémoire secondaire}{89}{subsection.3.3.1}\protected@file@percent }
\@writefile{lof}{\contentsline {figure}{\numberline {\relax 3.18}{\ignorespaces Une carte perforée telles qu'elles étaient utilisées dans les supermarchés belges Colruyt durant les années 1980 (avant l'utilisation systématique des codes-barre). Les clients devaient collecter une carte perforée pour chaque produit acheté, et le caissier pouvait ensuite imprimer un ticket de caisse détaillé sur base de ces cartes, qui donnaient accès à toute l'information nécessaire sur les produits.\relax }}{90}{figure.caption.74}\protected@file@percent }
\newlabel{fig:punchedcard}{{\relax 3.18}{90}{Une carte perforée telles qu'elles étaient utilisées dans les supermarchés belges Colruyt durant les années 1980 (avant l'utilisation systématique des codes-barre). Les clients devaient collecter une carte perforée pour chaque produit acheté, et le caissier pouvait ensuite imprimer un ticket de caisse détaillé sur base de ces cartes, qui donnaient accès à toute l'information nécessaire sur les produits.\relax }{figure.caption.74}{}}
\@writefile{toc}{\contentsline {paragraph}{\nonumberline Les cartes perforées}{90}{section*.73}\protected@file@percent }
\@writefile{toc}{\contentsline {paragraph}{\nonumberline Les Rubans perforés}{90}{section*.75}\protected@file@percent }
\@writefile{lof}{\contentsline {figure}{\numberline {\relax 3.19}{\ignorespaces Du ruban perforé. \relax }}{91}{figure.caption.76}\protected@file@percent }
\newlabel{fig:punchedtape}{{\relax 3.19}{91}{Du ruban perforé. \relax }{figure.caption.76}{}}
\@writefile{toc}{\contentsline {paragraph}{\nonumberline Les bandes magnétiques}{91}{section*.77}\protected@file@percent }
\@writefile{toc}{\contentsline {paragraph}{\nonumberline Les disques magnétiques}{91}{section*.78}\protected@file@percent }
\@writefile{lof}{\contentsline {figure}{\numberline {\relax 3.20}{\ignorespaces Trois types de disquettes: de 8, $5,25$, et $3,5$ pouces.\relax }}{92}{figure.caption.79}\protected@file@percent }
\newlabel{fig:disquettes}{{\relax 3.20}{92}{Trois types de disquettes: de 8, $5,25$, et $3,5$ pouces.\relax }{figure.caption.79}{}}
\@writefile{toc}{\contentsline {paragraph}{\nonumberline Les disques optiques}{92}{section*.80}\protected@file@percent }
\@writefile{toc}{\contentsline {paragraph}{\nonumberline La mémoire Flash / SSD}{92}{section*.81}\protected@file@percent }
\@writefile{toc}{\contentsline {subsection}{\numberline {3.3.2}Les périphériques d'entrée/sortie}{92}{subsection.3.3.2}\protected@file@percent }
\@writefile{lof}{\contentsline {figure}{\numberline {\relax 3.21}{\ignorespaces Illustration d'un disque dur.\relax }}{93}{figure.caption.82}\protected@file@percent }
\newlabel{fig:hd}{{\relax 3.21}{93}{Illustration d'un disque dur.\relax }{figure.caption.82}{}}
\@writefile{toc}{\contentsline {paragraph}{\nonumberline Accès direct à la mémoire}{94}{section*.83}\protected@file@percent }
\@writefile{toc}{\contentsline {paragraph}{\nonumberline Bus dédiés}{94}{section*.84}\protected@file@percent }
\@setckpt{chapters/03-organisation}{
\setcounter{page}{96}
\setcounter{equation}{0}
\setcounter{enumi}{3}
\setcounter{enumii}{0}
\setcounter{enumiii}{0}
\setcounter{enumiv}{0}
\setcounter{footnote}{21}
\setcounter{mpfootnote}{0}
\setcounter{part}{1}
\setcounter{chapter}{3}
\setcounter{section}{3}
\setcounter{subsection}{2}
\setcounter{subsubsection}{0}
\setcounter{paragraph}{0}
\setcounter{subparagraph}{0}
\setcounter{figure}{21}
\setcounter{table}{0}
\setcounter{FBcaption@count}{0}
\setcounter{parentequation}{0}
\setcounter{lstnumber}{1}
\setcounter{exo}{0}
\setcounter{exercice}{0}
\setcounter{questnum}{0}
\setcounter{Item}{64}
\setcounter{Hfootnote}{46}
\setcounter{Hy@AnnotLevel}{0}
\setcounter{bookmark@seq@number}{0}
\setcounter{r@tfl@t}{3}
\setcounter{tabx@nest}{0}
\setcounter{listtotal}{0}
\setcounter{listcount}{0}
\setcounter{liststart}{0}
\setcounter{liststop}{0}
\setcounter{citecount}{0}
\setcounter{citetotal}{0}
\setcounter{multicitecount}{0}
\setcounter{multicitetotal}{0}
\setcounter{instcount}{36}
\setcounter{maxnames}{3}
\setcounter{minnames}{1}
\setcounter{maxitems}{3}
\setcounter{minitems}{1}
\setcounter{citecounter}{0}
\setcounter{maxcitecounter}{0}
\setcounter{savedcitecounter}{0}
\setcounter{uniquelist}{0}
\setcounter{uniquename}{0}
\setcounter{refsection}{0}
\setcounter{refsegment}{0}
\setcounter{maxextratitle}{0}
\setcounter{maxextratitleyear}{0}
\setcounter{maxextraname}{2}
\setcounter{maxextradate}{0}
\setcounter{maxextraalpha}{0}
\setcounter{abbrvpenalty}{50}
\setcounter{highnamepenalty}{50}
\setcounter{lownamepenalty}{25}
\setcounter{maxparens}{3}
\setcounter{parenlevel}{0}
\setcounter{mincomprange}{10}
\setcounter{maxcomprange}{100000}
\setcounter{mincompwidth}{1}
\setcounter{afterword}{0}
\setcounter{savedafterword}{0}
\setcounter{annotator}{0}
\setcounter{savedannotator}{0}
\setcounter{author}{0}
\setcounter{savedauthor}{0}
\setcounter{bookauthor}{0}
\setcounter{savedbookauthor}{0}
\setcounter{commentator}{0}
\setcounter{savedcommentator}{0}
\setcounter{editor}{0}
\setcounter{savededitor}{0}
\setcounter{editora}{0}
\setcounter{savededitora}{0}
\setcounter{editorb}{0}
\setcounter{savededitorb}{0}
\setcounter{editorc}{0}
\setcounter{savededitorc}{0}
\setcounter{foreword}{0}
\setcounter{savedforeword}{0}
\setcounter{holder}{0}
\setcounter{savedholder}{0}
\setcounter{introduction}{0}
\setcounter{savedintroduction}{0}
\setcounter{namea}{0}
\setcounter{savednamea}{0}
\setcounter{nameb}{0}
\setcounter{savednameb}{0}
\setcounter{namec}{0}
\setcounter{savednamec}{0}
\setcounter{translator}{0}
\setcounter{savedtranslator}{0}
\setcounter{shortauthor}{0}
\setcounter{savedshortauthor}{0}
\setcounter{shorteditor}{0}
\setcounter{savedshorteditor}{0}
\setcounter{labelname}{0}
\setcounter{savedlabelname}{0}
\setcounter{institution}{0}
\setcounter{savedinstitution}{0}
\setcounter{lista}{0}
\setcounter{savedlista}{0}
\setcounter{listb}{0}
\setcounter{savedlistb}{0}
\setcounter{listc}{0}
\setcounter{savedlistc}{0}
\setcounter{listd}{0}
\setcounter{savedlistd}{0}
\setcounter{liste}{0}
\setcounter{savedliste}{0}
\setcounter{listf}{0}
\setcounter{savedlistf}{0}
\setcounter{location}{0}
\setcounter{savedlocation}{0}
\setcounter{organization}{0}
\setcounter{savedorganization}{0}
\setcounter{origlocation}{0}
\setcounter{savedoriglocation}{0}
\setcounter{origpublisher}{0}
\setcounter{savedorigpublisher}{0}
\setcounter{publisher}{0}
\setcounter{savedpublisher}{0}
\setcounter{language}{0}
\setcounter{savedlanguage}{0}
\setcounter{origlanguage}{0}
\setcounter{savedoriglanguage}{0}
\setcounter{pageref}{0}
\setcounter{savedpageref}{0}
\setcounter{textcitecount}{0}
\setcounter{textcitetotal}{0}
\setcounter{textcitemaxnames}{0}
\setcounter{biburlnumpenalty}{0}
\setcounter{biburlucpenalty}{0}
\setcounter{biburllcpenalty}{0}
\setcounter{smartand}{1}
\setcounter{bbx:relatedcount}{0}
\setcounter{bbx:relatedtotal}{0}
\setcounter{ifsymcnt}{0}
\setcounter{caption@flags}{0}
\setcounter{ContinuedFloat}{0}
\setcounter{@todonotes@numberoftodonotes}{0}
\setcounter{tikztiming@nrows}{0}
\setcounter{tikztimingrows}{0}
\setcounter{tikztimingtrans}{0}
\setcounter{tikztimingtranspos}{0}
\setcounter{theorem}{1}
\setcounter{lstlisting}{0}
\setcounter{section@level}{4}
}
