#FIG 3.2  Produced by xfig version 3.2.5-alpha5
Portrait
Center
Inches
Letter  
100.00
Single
-2
1200 2
2 2 1 1 -1 7 0 0 -1 4.000 0 0 0 0 0 5
	 421 331 1680 331 1680 1246 421 1246 421 331
2 2 1 1 -1 7 0 0 -1 4.000 0 0 0 0 0 5
	 202 1111 795 1111 795 1456 202 1456 202 1111
2 2 0 1 -1 7 0 0 -1 0.000 0 0 7 0 0 5
	 152 302 1727 302 1727 1502 152 1502 152 302
2 2 0 1 0 7 105 0 10 0.000 0 0 7 0 0 5
	 227 1277 452 1277 452 1352 227 1352 227 1277
2 2 0 1 0 7 105 0 10 0.000 0 0 7 0 0 5
	 377 1277 527 1277 527 1427 377 1427 377 1277
2 2 0 1 0 7 105 0 10 0.000 0 0 7 0 0 5
	 602 1127 752 1127 752 1427 602 1427 602 1127
2 2 0 1 0 7 105 0 10 0.000 0 0 7 0 0 5
	 452 1052 677 1052 677 1202 452 1202 452 1052
2 2 0 1 0 7 105 0 10 0.000 0 0 7 0 0 5
	 1201 676 1576 676 1576 751 1201 751 1201 676
2 2 0 1 0 7 105 0 10 0.000 0 0 7 0 0 5
	 1275 675 1425 675 1425 1050 1275 1050 1275 675
2 2 0 1 0 7 105 0 10 0.000 0 0 7 0 0 5
	 1201 451 1351 451 1351 601 1201 601 1201 451
2 2 0 1 0 7 105 0 10 0.000 0 0 7 0 0 5
	 1276 376 1651 376 1651 526 1276 526 1276 376
4 0 -1 0 0 1 10 0.0000 4 75 75 226 1051 u\001
4 0 -1 0 0 1 10 0.0000 4 75 75 301 526 v\001
4 0 -1 0 0 1 10 0.0000 4 105 75 1125 1050 8\001
4 0 -1 0 0 1 10 0.0000 4 105 75 577 1005 4\001
4 0 0 105 0 0 10 0.0000 4 135 1455 150 1800 Insertion du rectangle 8\001
