#FIG 3.2
Portrait
Center
Inches
A4      
100.00
Single
-2
1200 2
1 1 0 1 -1 7 0 0 -1 0.000 1 0.0000 1425 825 975 450 1425 825 2400 1275
1 1 0 1 -1 7 0 0 -1 0.000 1 0.0000 4500 975 825 450 4500 975 5325 1425
1 1 0 1 -1 7 0 0 -1 0.000 1 0.0000 3000 1875 975 450 3000 1875 3975 2325
1 3 0 1 0 7 50 0 0 0.000 1 0.0000 2678 1073 56 56 2678 1073 2700 1125
1 3 0 1 0 7 50 0 0 0.000 1 0.0000 3053 848 56 56 3053 848 3075 900
1 3 0 1 0 7 50 0 0 0.000 1 0.0000 2753 623 56 56 2753 623 2775 675
2 2 0 1 0 7 50 0 0 0.000 0 0 -1 0 0 5
	 1950 600 2025 600 2025 675 1950 675 1950 600
2 2 0 1 0 7 50 0 0 0.000 0 0 -1 0 0 5
	 4050 675 4125 675 4125 750 4050 750 4050 675
2 2 0 1 0 7 50 0 0 0.000 0 0 -1 0 0 5
	 2400 1650 2475 1650 2475 1725 2400 1725 2400 1650
2 2 0 1 0 7 50 0 0 0.000 0 0 -1 0 0 5
	 3375 1650 3450 1650 3450 1725 3375 1725 3375 1650
2 1 0 1 0 7 50 0 0 0.000 0 0 -1 0 0 2
	 2025 1050 2625 1050
2 1 0 1 0 7 50 0 0 0.000 0 0 -1 0 0 2
	 2700 1125 2475 1650
2 1 0 1 0 7 50 0 0 0.000 0 0 -1 0 0 2
	 2625 1050 4125 1200
2 1 0 1 0 7 50 0 0 0.000 0 0 -1 0 0 2
	 3450 1650 3075 825
2 1 0 1 0 7 50 0 0 0.000 0 0 -1 0 0 2
	 3075 825 4125 1125
2 2 0 1 0 7 50 0 0 0.000 0 0 -1 0 0 5
	 4050 1125 4125 1125 4125 1200 4050 1200 4050 1125
2 1 0 1 0 7 50 0 0 0.000 0 0 -1 0 0 2
	 2025 600 2775 600
2 1 0 1 0 7 50 0 0 0.000 0 0 -1 0 0 2
	 3375 1650 2775 600
2 1 0 1 0 7 50 0 0 0.000 0 0 -1 0 0 2
	 2775 600 4050 675
2 2 0 1 0 7 50 0 0 0.000 0 0 -1 0 0 5
	 1950 975 2025 975 2025 1050 1950 1050 1950 975
2 1 0 1 0 7 50 0 0 0.000 0 0 -1 0 0 2
	 1953 989 3000 825
4 0 0 100 0 0 10 0.0000 4 135 795 975 675 Phileas Fogg\001
4 0 0 100 0 0 10 0.0000 4 135 615 4200 1200 Van Gogh\001
4 0 0 100 0 0 10 0.0000 4 150 810 4200 750 Ennemi d'\351tat\001
4 0 0 50 0 0 10 0.0000 4 135 915 2100 1875 12 juillet 2023\001
4 0 0 50 0 0 10 0.0000 4 135 675 3150 1875 6 juin 2000\001
4 0 0 50 0 0 10 0.0000 4 105 705 1125 300 Internautes\001
4 0 0 50 0 0 10 0.0000 4 105 375 4275 300 Films\001
4 0 0 50 0 0 10 0.0000 4 105 345 2925 2550 Dates\001
4 0 0 50 0 0 10 0.0000 4 135 855 975 1125 Jules Maigret\001
