code;nom;capitale;aire;pop;continent
AND;Andorra;Andorra la Vella;468.0;77,006;EU
ARE;United Arab Emirates;Abu Dhabi;82,880.0;9,630,959;AS
AFG;Afghanistan;Kabul;647,500.0;37,172,386;AS
ATG;Antigua and Barbuda;St. John's;443.0;96,286;NA
AIA;Anguilla;The Valley;102.0;13,254;NA
ALB;Albania;Tirana;28,748.0;2,866,376;EU
ARM;Armenia;Yerevan;29,800.0;2,951,776;AS
ANT;Netherlands Antilles;Willemstad;960.0;300;NA
AGO;Angola;Luanda;1,246,700.0;30,809,762;AF
ATA;Antarctica;;14,000,000.0;0;AN
ARG;Argentina;Buenos Aires;2,766,890.0;44,494,502;SA
ASM;American Samoa;Pago Pago;199.0;55,465;OC
AUT;Austria;Vienna;83,858.0;8,847,037;EU
AUS;Australia;Canberra;7,686,850.0;24,992,369;OC
ABW;Aruba;Oranjestad;193.0;105,845;NA
ALA;Åland;Mariehamn;1,580.0;26,711;EU
AZE;Azerbaijan;Baku;86,600.0;9,942,334;AS
BIH;Bosnia and Herzegovina;Sarajevo;51,129.0;3,323,929;EU
BRB;Barbados;Bridgetown;431.0;286,641;NA
BGD;Bangladesh;Dhaka;144,000.0;161,356,039;AS
BEL;Belgium;Brussels;30,510.0;11,422,068;EU
BFA;Burkina Faso;Ouagadougou;274,200.0;19,751,535;AF
BGR;Bulgaria;Sofia;110,910.0;7,000,039;EU
BHR;Bahrain;Manama;665.0;1,569,439;AS
BDI;Burundi;Gitega;27,830.0;11,175,378;AF
BEN;Benin;Porto-Novo;112,620.0;11,485,048;AF
BLM;Saint Barthélemy;Gustavia;21.0;8,45;NA
BMU;Bermuda;Hamilton;53.0;63,968;NA
BRN;Brunei;Bandar Seri Begawan;5,770.0;428,962;AS
BOL;Bolivia;Sucre;1,098,580.0;11,353,142;SA
BES;Bonaire, Sint Eustatius, and Saba;;328.0;18,012;NA
BRA;Brazil;Brasilia;8,511,965.0;209,469,333;SA
BHS;Bahamas;Nassau;13,940.0;385,64;NA
BTN;Bhutan;Thimphu;47,000.0;754,394;AS
BVT;Bouvet Island;;49.0;0;AN
BWA;Botswana;Gaborone;600,370.0;2,254,126;AF
BLR;Belarus;Minsk;207,600.0;9,485,386;EU
BLZ;Belize;Belmopan;22,966.0;383,071;NA
CAN;Canada;Ottawa;9,984,670.0;37,058,856;NA
CCK;Cocos [Keeling] Islands;West Island;14.0;628;AS
COD;DR Congo;Kinshasa;2,345,410.0;84,068,091;AF
CAF;Central African Republic;Bangui;622,984.0;4,666,377;AF
COG;Congo Republic;Brazzaville;342,000.0;5,244,363;AF
CHE;Switzerland;Bern;41,290.0;8,516,543;EU
CIV;Ivory Coast;Yamoussoukro;322,460.0;25,069,229;AF
COK;Cook Islands;Avarua;240.0;21,388;OC
CHL;Chile;Santiago;756,950.0;18,729,160;SA
CMR;Cameroon;Yaounde;475,440.0;25,216,237;AF
CHN;China;Beijing;9,596,960.0;1,392,730,000;AS
COL;Colombia;Bogota;1,138,910.0;49,648,685;SA
CRI;Costa Rica;San Jose;51,100.0;4,999,441;NA
SCG;Serbia and Montenegro;Belgrade;102,350.0;10,829,175;EU
CUB;Cuba;Havana;110,860.0;11,338,138;NA
CPV;Cabo Verde;Praia;4,033.0;543,767;AF
CUW;Curaçao;Willemstad;444.0;159,849;NA
CXR;Christmas Island;Flying Fish Cove;135.0;1,5;OC
CYP;Cyprus;Nicosia;9,250.0;1,189,265;EU
CZE;Czechia;Prague;78,866.0;10,625,695;EU
DEU;Germany;Berlin;357,021.0;82,927,922;EU
DJI;Djibouti;Djibouti;23,000.0;958,92;AF
DNK;Denmark;Copenhagen;43,094.0;5,797,446;EU
DMA;Dominica;Roseau;754.0;71,625;NA
DOM;Dominican Republic;Santo Domingo;48,730.0;10,627,165;NA
DZA;Algeria;Algiers;2,381,740.0;42,228,429;AF
ECU;Ecuador;Quito;283,560.0;17,084,357;SA
EST;Estonia;Tallinn;45,226.0;1,320,884;EU
EGY;Egypt;Cairo;1,001,450.0;98,423,595;AF
ESH;Western Sahara;El-Aaiun;266,000.0;273,008;AF
ERI;Eritrea;Asmara;121,320.0;0;AF
ESP;Spain;Madrid;504,782.0;46,723,749;EU
ETH;Ethiopia;Addis Ababa;1,127,127.0;109,224,559;AF
FIN;Finland;Helsinki;337,030.0;5,518,050;EU
FJI;Fiji;Suva;18,270.0;883,483;OC
FLK;Falkland Islands;Stanley;12,173.0;2,638;SA
FSM;Micronesia;Palikir;702.0;112,64;OC
FRO;Faroe Islands;Torshavn;1,399.0;48,497;EU
FRA;France;Paris;547,030.0;66,987,244;EU
GAB;Gabon;Libreville;267,667.0;2,119,275;AF
GBR;United Kingdom;London;244,820.0;66,488,991;EU
GRD;Grenada;St. George's;344.0;111,454;NA
GEO;Georgia;Tbilisi;69,700.0;3,731,000;AS
GUF;French Guiana;Cayenne;91,000.0;195,506;SA
GGY;Guernsey;St Peter Port;78.0;65,228;EU
GHA;Ghana;Accra;239,460.0;29,767,108;AF
GIB;Gibraltar;Gibraltar;6.5;33,718;EU
GRL;Greenland;Nuuk;2,166,086.0;56,025;NA
GMB;Gambia;Banjul;11,300.0;2,280,102;AF
GIN;Guinea;Conakry;245,857.0;12,414,318;AF
GLP;Guadeloupe;Basse-Terre;1,780.0;443;NA
GNQ;Equatorial Guinea;Malabo;28,051.0;1,308,974;AF
GRC;Greece;Athens;131,940.0;10,727,668;EU
SGS;South Georgia and South Sandwich Islands;Grytviken;3,903.0;30;AN
GTM;Guatemala;Guatemala City;108,890.0;17,247,807;NA
GUM;Guam;Hagatna;549.0;165,768;OC
GNB;Guinea-Bissau;Bissau;36,120.0;1,874,309;AF
GUY;Guyana;Georgetown;214,970.0;779,004;SA
HKG;Hong Kong;Hong Kong;1,092.0;7,451,000;AS
HMD;Heard Island and McDonald Islands;;412.0;0;AN
HND;Honduras;Tegucigalpa;112,090.0;9,587,522;NA
HRV;Croatia;Zagreb;56,542.0;4,089,400;EU
HTI;Haiti;Port-au-Prince;27,750.0;11,123,176;NA
HUN;Hungary;Budapest;93,030.0;9,768,785;EU
IDN;Indonesia;Jakarta;1,919,440.0;267,663,435;AS
IRL;Ireland;Dublin;70,280.0;4,853,506;EU
ISR;Israel;Jerusalem;20,770.0;8,883,800;AS
IMN;Isle of Man;Douglas;572.0;84,077;EU
IND;India;New Delhi;3,287,590.0;1,352,617,328;AS
IOT;British Indian Ocean Territory;Diego Garcia;60.0;4;AS
IRQ;Iraq;Baghdad;437,072.0;38,433,600;AS
IRN;Iran;Tehran;1,648,000.0;81,800,269;AS
ISL;Iceland;Reykjavik;103,000.0;353,574;EU
ITA;Italy;Rome;301,230.0;60,431,283;EU
JEY;Jersey;Saint Helier;116.0;90,812;EU
JAM;Jamaica;Kingston;10,991.0;2,934,855;NA
JOR;Jordan;Amman;92,300.0;9,956,011;AS
JPN;Japan;Tokyo;377,835.0;126,529,100;AS
KEN;Kenya;Nairobi;582,650.0;51,393,010;AF
KGZ;Kyrgyzstan;Bishkek;198,500.0;6,315,800;AS
KHM;Cambodia;Phnom Penh;181,040.0;16,249,798;AS
KIR;Kiribati;Tarawa;811.0;115,847;OC
COM;Comoros;Moroni;2,170.0;832,322;AF
KNA;St Kitts and Nevis;Basseterre;261.0;52,441;NA
PRK;North Korea;Pyongyang;120,540.0;25,549,819;AS
KOR;South Korea;Seoul;98,480.0;51,635,256;AS
KWT;Kuwait;Kuwait City;17,820.0;4,137,309;AS
CYM;Cayman Islands;George Town;262.0;64,174;NA
KAZ;Kazakhstan;Nur-Sultan;2,717,300.0;18,276,499;AS
LAO;Laos;Vientiane;236,800.0;7,061,507;AS
LBN;Lebanon;Beirut;10,400.0;6,848,925;AS
LCA;Saint Lucia;Castries;616.0;181,889;NA
LIE;Liechtenstein;Vaduz;160.0;37,91;EU
LKA;Sri Lanka;Colombo;65,610.0;21,670,000;AS
LBR;Liberia;Monrovia;111,370.0;4,818,977;AF
LSO;Lesotho;Maseru;30,355.0;2,108,132;AF
LTU;Lithuania;Vilnius;65,200.0;2,789,533;EU
LUX;Luxembourg;Luxembourg;2,586.0;607,728;EU
LVA;Latvia;Riga;64,589.0;1,926,542;EU
LBY;Libya;Tripoli;1,759,540.0;6,678,567;AF
MAR;Morocco;Rabat;446,550.0;36,029,138;AF
MCO;Monaco;Monaco;1.9;38,682;EU
MDA;Moldova;Chisinau;33,843.0;3,545,883;EU
MNE;Montenegro;Podgorica;14,026.0;622,345;EU
MAF;Saint Martin;Marigot;53.0;37,264;NA
MDG;Madagascar;Antananarivo;587,040.0;26,262,368;AF
MHL;Marshall Islands;Majuro;181.3;58,413;OC
MKD;North Macedonia;Skopje;25,333.0;2,082,958;EU
MLI;Mali;Bamako;1,240,000.0;19,077,690;AF
MMR;Myanmar;Nay Pyi Taw;678,500.0;53,708,395;AS
MNG;Mongolia;Ulaanbaatar;1,565,000.0;3,170,208;AS
MAC;Macao;Macao;254.0;631,636;AS
MNP;Northern Mariana Islands;Saipan;477.0;56,882;OC
MTQ;Martinique;Fort-de-France;1,100.0;432,9;NA
MRT;Mauritania;Nouakchott;1,030,700.0;4,403,319;AF
MSR;Montserrat;Plymouth;102.0;9,341;NA
MLT;Malta;Valletta;316.0;483,53;EU
MUS;Mauritius;Port Louis;2,040.0;1,265,303;AF
MDV;Maldives;Male;300.0;515,696;AS
MWI;Malawi;Lilongwe;118,480.0;17,563,749;AF
MEX;Mexico;Mexico City;1,972,550.0;126,190,788;NA
MYS;Malaysia;Kuala Lumpur;329,750.0;31,528,585;AS
MOZ;Mozambique;Maputo;801,590.0;29,495,962;AF
NAM;Namibia;Windhoek;825,418.0;2,448,255;AF
NCL;New Caledonia;Noumea;19,060.0;284,06;OC
NER;Niger;Niamey;1,267,000.0;22,442,948;AF
NFK;Norfolk Island;Kingston;34.6;1,828;OC
NGA;Nigeria;Abuja;923,768.0;195,874,740;AF
NIC;Nicaragua;Managua;129,494.0;6,465,513;NA
NLD;Netherlands;Amsterdam;41,526.0;17,231,017;EU
NOR;Norway;Oslo;324,220.0;5,314,336;EU
NPL;Nepal;Kathmandu;140,800.0;28,087,871;AS
NRU;Nauru;Yaren;21.0;12,704;OC
NIU;Niue;Alofi;260.0;2,166;OC
NZL;New Zealand;Wellington;268,680.0;4,885,500;OC
OMN;Oman;Muscat;212,460.0;4,829,483;AS
PAN;Panama;Panama City;78,200.0;4,176,873;NA
PER;Peru;Lima;1,285,220.0;31,989,256;SA
PYF;French Polynesia;Papeete;4,167.0;277,679;OC
PNG;Papua New Guinea;Port Moresby;462,840.0;8,606,316;OC
PHL;Philippines;Manila;300,000.0;106,651,922;AS
PAK;Pakistan;Islamabad;803,940.0;212,215,030;AS
POL;Poland;Warsaw;312,685.0;37,978,548;EU
SPM;Saint Pierre and Miquelon;Saint-Pierre;242.0;7,012;NA
PCN;Pitcairn Islands;Adamstown;47.0;46;OC
PRI;Puerto Rico;San Juan;9,104.0;3,195,153;NA
PSE;Palestine;East Jerusalem;5,970.0;4,569,087;AS
PRT;Portugal;Lisbon;92,391.0;10,281,762;EU
PLW;Palau;Melekeok;458.0;17,907;OC
PRY;Paraguay;Asuncion;406,750.0;6,956,071;SA
QAT;Qatar;Doha;11,437.0;2,781,677;AS
REU;Réunion;Saint-Denis;2,517.0;776,948;AF
ROU;Romania;Bucharest;237,500.0;19,473,936;EU
SRB;Serbia;Belgrade;88,361.0;6,982,084;EU
RUS;Russia;Moscow;17,100,000.0;144,478,050;EU
RWA;Rwanda;Kigali;26,338.0;12,301,939;AF
SAU;Saudi Arabia;Riyadh;1,960,582.0;33,699,947;AS
SLB;Solomon Islands;Honiara;28,450.0;652,858;OC
SYC;Seychelles;Victoria;455.0;96,762;AF
SDN;Sudan;Khartoum;1,861,484.0;41,801,533;AF
SWE;Sweden;Stockholm;449,964.0;10,183,175;EU
SGP;Singapore;Singapore;692.7;5,638,676;AS
SHN;Saint Helena;Jamestown;410.0;7,46;AF
SVN;Slovenia;Ljubljana;20,273.0;2,067,372;EU
SJM;Svalbard and Jan Mayen;Longyearbyen;62,049.0;2,55;EU
SVK;Slovakia;Bratislava;48,845.0;5,447,011;EU
SLE;Sierra Leone;Freetown;71,740.0;7,650,154;AF
SMR;San Marino;San Marino;61.2;33,785;EU
SEN;Senegal;Dakar;196,190.0;15,854,360;AF
SOM;Somalia;Mogadishu;637,657.0;15,008,154;AF
SUR;Suriname;Paramaribo;163,270.0;575,991;SA
SSD;South Sudan;Juba;644,329.0;8,260,490;AF
STP;São Tomé and Príncipe;Sao Tome;1,001.0;197,7;AF
SLV;El Salvador;San Salvador;21,040.0;6,420,744;NA
SXM;Sint Maarten;Philipsburg;21.0;40,654;NA
SYR;Syria;Damascus;185,180.0;16,906,283;AS
SWZ;Eswatini;Mbabane;17,363.0;1,136,191;AF
TCA;Turks and Caicos Islands;Cockburn Town;430.0;37,665;NA
TCD;Chad;N'Djamena;1,284,000.0;15,477,751;AF
ATF;French Southern Territories;Port-aux-Francais;7,829.0;140;AN
TGO;Togo;Lome;56,785.0;7,889,094;AF
THA;Thailand;Bangkok;514,000.0;69,428,524;AS
TJK;Tajikistan;Dushanbe;143,100.0;9,100,837;AS
TKL;Tokelau;;10.0;1,466;OC
TLS;Timor-Leste;Dili;15,007.0;1,267,972;OC
TKM;Turkmenistan;Ashgabat;488,100.0;5,850,908;AS
TUN;Tunisia;Tunis;163,610.0;11,565,204;AF
TON;Tonga;Nuku'alofa;748.0;103,197;OC
TUR;Turkey;Ankara;780,580.0;82,319,724;AS
TTO;Trinidad and Tobago;Port of Spain;5,128.0;1,389,858;NA
TUV;Tuvalu;Funafuti;26.0;11,508;OC
TWN;Taiwan;Taipei;35,980.0;22,894,384;AS
TZA;Tanzania;Dodoma;945,087.0;56,318,348;AF
UKR;Ukraine;Kyiv;603,700.0;44,622,516;EU
UGA;Uganda;Kampala;236,040.0;42,723,139;AF
UMI;U.S. Minor Outlying Islands;;0.0;0;OC
USA;United States;Washington;9,629,091.0;327,167,434;NA
URY;Uruguay;Montevideo;176,220.0;3,449,299;SA
UZB;Uzbekistan;Tashkent;447,400.0;32,955,400;AS
VAT;Vatican City;Vatican City;0.4;921;EU
VCT;St Vincent and Grenadines;Kingstown;389.0;110,211;NA
VEN;Venezuela;Caracas;912,050.0;28,870,195;SA
VGB;British Virgin Islands;Road Town;153.0;29,802;NA
VIR;U.S. Virgin Islands;Charlotte Amalie;352.0;106,977;NA
VNM;Vietnam;Hanoi;329,560.0;95,540,395;AS
VUT;Vanuatu;Port Vila;12,200.0;292,68;OC
WLF;Wallis and Futuna;Mata Utu;274.0;16,025;OC
WSM;Samoa;Apia;2,944.0;196,13;OC
XKX;Kosovo;Pristina;10,908.0;1,845,300;EU
YEM;Yemen;Sanaa;527,970.0;28,498,687;AS
MYT;Mayotte;Mamoudzou;374.0;279,471;AF
ZAF;South Africa;Pretoria;1,219,912.0;57,779,622;AF
ZMB;Zambia;Lusaka;752,614.0;17,351,822;AF
ZWE;Zimbabwe;Harare;390,580.0;14,439,018;AF
