%!PS-Adobe-2.0 EPSF-2.0
%%Title: splitting.eps
%%Creator: fig2dev Version 3.2 Patchlevel 1
%%CreationDate: Mon Jul 31 10:51:25 2000
%%For: rigaux@cartier ()
%%Orientation: Portrait
%%BoundingBox: 0 0 245 112
%%Pages: 0
%%BeginSetup
%%EndSetup
%%Magnification: 1.0000
%%EndComments
/$F2psDict 200 dict def
$F2psDict begin
$F2psDict /mtrx matrix put
/col-1 {0 setgray} bind def
/col0 {0.000 0.000 0.000 srgb} bind def
/col1 {0.000 0.000 1.000 srgb} bind def
/col2 {0.000 1.000 0.000 srgb} bind def
/col3 {0.000 1.000 1.000 srgb} bind def
/col4 {1.000 0.000 0.000 srgb} bind def
/col5 {1.000 0.000 1.000 srgb} bind def
/col6 {1.000 1.000 0.000 srgb} bind def
/col7 {1.000 1.000 1.000 srgb} bind def
/col8 {0.000 0.000 0.560 srgb} bind def
/col9 {0.000 0.000 0.690 srgb} bind def
/col10 {0.000 0.000 0.820 srgb} bind def
/col11 {0.530 0.810 1.000 srgb} bind def
/col12 {0.000 0.560 0.000 srgb} bind def
/col13 {0.000 0.690 0.000 srgb} bind def
/col14 {0.000 0.820 0.000 srgb} bind def
/col15 {0.000 0.560 0.560 srgb} bind def
/col16 {0.000 0.690 0.690 srgb} bind def
/col17 {0.000 0.820 0.820 srgb} bind def
/col18 {0.560 0.000 0.000 srgb} bind def
/col19 {0.690 0.000 0.000 srgb} bind def
/col20 {0.820 0.000 0.000 srgb} bind def
/col21 {0.560 0.000 0.560 srgb} bind def
/col22 {0.690 0.000 0.690 srgb} bind def
/col23 {0.820 0.000 0.820 srgb} bind def
/col24 {0.500 0.190 0.000 srgb} bind def
/col25 {0.630 0.250 0.000 srgb} bind def
/col26 {0.750 0.380 0.000 srgb} bind def
/col27 {1.000 0.500 0.500 srgb} bind def
/col28 {1.000 0.630 0.630 srgb} bind def
/col29 {1.000 0.750 0.750 srgb} bind def
/col30 {1.000 0.880 0.880 srgb} bind def
/col31 {1.000 0.840 0.000 srgb} bind def

end
save
-62.0 120.0 translate
1 -1 scale

/cp {closepath} bind def
/ef {eofill} bind def
/gr {grestore} bind def
/gs {gsave} bind def
/sa {save} bind def
/rs {restore} bind def
/l {lineto} bind def
/m {moveto} bind def
/rm {rmoveto} bind def
/n {newpath} bind def
/s {stroke} bind def
/sh {show} bind def
/slc {setlinecap} bind def
/slj {setlinejoin} bind def
/slw {setlinewidth} bind def
/srgb {setrgbcolor} bind def
/rot {rotate} bind def
/sc {scale} bind def
/sd {setdash} bind def
/ff {findfont} bind def
/sf {setfont} bind def
/scf {scalefont} bind def
/sw {stringwidth} bind def
/tr {translate} bind def
/tnt {dup dup currentrgbcolor
  4 -2 roll dup 1 exch sub 3 -1 roll mul add
  4 -2 roll dup 1 exch sub 3 -1 roll mul add
  4 -2 roll dup 1 exch sub 3 -1 roll mul add srgb}
  bind def
/shd {dup dup currentrgbcolor 4 -2 roll mul 4 -2 roll mul
  4 -2 roll mul srgb} bind def
/$F2psBegin {$F2psDict begin /$F2psEnteredState save def} def
/$F2psEnd {$F2psEnteredState restore end} def
%%EndProlog

$F2psBegin
10 setmiterlimit
n -1000 2990 m -1000 -1000 l 6101 -1000 l 6101 2990 l cp clip
 0.06000 0.06000 sc
/Times-Roman ff 150.00 scf sf
1050 1950 m
gs 1 -1 sc (A split with minimal area) col0 sh gr
/Times-Roman ff 150.00 scf sf
3225 1950 m
gs 1 -1 sc (A split with minimal overlap) col0 sh gr
% Polyline
7.500 slw
n 4051 527 m 4727 527 l 4727 826 l 4051 826 l cp gs col-1 s gr 
% Polyline
n 4052 227 m 4351 227 l 4351 1576 l 4052 1576 l cp gs col-1 s gr 
% Polyline
n 3227 527 m 3902 527 l 3902 827 l 3227 827 l cp gs col-1 s gr 
% Polyline
n 3602 227 m 3902 227 l 3902 1577 l 3602 1577 l cp gs col-1 s gr 
% Polyline
n 1951 527 m 2627 527 l 2627 826 l 1951 826 l cp gs col-1 s gr 
% Polyline
n 1952 227 m 2251 227 l 2251 1576 l 1952 1576 l cp gs col-1 s gr 
% Polyline
n 1127 527 m 1802 527 l 1802 827 l 1127 827 l cp gs col-1 s gr 
% Polyline
n 1502 227 m 1802 227 l 1802 1577 l 1502 1577 l cp gs col-1 s gr 
% Polyline
 [60] 0 sd
n 3150 150 m 3975 150 l 3975 1650 l 3150 1650 l cp gs col-1 s gr  [] 0 sd
% Polyline
 [60] 0 sd
n 3975 150 m 4800 150 l 4800 1650 l 3975 1650 l cp gs col-1 s gr  [] 0 sd
% Polyline
 [60] 0 sd
n 1425 150 m 2325 150 l 2325 1650 l 1425 1650 l cp gs col-1 s gr  [] 0 sd
% Polyline
 [60] 0 sd
n 1050 450 m 2700 450 l 2700 900 l 1050 900 l cp gs col-1 s gr  [] 0 sd
$F2psEnd
rs
