#FIG 3.2
Landscape
Center
Inches
Letter  
100.00
Single
-2
1200 2
2 1 0 1 0 7 0 0 -1 0.000 0 0 -1 0 0 2
	 1350 1275 1350 2100
2 1 0 1 0 7 0 0 -1 0.000 0 0 -1 0 0 2
	 1350 2100 3150 1275
2 1 0 1 0 7 0 0 -1 0.000 0 0 -1 0 0 2
	 3150 1275 3150 2100
2 1 0 1 0 7 0 0 -1 0.000 0 0 -1 0 0 2
	 3150 2100 1350 1275
2 3 0 1 0 7 0 0 -1 0.000 0 0 -1 0 0 3
	 1350 2250 1200 3225 1350 2250
2 1 0 1 0 7 0 0 -1 0.000 0 0 -1 0 0 2
	 1200 3825 1050 4950
2 1 0 1 0 7 0 0 -1 0.000 0 0 -1 0 0 2
	 3150 2175 3975 4950
2 1 0 1 0 7 0 0 -1 0.000 0 0 -1 0 0 4
	 2025 750 2025 525 2550 525 2550 750
2 1 0 1 0 7 0 0 -1 0.000 0 0 -1 0 0 3
	 2025 525 1950 525 2025 525
2 1 0 1 0 7 0 0 -1 0.000 0 0 -1 0 0 3
	 2550 525 2775 525 2700 525
2 1 0 1 0 7 0 0 -1 0.000 0 0 -1 0 0 2
	 2250 900 2250 1575
3 2 0 1 0 7 0 0 -1 0.000 0 0 0 8
	 1500 3300 1275 3300 1050 3450 1050 3600 1200 3675 1350 3600
	 1275 3450 1125 3375
	 0.000 -1.000 -1.000 -1.000 -1.000 -1.000 -1.000 0.000
4 0 0 0 0 0 12 0.0000 4 165 1305 1425 3675 Nbhab>1,000,000\001
4 0 0 0 0 0 12 0.0000 4 180 810 1725 2250 #dept=num\001
4 0 0 0 0 0 12 0.0000 4 135 810 750 5400 Communes\001
4 0 0 0 0 0 12 0.0000 4 180 975 3675 5400 Departements\001
4 0 0 0 0 0 12 0.0000 4 180 1335 2700 900 Departements.nom\001
