#FIG 3.2
Landscape
Center
Inches
Letter  
100.00
Single
-2
1200 2
2 2 0 1 0 7 0 0 -1 0.000 0 0 -1 0 0 5
	 300 600 3150 600 3150 2850 300 2850 300 600
2 2 0 1 0 7 0 0 -1 0.000 0 0 -1 0 0 5
	 4575 600 9975 600 9975 1650 4575 1650 4575 600
2 2 0 1 0 7 0 0 -1 0.000 0 0 -1 0 0 5
	 4575 2175 7125 2175 7125 3000 4575 3000 4575 2175
2 2 0 1 0 7 0 0 -1 0.000 0 0 -1 0 0 5
	 7800 2175 10200 2175 10200 3000 7800 3000 7800 2175
2 2 0 1 0 7 0 0 -1 0.000 0 0 -1 0 0 5
	 6225 3675 7425 3675 7425 4125 6225 4125 6225 3675
2 2 0 1 0 7 0 0 -1 0.000 0 0 -1 0 0 5
	 10200 3600 11400 3600 11400 4050 10200 4050 10200 3600
2 2 0 1 0 7 0 0 -1 0.000 0 0 -1 0 0 5
	 3375 5100 4575 5100 4575 5550 3375 5550 3375 5100
2 2 0 1 0 7 0 0 -1 0.000 0 0 -1 0 0 5
	 7875 5025 9075 5025 9075 5475 7875 5475 7875 5025
2 2 0 1 0 7 0 0 -1 0.000 0 0 -1 0 0 5
	 9525 5025 10725 5025 10725 5475 9525 5475 9525 5025
2 2 0 1 0 7 0 0 -1 0.000 0 0 -1 0 0 5
	 5325 5100 6525 5100 6525 5550 5325 5550 5325 5100
2 2 0 1 0 7 0 0 -1 0.000 0 0 -1 0 0 5
	 3600 3675 5625 3675 5625 4425 3600 4425 3600 3675
2 2 0 1 0 7 0 0 -1 0.000 0 0 -1 0 0 5
	 7725 3600 9750 3600 9750 4350 7725 4350 7725 3600
2 1 0 1 0 7 0 0 -1 0.000 0 0 -1 0 0 2
	 6975 1650 5925 2175
2 1 0 1 0 7 0 0 -1 0.000 0 0 -1 0 0 2
	 7875 1650 8925 2175
2 1 0 1 0 7 0 0 -1 0.000 0 0 -1 0 0 2
	 5775 3000 4650 3675
2 1 0 1 0 7 0 0 -1 0.000 0 0 -1 0 0 2
	 6150 3000 6825 3675
2 1 0 1 0 7 0 0 -1 0.000 0 0 -1 0 0 2
	 4350 4425 3975 5100
2 1 0 1 0 7 0 0 -1 0.000 0 0 -1 0 0 2
	 4950 4425 5925 5100
2 1 0 1 0 7 0 0 -1 0.000 0 0 -1 0 0 2
	 8775 4350 8400 5025
2 1 0 1 0 7 0 0 -1 0.000 0 0 -1 0 0 2
	 9300 4350 10050 5025
2 1 0 1 0 7 0 0 -1 0.000 0 0 -1 0 0 2
	 9075 3000 8700 3600
2 1 0 1 0 7 0 0 -1 0.000 0 0 -1 0 0 2
	 9375 3000 10575 3600
4 0 0 0 0 0 12 0.0000 4 180 540 450 825 Vertigo\001
4 0 0 0 0 0 12 0.0000 4 135 780 450 1200 Annie Hall\001
4 0 0 0 0 0 12 0.0000 4 135 840 450 1575 Twin Peaks\001
4 0 0 0 0 0 12 0.0000 4 135 420 450 1950 Brazil\001
4 0 0 0 0 0 12 0.0000 4 180 675 450 2325 Psychose\001
4 0 0 0 0 0 12 0.0000 4 180 780 450 2700 Metropolis\001
4 0 0 0 0 0 12 0.0000 4 180 960 1875 1575 Underground\001
4 0 0 0 0 0 12 0.0000 4 180 735 1875 1275 Greystoke\001
4 0 0 0 0 0 12 0.0000 4 180 555 1875 900 Shining\001
4 0 0 0 0 0 12 0.0000 4 135 780 4875 900 Annie Hall\001
4 0 0 0 0 0 12 0.0000 4 135 420 4875 1200 Brazil\001
4 0 0 0 0 0 12 0.0000 4 180 720 4875 1500 Easy rider\001
4 0 0 0 0 0 12 0.0000 4 180 735 6075 900 Greystoke\001
4 0 0 0 0 0 12 0.0000 4 135 945 6075 1200 Jurassic Park\001
4 0 0 0 0 0 12 0.0000 4 135 750 6075 1500 Manhattan\001
4 0 0 0 0 0 12 0.0000 4 180 780 7350 900 Metropolis\001
4 0 0 0 0 0 12 0.0000 4 180 675 7425 1200 Psychose\001
4 0 0 0 0 0 12 0.0000 4 180 555 7500 1500 Shining\001
4 0 0 0 0 0 12 0.0000 4 135 840 8700 900 Twin Peaks\001
4 0 0 0 0 0 12 0.0000 4 180 960 8700 1200 Underground\001
4 0 0 0 0 0 12 0.0000 4 180 540 8775 1500 Vertigo\001
4 0 0 0 0 0 12 0.0000 4 180 720 1875 2700 Easy rider\001
4 0 0 0 0 0 12 0.0000 4 135 750 1875 2325 Manhattan\001
4 0 0 0 0 0 12 0.0000 4 135 945 1875 1950 Jurassic Park\001
4 0 0 0 0 0 12 0.0000 4 180 540 3600 5475 Vertigo\001
4 0 0 0 0 0 12 0.0000 4 135 780 3600 5250 Annie Hall\001
4 0 0 0 0 0 12 0.0000 4 135 420 5550 5250 Brazil\001
4 0 0 0 0 0 12 0.0000 4 135 840 5550 5475 Twin Peaks\001
4 0 0 0 0 0 12 0.0000 4 135 945 6375 3825 Jurassic Park\001
4 0 0 0 0 0 12 0.0000 4 180 960 6375 4050 Underground\001
4 0 0 0 0 0 12 0.0000 4 135 780 3750 3900 Annie Hall\001
4 0 0 0 0 0 12 0.0000 4 135 420 3750 4200 Brazil\001
4 0 0 0 0 0 12 0.0000 4 135 840 4650 3900 Twin Peaks\001
4 0 0 0 0 0 12 0.0000 4 180 540 4650 4200 Vertigo\001
4 0 0 0 0 0 12 0.0000 4 180 780 8025 5175 Metropolis\001
4 0 0 0 0 0 12 0.0000 4 180 675 8100 5400 Psychose\001
4 0 0 0 0 0 12 0.0000 4 180 735 9750 5175 Greystoke\001
4 0 0 0 0 0 12 0.0000 4 180 555 9750 5400 Shining\001
4 0 0 0 0 0 12 0.0000 4 180 735 7950 3900 Greystoke\001
4 0 0 0 0 0 12 0.0000 4 180 780 7950 4200 Metropolis\001
4 0 0 0 0 0 12 0.0000 4 180 675 8925 3900 Psychose\001
4 0 0 0 0 0 12 0.0000 4 180 555 9000 4200 Shining\001
4 0 0 0 0 0 12 0.0000 4 135 780 4725 2400 Annie Hall\001
4 0 0 0 0 0 12 0.0000 4 135 420 4725 2625 Brazil\001
4 0 0 0 0 0 12 0.0000 4 135 945 4725 2850 Jurassic Park\001
4 0 0 0 0 0 12 0.0000 4 135 840 5850 2400 Twin Peaks\001
4 0 0 0 0 0 12 0.0000 4 180 540 5850 2850 Vertigo\001
4 0 0 0 0 0 12 0.0000 4 180 960 5850 2625 Underground\001
4 0 0 0 0 0 12 0.0000 4 180 780 7950 2400 Easy Rider\001
4 0 0 0 0 0 12 0.0000 4 180 735 7950 2625 Greystoke\001
4 0 0 0 0 0 12 0.0000 4 135 750 7950 2850 Manhattan\001
4 0 0 0 0 0 12 0.0000 4 180 780 9000 2400 Metropolis\001
4 0 0 0 0 0 12 0.0000 4 180 555 9075 2850 Shining\001
4 0 0 0 0 0 12 0.0000 4 180 675 9000 2625 Psychose\001
4 0 0 0 0 0 12 0.0000 4 180 780 10350 3750 Easy Rider\001
4 0 0 0 0 0 12 0.0000 4 135 750 10350 3975 Manhattan\001
