%!PS-Adobe-2.0 EPSF-2.0
%%Title: hashext-1.eps
%%Creator: fig2dev Version 3.2.3 Patchlevel 
%%CreationDate: Tue Mar 12 22:04:22 2002
%%For: rigaux@cartier (Philippe Rigaux)
%%BoundingBox: 0 0 141 119
%%Magnification: 1.0000
%%EndComments
/$F2psDict 200 dict def
$F2psDict begin
$F2psDict /mtrx matrix put
/col-1 {0 setgray} bind def
/col0 {0.000 0.000 0.000 srgb} bind def
/col1 {0.000 0.000 1.000 srgb} bind def
/col2 {0.000 1.000 0.000 srgb} bind def
/col3 {0.000 1.000 1.000 srgb} bind def
/col4 {1.000 0.000 0.000 srgb} bind def
/col5 {1.000 0.000 1.000 srgb} bind def
/col6 {1.000 1.000 0.000 srgb} bind def
/col7 {1.000 1.000 1.000 srgb} bind def
/col8 {0.000 0.000 0.560 srgb} bind def
/col9 {0.000 0.000 0.690 srgb} bind def
/col10 {0.000 0.000 0.820 srgb} bind def
/col11 {0.530 0.810 1.000 srgb} bind def
/col12 {0.000 0.560 0.000 srgb} bind def
/col13 {0.000 0.690 0.000 srgb} bind def
/col14 {0.000 0.820 0.000 srgb} bind def
/col15 {0.000 0.560 0.560 srgb} bind def
/col16 {0.000 0.690 0.690 srgb} bind def
/col17 {0.000 0.820 0.820 srgb} bind def
/col18 {0.560 0.000 0.000 srgb} bind def
/col19 {0.690 0.000 0.000 srgb} bind def
/col20 {0.820 0.000 0.000 srgb} bind def
/col21 {0.560 0.000 0.560 srgb} bind def
/col22 {0.690 0.000 0.690 srgb} bind def
/col23 {0.820 0.000 0.820 srgb} bind def
/col24 {0.500 0.190 0.000 srgb} bind def
/col25 {0.630 0.250 0.000 srgb} bind def
/col26 {0.750 0.380 0.000 srgb} bind def
/col27 {1.000 0.500 0.500 srgb} bind def
/col28 {1.000 0.630 0.630 srgb} bind def
/col29 {1.000 0.750 0.750 srgb} bind def
/col30 {1.000 0.880 0.880 srgb} bind def
/col31 {1.000 0.840 0.000 srgb} bind def

end
save
newpath 0 119 moveto 0 0 lineto 141 0 lineto 141 119 lineto closepath clip newpath
-13.0 172.0 translate
1 -1 scale

/cp {closepath} bind def
/ef {eofill} bind def
/gr {grestore} bind def
/gs {gsave} bind def
/sa {save} bind def
/rs {restore} bind def
/l {lineto} bind def
/m {moveto} bind def
/rm {rmoveto} bind def
/n {newpath} bind def
/s {stroke} bind def
/sh {show} bind def
/slc {setlinecap} bind def
/slj {setlinejoin} bind def
/slw {setlinewidth} bind def
/srgb {setrgbcolor} bind def
/rot {rotate} bind def
/sc {scale} bind def
/sd {setdash} bind def
/ff {findfont} bind def
/sf {setfont} bind def
/scf {scalefont} bind def
/sw {stringwidth} bind def
/tr {translate} bind def
/tnt {dup dup currentrgbcolor
  4 -2 roll dup 1 exch sub 3 -1 roll mul add
  4 -2 roll dup 1 exch sub 3 -1 roll mul add
  4 -2 roll dup 1 exch sub 3 -1 roll mul add srgb}
  bind def
/shd {dup dup currentrgbcolor 4 -2 roll mul 4 -2 roll mul
  4 -2 roll mul srgb} bind def
/$F2psBegin {$F2psDict begin /$F2psEnteredState save def} def
/$F2psEnd {$F2psEnteredState restore end} def

$F2psBegin
%%Page: 1 1
10 setmiterlimit
 0.06000 0.06000 sc
% Polyline
n 330 900 m 225 900 225 2745 105 arcto 4 {pop} repeat
  225 2850 2445 2850 105 arcto 4 {pop} repeat
  2550 2850 2550 1005 105 arcto 4 {pop} repeat
  2550 900 330 900 105 arcto 4 {pop} repeat
 cp gs col7 1.00 shd ef gr 
% Polyline
7.500 slw
n 375 2025 m
 825 2025 l gs col0 s gr 
% Polyline
n 375 1800 m 825 1800 l 825 2250 l 375 2250 l
 cp gs col0 s gr 
/Times-Roman ff 150.00 scf sf
525 1950 m
gs 1 -1 sc (0) col0 sh gr
/Times-Roman ff 150.00 scf sf
525 2175 m
gs 1 -1 sc (1) col0 sh gr
% Polyline
n 1575 1875 m 2475 1875 l 2475 2700 l 1575 2700 l
 cp gs col0 s gr 
/Times-Roman ff 150.00 scf sf
1650 2100 m
gs 1 -1 sc (Brazil) col0 sh gr
/Times-Roman ff 150.00 scf sf
1650 2325 m
gs 1 -1 sc (Twin Peaks) col0 sh gr
% Polyline
n 1575 975 m 2475 975 l 2475 1800 l 1575 1800 l
 cp gs col0 s gr 
/Times-Roman ff 150.00 scf sf
1650 1575 m
gs 1 -1 sc (Underground) col0 sh gr
/Times-Roman ff 150.00 scf sf
1650 1350 m
gs 1 -1 sc (Easy Rider) col0 sh gr
/Times-Roman ff 150.00 scf sf
1650 1125 m
gs 1 -1 sc (Vertigo) col0 sh gr
% Polyline
gs  clippath
1590 1380 m 1590 1320 l 1439 1320 l 1559 1350 l 1439 1380 l cp
eoclip
n 825 1950 m 1200 1950 l 1200 1350 l
 1575 1350 l gs col0 s gr gr

% arrowhead
n 1439 1380 m 1559 1350 l 1439 1320 l 1439 1380 l  cp gs 0.00 setgray ef gr  col0 s
% Polyline
gs  clippath
1590 2355 m 1590 2295 l 1439 2295 l 1559 2325 l 1439 2355 l cp
eoclip
n 825 2175 m 1200 2175 l 1200 2325 l
 1575 2325 l gs col0 s gr gr

% arrowhead
n 1439 2355 m 1559 2325 l 1439 2295 l 1439 2355 l  cp gs 0.00 setgray ef gr  col0 s
$F2psEnd
rs
