%!PS-Adobe-2.0 EPSF-2.0
%%Title: planex2.eps
%%Creator: fig2dev Version 3.2 Patchlevel 1
%%CreationDate: Tue Sep 12 17:03:35 2000
%%For: rigaux@cartier ()
%%Orientation: Portrait
%%BoundingBox: 0 0 399 135
%%Pages: 0
%%BeginSetup
%%EndSetup
%%Magnification: 1.0000
%%EndComments
/$F2psDict 200 dict def
$F2psDict begin
$F2psDict /mtrx matrix put
/col-1 {0 setgray} bind def
/col0 {0.000 0.000 0.000 srgb} bind def
/col1 {0.000 0.000 1.000 srgb} bind def
/col2 {0.000 1.000 0.000 srgb} bind def
/col3 {0.000 1.000 1.000 srgb} bind def
/col4 {1.000 0.000 0.000 srgb} bind def
/col5 {1.000 0.000 1.000 srgb} bind def
/col6 {1.000 1.000 0.000 srgb} bind def
/col7 {1.000 1.000 1.000 srgb} bind def
/col8 {0.000 0.000 0.560 srgb} bind def
/col9 {0.000 0.000 0.690 srgb} bind def
/col10 {0.000 0.000 0.820 srgb} bind def
/col11 {0.530 0.810 1.000 srgb} bind def
/col12 {0.000 0.560 0.000 srgb} bind def
/col13 {0.000 0.690 0.000 srgb} bind def
/col14 {0.000 0.820 0.000 srgb} bind def
/col15 {0.000 0.560 0.560 srgb} bind def
/col16 {0.000 0.690 0.690 srgb} bind def
/col17 {0.000 0.820 0.820 srgb} bind def
/col18 {0.560 0.000 0.000 srgb} bind def
/col19 {0.690 0.000 0.000 srgb} bind def
/col20 {0.820 0.000 0.000 srgb} bind def
/col21 {0.560 0.000 0.560 srgb} bind def
/col22 {0.690 0.000 0.690 srgb} bind def
/col23 {0.820 0.000 0.820 srgb} bind def
/col24 {0.500 0.190 0.000 srgb} bind def
/col25 {0.630 0.250 0.000 srgb} bind def
/col26 {0.750 0.380 0.000 srgb} bind def
/col27 {1.000 0.500 0.500 srgb} bind def
/col28 {1.000 0.630 0.630 srgb} bind def
/col29 {1.000 0.750 0.750 srgb} bind def
/col30 {1.000 0.880 0.880 srgb} bind def
/col31 {1.000 0.840 0.000 srgb} bind def

end
save
-10.0 137.0 translate
1 -1 scale

/cp {closepath} bind def
/ef {eofill} bind def
/gr {grestore} bind def
/gs {gsave} bind def
/sa {save} bind def
/rs {restore} bind def
/l {lineto} bind def
/m {moveto} bind def
/rm {rmoveto} bind def
/n {newpath} bind def
/s {stroke} bind def
/sh {show} bind def
/slc {setlinecap} bind def
/slj {setlinejoin} bind def
/slw {setlinewidth} bind def
/srgb {setrgbcolor} bind def
/rot {rotate} bind def
/sc {scale} bind def
/sd {setdash} bind def
/ff {findfont} bind def
/sf {setfont} bind def
/scf {scalefont} bind def
/sw {stringwidth} bind def
/tr {translate} bind def
/tnt {dup dup currentrgbcolor
  4 -2 roll dup 1 exch sub 3 -1 roll mul add
  4 -2 roll dup 1 exch sub 3 -1 roll mul add
  4 -2 roll dup 1 exch sub 3 -1 roll mul add srgb}
  bind def
/shd {dup dup currentrgbcolor 4 -2 roll mul 4 -2 roll mul
  4 -2 roll mul srgb} bind def
/reencdict 12 dict def /ReEncode { reencdict begin
/newcodesandnames exch def /newfontname exch def /basefontname exch def
/basefontdict basefontname findfont def /newfont basefontdict maxlength dict def
basefontdict { exch dup /FID ne { dup /Encoding eq
{ exch dup length array copy newfont 3 1 roll put }
{ exch newfont 3 1 roll put } ifelse } { pop pop } ifelse } forall
newfont /FontName newfontname put newcodesandnames aload pop
128 1 255 { newfont /Encoding get exch /.notdef put } for
newcodesandnames length 2 idiv { newfont /Encoding get 3 1 roll put } repeat
newfontname newfont definefont pop end } def
/isovec [
8#200 /grave 8#201 /acute 8#202 /circumflex 8#203 /tilde
8#204 /macron 8#205 /breve 8#206 /dotaccent 8#207 /dieresis
8#210 /ring 8#211 /cedilla 8#212 /hungarumlaut 8#213 /ogonek 8#214 /caron
8#220 /dotlessi 8#230 /oe 8#231 /OE
8#240 /space 8#241 /exclamdown 8#242 /cent 8#243 /sterling
8#244 /currency 8#245 /yen 8#246 /brokenbar 8#247 /section 8#250 /dieresis
8#251 /copyright 8#252 /ordfeminine 8#253 /guillemotleft 8#254 /logicalnot
8#255 /endash 8#256 /registered 8#257 /macron 8#260 /degree 8#261 /plusminus
8#262 /twosuperior 8#263 /threesuperior 8#264 /acute 8#265 /mu 8#266 /paragraph
8#267 /periodcentered 8#270 /cedilla 8#271 /onesuperior 8#272 /ordmasculine
8#273 /guillemotright 8#274 /onequarter 8#275 /onehalf
8#276 /threequarters 8#277 /questiondown 8#300 /Agrave 8#301 /Aacute
8#302 /Acircumflex 8#303 /Atilde 8#304 /Adieresis 8#305 /Aring
8#306 /AE 8#307 /Ccedilla 8#310 /Egrave 8#311 /Eacute
8#312 /Ecircumflex 8#313 /Edieresis 8#314 /Igrave 8#315 /Iacute
8#316 /Icircumflex 8#317 /Idieresis 8#320 /Eth 8#321 /Ntilde 8#322 /Ograve
8#323 /Oacute 8#324 /Ocircumflex 8#325 /Otilde 8#326 /Odieresis 8#327 /multiply
8#330 /Oslash 8#331 /Ugrave 8#332 /Uacute 8#333 /Ucircumflex
8#334 /Udieresis 8#335 /Yacute 8#336 /Thorn 8#337 /germandbls 8#340 /agrave
8#341 /aacute 8#342 /acircumflex 8#343 /atilde 8#344 /adieresis 8#345 /aring
8#346 /ae 8#347 /ccedilla 8#350 /egrave 8#351 /eacute
8#352 /ecircumflex 8#353 /edieresis 8#354 /igrave 8#355 /iacute
8#356 /icircumflex 8#357 /idieresis 8#360 /eth 8#361 /ntilde 8#362 /ograve
8#363 /oacute 8#364 /ocircumflex 8#365 /otilde 8#366 /odieresis 8#367 /divide
8#370 /oslash 8#371 /ugrave 8#372 /uacute 8#373 /ucircumflex
8#374 /udieresis 8#375 /yacute 8#376 /thorn 8#377 /ydieresis] def
/Times-Roman /Times-Roman-iso isovec ReEncode
/Times-Italic /Times-Italic-iso isovec ReEncode
/$F2psBegin {$F2psDict begin /$F2psEnteredState save def} def
/$F2psEnd {$F2psEnteredState restore end} def
%%EndProlog

$F2psBegin
10 setmiterlimit
n -1000 3172 m -1000 -1000 l 7492 -1000 l 7492 3172 l cp clip
 0.06299 0.06299 sc
/Times-Italic-iso ff 150.00 scf sf
270 1845 m
gs 1 -1 sc (Parcours) col0 sh gr
/Times-Italic-iso ff 150.00 scf sf
270 2040 m
gs 1 -1 sc (s\351quentiel) col0 sh gr
% Polyline
7.500 slw
n 285 1665 m 180 1665 180 2055 105 arcto 4 {pop} repeat
  180 2160 795 2160 105 arcto 4 {pop} repeat
  900 2160 900 1770 105 arcto 4 {pop} repeat
  900 1665 285 1665 105 arcto 4 {pop} repeat
 cp gs col0 s gr 
/Times-Italic-iso ff 150.00 scf sf
1575 1890 m
gs 1 -1 sc (Acc\350s ) col0 sh gr
/Times-Italic-iso ff 150.00 scf sf
1575 2085 m
gs 1 -1 sc (par index) col0 sh gr
% Polyline
n 1590 1710 m 1485 1710 1485 2055 105 arcto 4 {pop} repeat
  1485 2160 2100 2160 105 arcto 4 {pop} repeat
  2205 2160 2205 1815 105 arcto 4 {pop} repeat
  2205 1710 1590 1710 105 arcto 4 {pop} repeat
 cp gs col0 s gr 
/Times-Italic-iso ff 150.00 scf sf
2565 1845 m
gs 1 -1 sc (Parcours) col0 sh gr
/Times-Italic-iso ff 150.00 scf sf
2565 2040 m
gs 1 -1 sc (s\351quentiel) col0 sh gr
% Polyline
n 2580 1665 m 2475 1665 2475 2055 105 arcto 4 {pop} repeat
  2475 2160 3090 2160 105 arcto 4 {pop} repeat
  3195 2160 3195 1770 105 arcto 4 {pop} repeat
  3195 1665 2580 1665 105 arcto 4 {pop} repeat
 cp gs col0 s gr 
% Polyline
gs  clippath
1426 1335 m 1395 1215 l 1479 1306 l 1414 1187 l 1361 1216 l cp
clip
n 1665 1710 m 1395 1215 l gs col0 s gr gr

% arrowhead
n 1426 1335 m 1395 1215 l 1479 1306 l 1452 1320 l 1426 1335 l  cp gs 0.00 setgray ef gr  col0 s
% Polyline
gs  clippath
1604 649 m 1710 585 l 1646 691 l 1742 596 l 1699 553 l cp
clip
n 1350 945 m 1710 585 l gs col0 s gr gr

% arrowhead
n 1604 649 m 1710 585 l 1646 691 l 1625 670 l 1604 649 l  cp gs 0.00 setgray ef gr  col0 s
% Polyline
gs  clippath
853 1298 m 945 1215 l 903 1331 l 978 1219 l 928 1186 l cp
clip
n 637 1674 m 945 1215 l gs col0 s gr gr

% arrowhead
n 853 1298 m 945 1215 l 903 1331 l 878 1315 l 853 1298 l  cp gs 0.00 setgray ef gr  col0 s
% Polyline
gs  clippath
2236 705 m 2205 585 l 2289 676 l 2224 558 l 2171 586 l cp
clip
n 2790 1665 m 2205 585 l gs col0 s gr gr

% arrowhead
n 2236 705 m 2205 585 l 2289 676 l 2262 691 l 2236 705 l  cp gs 0.00 setgray ef gr  col0 s
% Polyline
gs  clippath
1950 165 m 1980 45 l 2010 165 l 2010 30 l 1950 30 l cp
clip
n 1980 315 m 1980 45 l gs col0 s gr gr

% arrowhead
n 1950 165 m 1980 45 l 2010 165 l 1980 165 l 1950 165 l  cp gs 0.00 setgray ef gr  col0 s
% Polyline
n 960 945 m 855 945 855 1110 105 arcto 4 {pop} repeat
  855 1215 1470 1215 105 arcto 4 {pop} repeat
  1575 1215 1575 1050 105 arcto 4 {pop} repeat
  1575 945 960 945 105 arcto 4 {pop} repeat
 cp gs col0 s gr 
% Polyline
n 1725 315 m 1620 315 1620 480 105 arcto 4 {pop} repeat
  1620 585 2235 585 105 arcto 4 {pop} repeat
  2340 585 2340 420 105 arcto 4 {pop} repeat
  2340 315 1725 315 105 arcto 4 {pop} repeat
 cp gs col0 s gr 
/Times-Roman-iso ff 150.00 scf sf
1665 1575 m
gs 1 -1 sc (Notation) col0 sh gr
/Times-Roman-iso ff 150.00 scf sf
2790 1575 m
gs 1 -1 sc (Session) col0 sh gr
/Times-Roman-iso ff 150.00 scf sf
360 1575 m
gs 1 -1 sc (Film) col0 sh gr
/Times-Italic-iso ff 150.00 scf sf
945 1125 m
gs 1 -1 sc (Jointure 1) col0 sh gr
/Times-Italic-iso ff 150.00 scf sf
1710 495 m
gs 1 -1 sc (Jointure 2) col0 sh gr
/Times-Italic-iso ff 150.00 scf sf
3555 1845 m
gs 1 -1 sc (Parcours) col0 sh gr
/Times-Italic-iso ff 150.00 scf sf
3555 2040 m
gs 1 -1 sc (s\351quentiel) col0 sh gr
% Polyline
n 3570 1665 m 3465 1665 3465 2055 105 arcto 4 {pop} repeat
  3465 2160 4080 2160 105 arcto 4 {pop} repeat
  4185 2160 4185 1770 105 arcto 4 {pop} repeat
  4185 1665 3570 1665 105 arcto 4 {pop} repeat
 cp gs col0 s gr 
/Times-Italic-iso ff 150.00 scf sf
4860 1890 m
gs 1 -1 sc (Acc\350s ) col0 sh gr
/Times-Italic-iso ff 150.00 scf sf
4860 2085 m
gs 1 -1 sc (par index) col0 sh gr
/Times-Italic-iso ff 150.00 scf sf
5850 1845 m
gs 1 -1 sc (Acc\350s ) col0 sh gr
/Times-Italic-iso ff 150.00 scf sf
5850 2040 m
gs 1 -1 sc (par index) col0 sh gr
% Polyline
gs  clippath
4711 1335 m 4680 1215 l 4764 1306 l 4699 1187 l 4646 1216 l cp
clip
n 4950 1710 m 4680 1215 l gs col0 s gr gr

% arrowhead
n 4711 1335 m 4680 1215 l 4764 1306 l 4737 1320 l 4711 1335 l  cp gs 0.00 setgray ef gr  col0 s
% Polyline
gs  clippath
4889 649 m 4995 585 l 4931 691 l 5027 596 l 4984 553 l cp
clip
n 4635 945 m 4995 585 l gs col0 s gr gr

% arrowhead
n 4889 649 m 4995 585 l 4931 691 l 4910 670 l 4889 649 l  cp gs 0.00 setgray ef gr  col0 s
% Polyline
gs  clippath
4138 1298 m 4230 1215 l 4188 1331 l 4263 1219 l 4213 1186 l cp
clip
n 3922 1674 m 4230 1215 l gs col0 s gr gr

% arrowhead
n 4138 1298 m 4230 1215 l 4188 1331 l 4163 1315 l 4138 1298 l  cp gs 0.00 setgray ef gr  col0 s
% Polyline
gs  clippath
5521 705 m 5490 585 l 5574 676 l 5509 558 l 5456 586 l cp
clip
n 6075 1665 m 5490 585 l gs col0 s gr gr

% arrowhead
n 5521 705 m 5490 585 l 5574 676 l 5547 691 l 5521 705 l  cp gs 0.00 setgray ef gr  col0 s
% Polyline
gs  clippath
5235 165 m 5265 45 l 5295 165 l 5295 30 l 5235 30 l cp
clip
n 5265 315 m 5265 45 l gs col0 s gr gr

% arrowhead
n 5235 165 m 5265 45 l 5295 165 l 5265 165 l 5235 165 l  cp gs 0.00 setgray ef gr  col0 s
% Polyline
n 4245 945 m 4140 945 4140 1110 105 arcto 4 {pop} repeat
  4140 1215 4755 1215 105 arcto 4 {pop} repeat
  4860 1215 4860 1050 105 arcto 4 {pop} repeat
  4860 945 4245 945 105 arcto 4 {pop} repeat
 cp gs col0 s gr 
% Polyline
n 5010 315 m 4905 315 4905 480 105 arcto 4 {pop} repeat
  4905 585 5520 585 105 arcto 4 {pop} repeat
  5625 585 5625 420 105 arcto 4 {pop} repeat
  5625 315 5010 315 105 arcto 4 {pop} repeat
 cp gs col0 s gr 
% Polyline
n 5865 1665 m 5760 1665 5760 2055 105 arcto 4 {pop} repeat
  5760 2160 6375 2160 105 arcto 4 {pop} repeat
  6480 2160 6480 1770 105 arcto 4 {pop} repeat
  6480 1665 5865 1665 105 arcto 4 {pop} repeat
 cp gs col0 s gr 
% Polyline
n 4875 1710 m 4770 1710 4770 2055 105 arcto 4 {pop} repeat
  4770 2160 5385 2160 105 arcto 4 {pop} repeat
  5490 2160 5490 1815 105 arcto 4 {pop} repeat
  5490 1710 4875 1710 105 arcto 4 {pop} repeat
 cp gs col0 s gr 
/Times-Roman-iso ff 150.00 scf sf
4950 1575 m
gs 1 -1 sc (Notation) col0 sh gr
/Times-Italic-iso ff 150.00 scf sf
4230 1125 m
gs 1 -1 sc (Jointure 1) col0 sh gr
/Times-Italic-iso ff 150.00 scf sf
4995 495 m
gs 1 -1 sc (Jointure 2) col0 sh gr
/Times-Roman-iso ff 150.00 scf sf
6165 1575 m
gs 1 -1 sc (Film) col0 sh gr
/Times-Roman-iso ff 150.00 scf sf
3510 1575 m
gs 1 -1 sc (Session) col0 sh gr
$F2psEnd
rs
