%!PS-Adobe-2.0 EPSF-2.0
%%Creator: gnuplot
%%DocumentFonts: Helvetica
%%BoundingBox: 50 50 410 302
%%EndComments
/gnudict 40 dict def
gnudict begin
/Color false def
/Solid false def
/gnulinewidth 5.000 def
/vshift -40 def
/dl {10 mul} def
/hpt 31.5 def
/vpt 31.5 def
/M {moveto} bind def
/L {lineto} bind def
/R {rmoveto} bind def
/V {rlineto} bind def
/vpt2 vpt 2 mul def
/hpt2 hpt 2 mul def
/Lshow { currentpoint stroke M
  0 vshift R show } def
/Rshow { currentpoint stroke M
  dup stringwidth pop neg vshift R show } def
/Cshow { currentpoint stroke M
  dup stringwidth pop -2 div vshift R show } def
/DL { Color {setrgbcolor Solid {pop []} if 0 setdash }
 {pop pop pop Solid {pop []} if 0 setdash} ifelse } def
/BL { stroke gnulinewidth 2 mul setlinewidth } def
/AL { stroke gnulinewidth 2 div setlinewidth } def
/PL { stroke gnulinewidth setlinewidth } def
/LTb { BL [] 0 0 0 DL } def
/LTa { AL [1 dl 2 dl] 0 setdash 0 0 0 setrgbcolor } def
/LT0 { PL [] 0 1 0 DL } def
/LT1 { PL [4 dl 2 dl] 0 0 1 DL } def
/LT2 { PL [2 dl 3 dl] 1 0 0 DL } def
/LT3 { PL [1 dl 1.5 dl] 1 0 1 DL } def
/LT4 { PL [5 dl 2 dl 1 dl 2 dl] 0 1 1 DL } def
/LT5 { PL [4 dl 3 dl 1 dl 3 dl] 1 1 0 DL } def
/LT6 { PL [2 dl 2 dl 2 dl 4 dl] 0 0 0 DL } def
/LT7 { PL [2 dl 2 dl 2 dl 2 dl 2 dl 4 dl] 1 0.3 0 DL } def
/LT8 { PL [2 dl 2 dl 2 dl 2 dl 2 dl 2 dl 2 dl 4 dl] 0.5 0.5 0.5 DL } def
/P { stroke [] 0 setdash
  currentlinewidth 2 div sub M
  0 currentlinewidth V stroke } def
/D { stroke [] 0 setdash 2 copy vpt add M
  hpt neg vpt neg V hpt vpt neg V
  hpt vpt V hpt neg vpt V closepath stroke
  P } def
/A { stroke [] 0 setdash vpt sub M 0 vpt2 V
  currentpoint stroke M
  hpt neg vpt neg R hpt2 0 V stroke
  } def
/B { stroke [] 0 setdash 2 copy exch hpt sub exch vpt add M
  0 vpt2 neg V hpt2 0 V 0 vpt2 V
  hpt2 neg 0 V closepath stroke
  P } def
/C { stroke [] 0 setdash exch hpt sub exch vpt add M
  hpt2 vpt2 neg V currentpoint stroke M
  hpt2 neg 0 R hpt2 vpt2 V stroke } def
/T { stroke [] 0 setdash 2 copy vpt 1.12 mul add M
  hpt neg vpt -1.62 mul V
  hpt 2 mul 0 V
  hpt neg vpt 1.62 mul V closepath stroke
  P  } def
/S { 2 copy A C} def
end
%%EndProlog
gnudict begin
gsave
50 50 translate
0.050 0.050 scale
0 setgray
/Helvetica findfont 120 scalefont setfont
newpath
LTa
576 181 M
6417 0 V
576 181 M
0 4798 V
LTb
576 181 M
6417 0 V
0 4798 V
-6417 0 V
576 181 L
LT0
4910 2780 M
235 0 V
0 281 V
-235 0 V
0 -281 V
4727 3854 M
325 0 V
0 185 V
-325 0 V
0 -185 V
4456 3402 M
517 0 V
0 169 V
-517 0 V
0 -169 V
510 258 R
527 0 V
0 217 V
-527 0 V
0 -217 V
2301 4561 M
812 0 V
0 418 V
-812 0 V
0 -418 V
2693 3459 M
414 0 V
0 620 V
-414 0 V
0 -620 V
399 235 R
1171 0 V
0 163 V
-1171 0 V
0 -163 V
-82 -664 R
212 0 V
0 423 V
-212 0 V
0 -423 V
379 278 R
712 0 V
0 314 V
-712 0 V
0 -314 V
1861 45 R
232 0 V
0 614 V
-232 0 V
0 -614 V
-391 940 R
270 0 V
0 320 V
-270 0 V
0 -320 V
-233 312 R
293 0 V
0 231 V
-293 0 V
0 -231 V
5596 3212 M
160 0 V
0 579 V
-160 0 V
0 -579 V
-503 161 R
682 0 V
0 360 V
-682 0 V
0 -360 V
4969 4384 M
957 0 V
0 177 V
-957 0 V
0 -177 V
960 -27 R
171 0 V
0 213 V
-171 0 V
0 -213 V
-658 -16 R
1176 0 V
0 93 V
-1176 0 V
0 -93 V
30 -222 R
931 0 V
0 193 V
-931 0 V
0 -193 V
2288 3636 M
471 0 V
0 313 V
-471 0 V
0 -313 V
5734 3417 M
176 0 V
0 530 V
-176 0 V
0 -530 V
564 -179 R
200 0 V
0 460 V
-200 0 V
0 -460 V
5998 4364 M
484 0 V
0 200 V
-484 0 V
0 -200 V
2143 2533 M
257 0 V
0 836 V
-257 0 V
0 -836 V
355 -17 R
354 0 V
0 990 V
-354 0 V
0 -990 V
6497 4607 M
443 0 V
0 258 V
-443 0 V
0 -258 V
6291 4325 M
668 0 V
0 434 V
-668 0 V
0 -434 V
5944 4165 M
685 0 V
0 176 V
-685 0 V
0 -176 V
5605 4012 M
1364 0 V
0 127 V
-1364 0 V
0 -127 V
685 -264 R
399 0 V
0 232 V
-399 0 V
0 -232 V
3321 2739 M
1472 0 V
0 224 V
-1472 0 V
0 -224 V
2969 619 R
495 0 V
0 400 V
-495 0 V
0 -400 V
5093 3063 M
707 0 V
0 315 V
-707 0 V
0 -315 V
551 874 R
1328 0 V
0 120 V
-1328 0 V
0 -120 V
812 -601 R
213 0 V
0 288 V
-213 0 V
0 -288 V
4437 4694 M
480 0 V
0 280 V
-480 0 V
0 -280 V
377 -135 R
1030 0 V
0 411 V
-1030 0 V
0 -411 V
4301 3944 M
474 0 V
0 447 V
-474 0 V
0 -447 V
619 652 R
571 0 V
0 309 V
-571 0 V
0 -309 V
799 101 R
321 0 V
0 254 V
-321 0 V
0 -254 V
213 -156 R
374 0 V
0 211 V
-374 0 V
0 -211 V
5152 4338 M
933 0 V
0 96 V
-933 0 V
0 -96 V
-562 -43 R
315 0 V
0 315 V
-315 0 V
0 -315 V
377 -438 R
584 0 V
0 186 V
-584 0 V
0 -186 V
151 316 R
681 0 V
0 171 V
-681 0 V
0 -171 V
4919 4024 M
645 0 V
0 211 V
-645 0 V
0 -211 V
690 -292 R
545 0 V
0 327 V
-545 0 V
0 -327 V
385 -89 R
298 0 V
0 380 V
-298 0 V
0 -380 V
5257 2873 M
280 0 V
0 286 V
-280 0 V
0 -286 V
931 933 R
513 0 V
0 257 V
-513 0 V
0 -257 V
261 -148 R
533 0 V
0 296 V
-533 0 V
0 -296 V
6298 3036 M
693 0 V
0 347 V
-693 0 V
0 -347 V
3557 3001 M
306 0 V
0 333 V
-306 0 V
0 -333 V
-527 416 R
316 0 V
0 348 V
-316 0 V
0 -348 V
960 15 R
525 0 V
0 298 V
-525 0 V
0 -298 V
3767 3026 M
1493 0 V
0 219 V
-1493 0 V
0 -219 V
739 538 R
589 0 V
0 117 V
-589 0 V
0 -117 V
777 -505 R
225 0 V
0 297 V
-225 0 V
0 -297 V
575 270 R
336 0 V
0 396 V
-336 0 V
0 -396 V
5740 3127 M
169 0 V
0 324 V
-169 0 V
0 -324 V
4666 3655 M
318 0 V
0 225 V
-318 0 V
0 -225 V
806 -458 R
154 0 V
0 753 V
-154 0 V
0 -753 V
2548 3929 M
438 0 V
0 463 V
-438 0 V
0 -463 V
1018 442 R
940 0 V
0 561 V
-940 0 V
0 -561 V
-492 -16 R
547 0 V
0 588 V
-547 0 V
0 -588 V
1659 3936 M
707 0 V
0 362 V
-707 0 V
0 -362 V
26 -1398 R
488 0 V
0 1422 V
-488 0 V
0 -1422 V
627 1389 R
301 0 V
0 457 V
-301 0 V
0 -457 V
4217 3670 M
470 0 V
0 326 V
-470 0 V
0 -326 V
2995 3973 M
570 0 V
0 435 V
-570 0 V
0 -435 V
90 -188 R
1012 0 V
0 227 V
-1012 0 V
0 -227 V
494 210 R
758 0 V
0 426 V
-758 0 V
0 -426 V
2260 3076 M
372 0 V
0 565 V
-372 0 V
0 -565 V
340 -40 R
428 0 V
0 434 V
-428 0 V
0 -434 V
602 -12 R
359 0 V
0 409 V
-359 0 V
0 -409 V
2510 2803 M
814 0 V
0 248 V
-814 0 V
0 -248 V
340 -92 R
396 0 V
0 235 V
-396 0 V
0 -235 V
-16 -192 R
819 0 V
0 230 V
-819 0 V
0 -230 V
-901 850 R
361 0 V
0 583 V
-361 0 V
0 -583 V
1596 2898 M
459 0 V
0 840 V
-459 0 V
0 -840 V
698 1408 R
830 0 V
0 386 V
-830 0 V
0 -386 V
currentpoint stroke M
-334 39 R
352 0 V
0 634 V
-352 0 V
0 -634 V
-262 -50 R
337 0 V
0 659 V
-337 0 V
0 -659 V
4357 3293 M
740 0 V
0 320 V
-740 0 V
0 -320 V
35 -212 R
900 0 V
0 167 V
-900 0 V
0 -167 V
16 35 R
928 0 V
0 248 V
-928 0 V
0 -248 V
3146 3410 M
915 0 V
0 348 V
-915 0 V
0 -348 V
607 -118 R
618 0 V
0 330 V
-618 0 V
0 -330 V
2311 3251 M
433 0 V
0 416 V
-433 0 V
0 -416 V
6469 4299 M
296 0 V
0 313 V
-296 0 V
0 -313 V
6111 3238 M
214 0 V
0 467 V
-214 0 V
0 -467 V
549 864 R
306 0 V
0 242 V
-306 0 V
0 -242 V
-87 -768 R
415 0 V
0 327 V
-415 0 V
0 -327 V
6035 4707 M
239 0 V
0 225 V
-239 0 V
0 -225 V
68 -2130 R
579 0 V
0 253 V
-579 0 V
0 -253 V
-81 441 R
252 0 V
0 313 V
-252 0 V
0 -313 V
5247 2626 M
652 0 V
0 247 V
-652 0 V
0 -247 V
4021 2770 M
896 0 V
0 276 V
-896 0 V
0 -276 V
996 119 R
426 0 V
0 184 V
-426 0 V
0 -184 V
257 -298 R
615 0 V
0 197 V
-615 0 V
0 -197 V
-2057 50 R
463 0 V
0 304 V
-463 0 V
0 -304 V
73 209 R
733 0 V
0 200 V
-733 0 V
0 -200 V
573 153 R
503 0 V
0 320 V
-503 0 V
0 -320 V
5053 2756 M
407 0 V
0 167 V
-407 0 V
0 -167 V
1240 10 R
511 0 V
0 403 V
-511 0 V
0 -403 V
448 -3 R
252 0 V
0 447 V
-252 0 V
0 -447 V
5528 2877 M
340 0 V
0 124 V
-340 0 V
0 -124 V
-50 45 R
400 0 V
0 237 V
-400 0 V
0 -237 V
-18 -213 R
448 0 V
0 186 V
-448 0 V
0 -186 V
435 -114 R
295 0 V
0 234 V
-295 0 V
0 -234 V
-27 207 R
177 0 V
0 558 V
-177 0 V
0 -558 V
151 -20 R
274 0 V
0 270 V
-274 0 V
0 -270 V
5142 2588 M
433 0 V
0 202 V
-433 0 V
0 -202 V
6258 4544 M
278 0 V
0 415 V
-278 0 V
0 -415 V
-887 55 R
708 0 V
0 237 V
-708 0 V
0 -237 V
248 -506 R
1048 0 V
0 113 V
-1048 0 V
0 -113 V
-826 -31 R
365 0 V
0 259 V
-365 0 V
0 -259 V
211 440 R
929 0 V
0 115 V
-929 0 V
0 -115 V
3932 4677 M
714 0 V
0 299 V
-714 0 V
0 -299 V
711 -731 R
195 0 V
0 360 V
-195 0 V
0 -360 V
714 811 R
678 0 V
0 150 V
-678 0 V
0 -150 V
5119 4281 M
1233 0 V
0 106 V
-1233 0 V
0 -106 V
5081 2364 M
464 0 V
0 266 V
-464 0 V
0 -266 V
4652 1962 M
522 0 V
0 472 V
-522 0 V
0 -472 V
598 -131 R
242 0 V
0 304 V
-242 0 V
0 -304 V
4198 2128 M
889 0 V
0 652 V
-889 0 V
0 -652 V
-636 -39 R
782 0 V
0 494 V
-782 0 V
0 -494 V
-32 -427 R
302 0 V
0 464 V
-302 0 V
0 -464 V
2194 1524 M
1678 0 V
0 186 V
-1678 0 V
0 -186 V
3813 1335 M
653 0 V
0 363 V
-653 0 V
0 -363 V
1333 1036 M
880 0 V
0 678 V
-880 0 V
0 -678 V
1862 709 M
596 0 V
0 632 V
-596 0 V
0 -632 V
5246 1770 M
531 0 V
0 120 V
-531 0 V
0 -120 V
1786 1070 M
1617 0 V
0 302 V
-1617 0 V
0 -302 V
1528 431 M
353 0 V
0 627 V
-353 0 V
0 -627 V
708 796 M
592 0 V
0 626 V
-592 0 V
0 -626 V
1850 228 R
1079 0 V
0 322 V
-1079 0 V
0 -322 V
1258 641 R
272 0 V
0 461 V
-272 0 V
0 -461 V
2193 1345 M
1051 0 V
0 192 V
-1051 0 V
0 -192 V
2639 807 M
443 0 V
0 377 V
-443 0 V
0 -377 V
105 850 R
363 0 V
0 628 V
-363 0 V
0 -628 V
-6 585 R
850 0 V
0 202 V
-850 0 V
0 -202 V
1119 375 M
414 0 V
0 643 V
-414 0 V
0 -643 V
3514 922 R
251 0 V
0 767 V
-251 0 V
0 -767 V
1840 516 M
1007 0 V
0 525 V
-1007 0 V
0 -525 V
454 1149 R
254 0 V
0 1531 V
-254 0 V
0 -1531 V
3590 207 R
315 0 V
0 242 V
-315 0 V
0 -242 V
5158 1459 M
581 0 V
0 398 V
-581 0 V
0 -398 V
617 19 R
971 0 V
0 135 V
-971 0 V
0 -135 V
794 83 R
289 0 V
0 224 V
-289 0 V
0 -224 V
-561 776 R
794 0 V
0 364 V
-794 0 V
0 -364 V
144 -279 R
196 0 V
0 377 V
-196 0 V
0 -377 V
36 -187 R
489 0 V
0 198 V
-489 0 V
0 -198 V
152 188 R
250 0 V
0 448 V
-250 0 V
0 -448 V
-568 175 R
426 0 V
0 165 V
-426 0 V
0 -165 V
270 180 R
253 0 V
0 176 V
-253 0 V
0 -176 V
75 -844 R
462 0 V
0 210 V
-462 0 V
0 -210 V
3930 1233 M
709 0 V
0 461 V
-709 0 V
0 -461 V
137 689 R
598 0 V
0 228 V
-598 0 V
0 -228 V
-30 -294 R
646 0 V
0 361 V
-646 0 V
0 -361 V
833 -191 R
312 0 V
0 516 V
-312 0 V
0 -516 V
currentpoint stroke M
697 474 R
183 0 V
0 280 V
-183 0 V
0 -280 V
5326 1649 M
496 0 V
0 122 V
-496 0 V
0 -122 V
-2917 30 R
392 0 V
0 958 V
-392 0 V
0 -958 V
1259 605 R
483 0 V
0 490 V
-483 0 V
0 -490 V
3073 826 M
394 0 V
0 349 V
-394 0 V
0 -349 V
257 506 R
500 0 V
0 246 V
-500 0 V
0 -246 V
3202 903 M
728 0 V
0 448 V
-728 0 V
0 -448 V
-163 770 R
523 0 V
0 339 V
-523 0 V
0 -339 V
1517 831 R
586 0 V
0 288 V
-586 0 V
0 -288 V
101 -754 R
480 0 V
0 423 V
-480 0 V
0 -423 V
3085 1982 M
563 0 V
0 286 V
-563 0 V
0 -286 V
-256 430 R
770 0 V
0 153 V
-770 0 V
0 -153 V
4139 2211 M
199 0 V
0 483 V
-199 0 V
0 -483 V
22 293 R
555 0 V
0 264 V
-555 0 V
0 -264 V
6659 2037 M
216 0 V
0 759 V
-216 0 V
0 -759 V
5151 1824 M
119 0 V
0 544 V
-119 0 V
0 -544 V
1709 384 R
128 0 V
0 584 V
-128 0 V
0 -584 V
5354 2454 M
360 0 V
0 155 V
-360 0 V
0 -155 V
258 -407 R
176 0 V
0 333 V
-176 0 V
0 -333 V
74 411 R
351 0 V
0 151 V
-351 0 V
0 -151 V
14 -74 R
358 0 V
0 211 V
-358 0 V
0 -211 V
288 -294 R
213 0 V
0 156 V
-213 0 V
0 -156 V
4917 1449 M
287 0 V
0 513 V
-287 0 V
0 -513 V
323 530 R
276 0 V
0 393 V
-276 0 V
0 -393 V
979 -199 R
632 0 V
0 122 V
-632 0 V
0 -122 V
5326 1505 M
477 0 V
0 168 V
-477 0 V
0 -168 V
217 844 R
500 0 V
0 172 V
-500 0 V
0 -172 V
201 -266 R
260 0 V
0 168 V
-260 0 V
0 -168 V
559 -18 R
163 0 V
0 262 V
-163 0 V
0 -262 V
268 -33 R
170 0 V
0 480 V
-170 0 V
0 -480 V
5744 1876 M
145 0 V
0 219 V
-145 0 V
0 -219 V
31 -282 R
730 0 V
0 260 V
-730 0 V
0 -260 V
511 267 R
567 0 V
0 171 V
-567 0 V
0 -171 V
-48 553 R
237 0 V
0 187 V
-237 0 V
0 -187 V
5799 1781 M
436 0 V
0 111 V
-436 0 V
0 -111 V
-301 265 R
149 0 V
0 335 V
-149 0 V
0 -335 V
4 -222 R
256 0 V
0 233 V
-256 0 V
0 -233 V
stroke
grestore
end
showpage
%%Trailer
