%!PS-Adobe-2.0 EPSF-2.0
%%Title: travind.fig
%%Creator: fig2dev Version 3.2.3 Patchlevel 
%%CreationDate: Tue Apr 16 09:56:07 2002
%%For: rigaux@cartier (Philippe Rigaux)
%%BoundingBox: 0 0 358 316
%%Magnification: 1.0000
%%EndComments
/$F2psDict 200 dict def
$F2psDict begin
$F2psDict /mtrx matrix put
/col-1 {0 setgray} bind def
/col0 {0.000 0.000 0.000 srgb} bind def
/col1 {0.000 0.000 1.000 srgb} bind def
/col2 {0.000 1.000 0.000 srgb} bind def
/col3 {0.000 1.000 1.000 srgb} bind def
/col4 {1.000 0.000 0.000 srgb} bind def
/col5 {1.000 0.000 1.000 srgb} bind def
/col6 {1.000 1.000 0.000 srgb} bind def
/col7 {1.000 1.000 1.000 srgb} bind def
/col8 {0.000 0.000 0.560 srgb} bind def
/col9 {0.000 0.000 0.690 srgb} bind def
/col10 {0.000 0.000 0.820 srgb} bind def
/col11 {0.530 0.810 1.000 srgb} bind def
/col12 {0.000 0.560 0.000 srgb} bind def
/col13 {0.000 0.690 0.000 srgb} bind def
/col14 {0.000 0.820 0.000 srgb} bind def
/col15 {0.000 0.560 0.560 srgb} bind def
/col16 {0.000 0.690 0.690 srgb} bind def
/col17 {0.000 0.820 0.820 srgb} bind def
/col18 {0.560 0.000 0.000 srgb} bind def
/col19 {0.690 0.000 0.000 srgb} bind def
/col20 {0.820 0.000 0.000 srgb} bind def
/col21 {0.560 0.000 0.560 srgb} bind def
/col22 {0.690 0.000 0.690 srgb} bind def
/col23 {0.820 0.000 0.820 srgb} bind def
/col24 {0.500 0.190 0.000 srgb} bind def
/col25 {0.630 0.250 0.000 srgb} bind def
/col26 {0.750 0.380 0.000 srgb} bind def
/col27 {1.000 0.500 0.500 srgb} bind def
/col28 {1.000 0.630 0.630 srgb} bind def
/col29 {1.000 0.750 0.750 srgb} bind def
/col30 {1.000 0.880 0.880 srgb} bind def
/col31 {1.000 0.840 0.000 srgb} bind def

end
save
newpath 0 316 moveto 0 0 lineto 358 0 lineto 358 316 lineto closepath clip newpath
-48.0 360.0 translate
1 -1 scale

/cp {closepath} bind def
/ef {eofill} bind def
/gr {grestore} bind def
/gs {gsave} bind def
/sa {save} bind def
/rs {restore} bind def
/l {lineto} bind def
/m {moveto} bind def
/rm {rmoveto} bind def
/n {newpath} bind def
/s {stroke} bind def
/sh {show} bind def
/slc {setlinecap} bind def
/slj {setlinejoin} bind def
/slw {setlinewidth} bind def
/srgb {setrgbcolor} bind def
/rot {rotate} bind def
/sc {scale} bind def
/sd {setdash} bind def
/ff {findfont} bind def
/sf {setfont} bind def
/scf {scalefont} bind def
/sw {stringwidth} bind def
/tr {translate} bind def
/tnt {dup dup currentrgbcolor
  4 -2 roll dup 1 exch sub 3 -1 roll mul add
  4 -2 roll dup 1 exch sub 3 -1 roll mul add
  4 -2 roll dup 1 exch sub 3 -1 roll mul add srgb}
  bind def
/shd {dup dup currentrgbcolor 4 -2 roll mul 4 -2 roll mul
  4 -2 roll mul srgb} bind def
/$F2psBegin {$F2psDict begin /$F2psEnteredState save def} def
/$F2psEnd {$F2psEnteredState restore end} def

$F2psBegin
%%Page: 1 1
10 setmiterlimit
 0.06000 0.06000 sc
% Polyline
7.500 slw
n 1800 1425 m 1200 2550 l 2400 2550 l
 cp gs col0 s gr 
% Polyline
n 1800 1425 m
 1875 1200 l gs col0 s gr 
% Polyline
n 1650 1275 m
 1800 1425 l gs col0 s gr 
% Polyline
 [60] 0 sd
n 1800 1425 m 1725 1725 l 1875 1875 l 1725 2025 l 1800 2250 l
 1725 2550 l gs col0 s gr  [] 0 sd
% Polyline
n 1725 2550 m
 1425 3075 l gs col0 s gr 
% Polyline
n 1725 2550 m
 1800 3075 l gs col0 s gr 
% Polyline
n 1725 2550 m
 2325 3075 l gs col0 s gr 
% Polyline
n 1275 3075 m 1500 3075 l 1500 3300 l 1275 3300 l
 cp gs col0 s gr 
% Polyline
n 1725 3075 m 1950 3075 l 1950 3300 l 1725 3300 l
 cp gs col0 s gr 
% Polyline
n 2250 3075 m 2475 3075 l 2475 3300 l 2250 3300 l
 cp gs col0 s gr 
% Polyline
n 4800 1350 m 4200 2475 l 5400 2475 l
 cp gs col0 s gr 
% Polyline
 [60] 0 sd
n 4800 1350 m 4725 1650 l 4875 1800 l 4725 1950 l 4800 2175 l
 4725 2475 l gs col0 s gr  [] 0 sd
% Polyline
n 3975 3075 m 4275 3075 l 4275 3375 l 3975 3375 l
 cp gs col0 s gr 
% Polyline
n 4500 3075 m 5175 3075 l 5175 3375 l 4500 3375 l
 cp gs col0 s gr 
% Polyline
n 4275 3225 m
 4500 3225 l gs col0 s gr 
% Polyline
n 5175 3225 m
 5325 3225 l gs col0 s gr 
% Polyline
n 4725 2475 m
 4650 3075 l gs col0 s gr 
% Polyline
n 4650 1200 m 4800 1350 l
 4875 1125 l gs col0 s gr 
% Polyline
n 5325 3075 m 5925 3075 l 5925 3375 l 5325 3375 l
 cp gs col0 s gr 
% Polyline
n 1275 3300 m
 1125 4350 l gs col0 s gr 
% Polyline
n 825 4350 m 1425 4350 l 1425 4725 l 825 4725 l
 cp gs col0 s gr 
% Polyline
n 1650 4050 m 2400 4050 l 2400 5175 l 1650 5175 l
 cp gs col0 s gr 
% Polyline
n 2550 4350 m 3000 4350 l 3000 4725 l 2550 4725 l
 cp gs col0 s gr 
% Polyline
n 1425 4575 m
 1650 4575 l gs col0 s gr 
% Polyline
n 2400 4575 m
 2550 4575 l gs col0 s gr 
% Polyline
n 4800 3375 m 4800 4350 l
 4800 4275 l gs col0 s gr 
% Polyline
n 4425 4350 m 5100 4350 l 5100 4725 l 4425 4725 l
 cp gs col0 s gr 
% Polyline
n 5325 3975 m 6000 3975 l 6000 5100 l 5325 5100 l
 cp gs col0 s gr 
% Polyline
n 6150 4350 m 6750 4350 l 6750 4725 l 6150 4725 l
 cp gs col0 s gr 
% Polyline
n 5100 4575 m 5325 4575 l
 5325 4575 l gs col0 s gr 
% Polyline
n 6000 4575 m
 6150 4575 l gs col0 s gr 
% Polyline
n 1200 1050 m 1202 1049 l 1207 1048 l 1215 1046 l 1227 1042 l 1244 1038 l
 1264 1032 l 1287 1026 l 1313 1021 l 1341 1015 l 1369 1010 l
 1399 1006 l 1429 1003 l 1459 1002 l 1490 1002 l 1522 1005 l
 1554 1011 l 1586 1020 l 1619 1033 l 1650 1050 l 1678 1070 l
 1703 1093 l 1723 1117 l 1740 1142 l 1754 1167 l 1765 1193 l
 1774 1218 l 1781 1244 l 1786 1270 l 1791 1296 l 1794 1321 l
 1796 1344 l 1798 1366 l 1799 1384 l 1799 1400 l 1800 1411 l
 1800 1419 l 1800 1423 l
 1800 1425 l gs col0 s gr 
% Polyline
n 4200 975 m 4202 974 l 4207 973 l 4215 971 l 4227 967 l 4244 963 l
 4264 957 l 4287 951 l 4313 946 l 4341 940 l 4369 935 l
 4399 931 l 4429 928 l 4459 927 l 4490 927 l 4522 930 l
 4554 936 l 4586 945 l 4619 958 l 4650 975 l 4678 995 l
 4703 1018 l 4723 1042 l 4740 1067 l 4754 1092 l 4765 1118 l
 4774 1143 l 4781 1169 l 4786 1195 l 4791 1221 l 4794 1246 l
 4796 1269 l 4798 1291 l 4799 1309 l 4799 1325 l 4800 1336 l
 4800 1344 l 4800 1348 l
 4800 1350 l gs col0 s gr 
/Times-Roman ff 180.00 scf sf
1500 975 m
gs 1 -1 sc (a) col0 sh gr
/Times-Roman ff 180.00 scf sf
1950 3225 m
gs 1 -1 sc (....) col0 sh gr
/Times-Roman ff 180.00 scf sf
825 3300 m
gs 1 -1 sc (R) col0 sh gr
/Times-Roman ff 180.00 scf sf
1350 3600 m
gs 1 -1 sc (p1) col0 sh gr
/Times-Roman ff 180.00 scf sf
1800 3600 m
gs 1 -1 sc (p2) col0 sh gr
/Times-Roman ff 180.00 scf sf
2325 3600 m
gs 1 -1 sc (p3) col0 sh gr
/Times-Roman ff 180.00 scf sf
4500 825 m
gs 1 -1 sc (a) col0 sh gr
/Times-Roman ff 180.00 scf sf
3750 3225 m
gs 1 -1 sc (R) col0 sh gr
/Times-Roman ff 180.00 scf sf
4575 3300 m
gs 1 -1 sc (b,a,a,a,a) col0 sh gr
/Times-Roman ff 180.00 scf sf
5400 3300 m
gs 1 -1 sc (a,a,c,...) col0 sh gr
/Times-Roman ff 180.00 scf sf
1050 4650 m
gs 1 -1 sc (E) col0 sh gr
/Times-Roman ff 180.00 scf sf
2700 4650 m
gs 1 -1 sc (S) col0 sh gr
/Times-Roman ff 180.00 scf sf
4575 4650 m
gs 1 -1 sc (E) col0 sh gr
/Times-Roman ff 180.00 scf sf
6375 4650 m
gs 1 -1 sc (S) col0 sh gr
/Times-Roman ff 180.00 scf sf
1725 4350 m
gs 1 -1 sc (autres ) col0 sh gr
/Times-Roman ff 180.00 scf sf
1725 4650 m
gs 1 -1 sc (select.) col0 sh gr
/Times-Roman ff 180.00 scf sf
1800 5025 m
gs 1 -1 sc (proj) col0 sh gr
/Times-Roman ff 180.00 scf sf
5400 4275 m
gs 1 -1 sc (autres ) col0 sh gr
/Times-Roman ff 180.00 scf sf
5400 4575 m
gs 1 -1 sc (select.) col0 sh gr
/Times-Roman ff 180.00 scf sf
5400 4950 m
gs 1 -1 sc (proj.) col0 sh gr
/Times-Roman ff 180.00 scf sf
2100 5025 m
gs 1 -1 sc (.) col0 sh gr
/Times-Roman ff 180.00 scf sf
1650 6000 m
gs 1 -1 sc (\(i\)) col0 sh gr
/Times-Roman ff 180.00 scf sf
5025 5925 m
gs 1 -1 sc (\(ii\)) col0 sh gr
$F2psEnd
rs
