%!PS-Adobe-2.0 EPSF-2.0
%%Title: fusion-exemple.eps
%%Creator: fig2dev Version 3.2.3 Patchlevel 
%%CreationDate: Tue Apr 16 09:54:00 2002
%%For: rigaux@cartier (Philippe Rigaux)
%%BoundingBox: 0 0 668 299
%%Magnification: 1.0000
%%EndComments
/$F2psDict 200 dict def
$F2psDict begin
$F2psDict /mtrx matrix put
/col-1 {0 setgray} bind def
/col0 {0.000 0.000 0.000 srgb} bind def
/col1 {0.000 0.000 1.000 srgb} bind def
/col2 {0.000 1.000 0.000 srgb} bind def
/col3 {0.000 1.000 1.000 srgb} bind def
/col4 {1.000 0.000 0.000 srgb} bind def
/col5 {1.000 0.000 1.000 srgb} bind def
/col6 {1.000 1.000 0.000 srgb} bind def
/col7 {1.000 1.000 1.000 srgb} bind def
/col8 {0.000 0.000 0.560 srgb} bind def
/col9 {0.000 0.000 0.690 srgb} bind def
/col10 {0.000 0.000 0.820 srgb} bind def
/col11 {0.530 0.810 1.000 srgb} bind def
/col12 {0.000 0.560 0.000 srgb} bind def
/col13 {0.000 0.690 0.000 srgb} bind def
/col14 {0.000 0.820 0.000 srgb} bind def
/col15 {0.000 0.560 0.560 srgb} bind def
/col16 {0.000 0.690 0.690 srgb} bind def
/col17 {0.000 0.820 0.820 srgb} bind def
/col18 {0.560 0.000 0.000 srgb} bind def
/col19 {0.690 0.000 0.000 srgb} bind def
/col20 {0.820 0.000 0.000 srgb} bind def
/col21 {0.560 0.000 0.560 srgb} bind def
/col22 {0.690 0.000 0.690 srgb} bind def
/col23 {0.820 0.000 0.820 srgb} bind def
/col24 {0.500 0.190 0.000 srgb} bind def
/col25 {0.630 0.250 0.000 srgb} bind def
/col26 {0.750 0.380 0.000 srgb} bind def
/col27 {1.000 0.500 0.500 srgb} bind def
/col28 {1.000 0.630 0.630 srgb} bind def
/col29 {1.000 0.750 0.750 srgb} bind def
/col30 {1.000 0.880 0.880 srgb} bind def
/col31 {1.000 0.840 0.000 srgb} bind def

end
save
newpath 0 299 moveto 0 0 lineto 668 0 lineto 668 299 lineto closepath clip newpath
-17.0 334.0 translate
1 -1 scale

/cp {closepath} bind def
/ef {eofill} bind def
/gr {grestore} bind def
/gs {gsave} bind def
/sa {save} bind def
/rs {restore} bind def
/l {lineto} bind def
/m {moveto} bind def
/rm {rmoveto} bind def
/n {newpath} bind def
/s {stroke} bind def
/sh {show} bind def
/slc {setlinecap} bind def
/slj {setlinejoin} bind def
/slw {setlinewidth} bind def
/srgb {setrgbcolor} bind def
/rot {rotate} bind def
/sc {scale} bind def
/sd {setdash} bind def
/ff {findfont} bind def
/sf {setfont} bind def
/scf {scalefont} bind def
/sw {stringwidth} bind def
/tr {translate} bind def
/tnt {dup dup currentrgbcolor
  4 -2 roll dup 1 exch sub 3 -1 roll mul add
  4 -2 roll dup 1 exch sub 3 -1 roll mul add
  4 -2 roll dup 1 exch sub 3 -1 roll mul add srgb}
  bind def
/shd {dup dup currentrgbcolor 4 -2 roll mul 4 -2 roll mul
  4 -2 roll mul srgb} bind def
/$F2psBegin {$F2psDict begin /$F2psEnteredState save def} def
/$F2psEnd {$F2psEnteredState restore end} def

$F2psBegin
%%Page: 1 1
10 setmiterlimit
 0.06000 0.06000 sc
% Polyline
7.500 slw
n 300 600 m 3150 600 l 3150 2850 l 300 2850 l
 cp gs col0 s gr 
% Polyline
n 4575 600 m 9975 600 l 9975 1650 l 4575 1650 l
 cp gs col0 s gr 
% Polyline
n 4575 2175 m 7125 2175 l 7125 3000 l 4575 3000 l
 cp gs col0 s gr 
% Polyline
n 7800 2175 m 10200 2175 l 10200 3000 l 7800 3000 l
 cp gs col0 s gr 
% Polyline
n 6225 3675 m 7425 3675 l 7425 4125 l 6225 4125 l
 cp gs col0 s gr 
% Polyline
n 10200 3600 m 11400 3600 l 11400 4050 l 10200 4050 l
 cp gs col0 s gr 
% Polyline
n 3375 5100 m 4575 5100 l 4575 5550 l 3375 5550 l
 cp gs col0 s gr 
% Polyline
n 7875 5025 m 9075 5025 l 9075 5475 l 7875 5475 l
 cp gs col0 s gr 
% Polyline
n 9525 5025 m 10725 5025 l 10725 5475 l 9525 5475 l
 cp gs col0 s gr 
% Polyline
n 5325 5100 m 6525 5100 l 6525 5550 l 5325 5550 l
 cp gs col0 s gr 
% Polyline
n 3600 3675 m 5625 3675 l 5625 4425 l 3600 4425 l
 cp gs col0 s gr 
% Polyline
n 7725 3600 m 9750 3600 l 9750 4350 l 7725 4350 l
 cp gs col0 s gr 
% Polyline
n 6975 1650 m
 5925 2175 l gs col0 s gr 
% Polyline
n 7875 1650 m
 8925 2175 l gs col0 s gr 
% Polyline
n 5775 3000 m
 4650 3675 l gs col0 s gr 
% Polyline
n 6150 3000 m
 6825 3675 l gs col0 s gr 
% Polyline
n 4350 4425 m
 3975 5100 l gs col0 s gr 
% Polyline
n 4950 4425 m
 5925 5100 l gs col0 s gr 
% Polyline
n 8775 4350 m
 8400 5025 l gs col0 s gr 
% Polyline
n 9300 4350 m
 10050 5025 l gs col0 s gr 
% Polyline
n 9075 3000 m
 8700 3600 l gs col0 s gr 
% Polyline
n 9375 3000 m
 10575 3600 l gs col0 s gr 
/Times-Roman ff 180.00 scf sf
450 825 m
gs 1 -1 sc (Vertigo) col0 sh gr
/Times-Roman ff 180.00 scf sf
450 1200 m
gs 1 -1 sc (Annie Hall) col0 sh gr
/Times-Roman ff 180.00 scf sf
450 1575 m
gs 1 -1 sc (Twin Peaks) col0 sh gr
/Times-Roman ff 180.00 scf sf
450 1950 m
gs 1 -1 sc (Brazil) col0 sh gr
/Times-Roman ff 180.00 scf sf
450 2325 m
gs 1 -1 sc (Psychose) col0 sh gr
/Times-Roman ff 180.00 scf sf
450 2700 m
gs 1 -1 sc (Metropolis) col0 sh gr
/Times-Roman ff 180.00 scf sf
1875 1575 m
gs 1 -1 sc (Underground) col0 sh gr
/Times-Roman ff 180.00 scf sf
1875 1275 m
gs 1 -1 sc (Greystoke) col0 sh gr
/Times-Roman ff 180.00 scf sf
1875 900 m
gs 1 -1 sc (Shining) col0 sh gr
/Times-Roman ff 180.00 scf sf
4875 900 m
gs 1 -1 sc (Annie Hall) col0 sh gr
/Times-Roman ff 180.00 scf sf
4875 1200 m
gs 1 -1 sc (Brazil) col0 sh gr
/Times-Roman ff 180.00 scf sf
4875 1500 m
gs 1 -1 sc (Easy rider) col0 sh gr
/Times-Roman ff 180.00 scf sf
6075 900 m
gs 1 -1 sc (Greystoke) col0 sh gr
/Times-Roman ff 180.00 scf sf
6075 1200 m
gs 1 -1 sc (Jurassic Park) col0 sh gr
/Times-Roman ff 180.00 scf sf
6075 1500 m
gs 1 -1 sc (Manhattan) col0 sh gr
/Times-Roman ff 180.00 scf sf
7350 900 m
gs 1 -1 sc (Metropolis) col0 sh gr
/Times-Roman ff 180.00 scf sf
7425 1200 m
gs 1 -1 sc (Psychose) col0 sh gr
/Times-Roman ff 180.00 scf sf
7500 1500 m
gs 1 -1 sc (Shining) col0 sh gr
/Times-Roman ff 180.00 scf sf
8700 900 m
gs 1 -1 sc (Twin Peaks) col0 sh gr
/Times-Roman ff 180.00 scf sf
8700 1200 m
gs 1 -1 sc (Underground) col0 sh gr
/Times-Roman ff 180.00 scf sf
8775 1500 m
gs 1 -1 sc (Vertigo) col0 sh gr
/Times-Roman ff 180.00 scf sf
1875 2700 m
gs 1 -1 sc (Easy rider) col0 sh gr
/Times-Roman ff 180.00 scf sf
1875 2325 m
gs 1 -1 sc (Manhattan) col0 sh gr
/Times-Roman ff 180.00 scf sf
1875 1950 m
gs 1 -1 sc (Jurassic Park) col0 sh gr
/Times-Roman ff 180.00 scf sf
3600 5475 m
gs 1 -1 sc (Vertigo) col0 sh gr
/Times-Roman ff 180.00 scf sf
3600 5250 m
gs 1 -1 sc (Annie Hall) col0 sh gr
/Times-Roman ff 180.00 scf sf
5550 5250 m
gs 1 -1 sc (Brazil) col0 sh gr
/Times-Roman ff 180.00 scf sf
5550 5475 m
gs 1 -1 sc (Twin Peaks) col0 sh gr
/Times-Roman ff 180.00 scf sf
6375 3825 m
gs 1 -1 sc (Jurassic Park) col0 sh gr
/Times-Roman ff 180.00 scf sf
6375 4050 m
gs 1 -1 sc (Underground) col0 sh gr
/Times-Roman ff 180.00 scf sf
3750 3900 m
gs 1 -1 sc (Annie Hall) col0 sh gr
/Times-Roman ff 180.00 scf sf
3750 4200 m
gs 1 -1 sc (Brazil) col0 sh gr
/Times-Roman ff 180.00 scf sf
4650 3900 m
gs 1 -1 sc (Twin Peaks) col0 sh gr
/Times-Roman ff 180.00 scf sf
4650 4200 m
gs 1 -1 sc (Vertigo) col0 sh gr
/Times-Roman ff 180.00 scf sf
8025 5175 m
gs 1 -1 sc (Metropolis) col0 sh gr
/Times-Roman ff 180.00 scf sf
8100 5400 m
gs 1 -1 sc (Psychose) col0 sh gr
/Times-Roman ff 180.00 scf sf
9750 5175 m
gs 1 -1 sc (Greystoke) col0 sh gr
/Times-Roman ff 180.00 scf sf
9750 5400 m
gs 1 -1 sc (Shining) col0 sh gr
/Times-Roman ff 180.00 scf sf
7950 3900 m
gs 1 -1 sc (Greystoke) col0 sh gr
/Times-Roman ff 180.00 scf sf
7950 4200 m
gs 1 -1 sc (Metropolis) col0 sh gr
/Times-Roman ff 180.00 scf sf
8925 3900 m
gs 1 -1 sc (Psychose) col0 sh gr
/Times-Roman ff 180.00 scf sf
9000 4200 m
gs 1 -1 sc (Shining) col0 sh gr
/Times-Roman ff 180.00 scf sf
4725 2400 m
gs 1 -1 sc (Annie Hall) col0 sh gr
/Times-Roman ff 180.00 scf sf
4725 2625 m
gs 1 -1 sc (Brazil) col0 sh gr
/Times-Roman ff 180.00 scf sf
4725 2850 m
gs 1 -1 sc (Jurassic Park) col0 sh gr
/Times-Roman ff 180.00 scf sf
5850 2400 m
gs 1 -1 sc (Twin Peaks) col0 sh gr
/Times-Roman ff 180.00 scf sf
5850 2850 m
gs 1 -1 sc (Vertigo) col0 sh gr
/Times-Roman ff 180.00 scf sf
5850 2625 m
gs 1 -1 sc (Underground) col0 sh gr
/Times-Roman ff 180.00 scf sf
7950 2400 m
gs 1 -1 sc (Easy Rider) col0 sh gr
/Times-Roman ff 180.00 scf sf
7950 2625 m
gs 1 -1 sc (Greystoke) col0 sh gr
/Times-Roman ff 180.00 scf sf
7950 2850 m
gs 1 -1 sc (Manhattan) col0 sh gr
/Times-Roman ff 180.00 scf sf
9000 2400 m
gs 1 -1 sc (Metropolis) col0 sh gr
/Times-Roman ff 180.00 scf sf
9075 2850 m
gs 1 -1 sc (Shining) col0 sh gr
/Times-Roman ff 180.00 scf sf
9000 2625 m
gs 1 -1 sc (Psychose) col0 sh gr
/Times-Roman ff 180.00 scf sf
10350 3750 m
gs 1 -1 sc (Easy Rider) col0 sh gr
/Times-Roman ff 180.00 scf sf
10350 3975 m
gs 1 -1 sc (Manhattan) col0 sh gr
$F2psEnd
rs
