# Fdb version 3
["makeindex mooc_nsi.idx"] 1612787930 "mooc_nsi.idx" "mooc_nsi.ind" "mooc_nsi" 1612787932
  "mooc_nsi.idx" 1612787932 5187 a938d90189267bb44c11ae97b208b459 "pdflatex"
  (generated)
  "mooc_nsi.ilg"
  "mooc_nsi.ind"
["pdflatex"] 1612787931 "mooc_nsi.tex" "mooc_nsi.pdf" "mooc_nsi" 1612787932
  "/usr/local/texlive/2019/texmf-dist/fonts/enc/dvips/base/8r.enc" 1165713224 4850 80dc9bab7f31fb78a000ccfed0e27cab ""
  "/usr/local/texlive/2019/texmf-dist/fonts/map/fontname/texfonts.map" 1511824771 3332 103109f5612ad95229751940c61aada0 ""
  "/usr/local/texlive/2019/texmf-dist/fonts/tfm/adobe/courier/pcrb8r.tfm" 1136768653 1292 3059476c50a24578715759f22652f3d0 ""
  "/usr/local/texlive/2019/texmf-dist/fonts/tfm/adobe/courier/pcrb8t.tfm" 1136768653 1384 87406e4336af44af883a035f17f319d9 ""
  "/usr/local/texlive/2019/texmf-dist/fonts/tfm/adobe/courier/pcrr8c.tfm" 1136768653 1268 8bd405dc5751cfed76cb6fb2db78cb50 ""
  "/usr/local/texlive/2019/texmf-dist/fonts/tfm/adobe/courier/pcrr8r.tfm" 1136768653 1292 bd42be2f344128bff6d35d98474adfe3 ""
  "/usr/local/texlive/2019/texmf-dist/fonts/tfm/adobe/courier/pcrr8t.tfm" 1136768653 1384 4632f5e54900a7dadbb83f555bc61e56 ""
  "/usr/local/texlive/2019/texmf-dist/fonts/tfm/adobe/helvetic/phvb8r.tfm" 1136768653 4484 b828043cbd581d289d955903c1339981 ""
  "/usr/local/texlive/2019/texmf-dist/fonts/tfm/adobe/helvetic/phvb8t.tfm" 1136768653 6628 34c39492c0adc454c1c199922bba8363 ""
  "/usr/local/texlive/2019/texmf-dist/fonts/tfm/adobe/helvetic/phvbo8r.tfm" 1136768653 4736 423eba67d4e9420ec9df4a8def143b08 ""
  "/usr/local/texlive/2019/texmf-dist/fonts/tfm/adobe/helvetic/phvbo8t.tfm" 1136768653 6880 fe6c7967f27585f6fa9876f3af14edd2 ""
  "/usr/local/texlive/2019/texmf-dist/fonts/tfm/adobe/helvetic/phvr8r.tfm" 1136768653 4712 9ef4d7d106579d4b136e1529e1a4533c ""
  "/usr/local/texlive/2019/texmf-dist/fonts/tfm/adobe/helvetic/phvr8t.tfm" 1136768653 7040 b2bd27e2bfe6f6948cbc3239cae7444f ""
  "/usr/local/texlive/2019/texmf-dist/fonts/tfm/adobe/times/ptmb8r.tfm" 1136768653 4524 6bce29db5bc272ba5f332261583fee9c ""
  "/usr/local/texlive/2019/texmf-dist/fonts/tfm/adobe/times/ptmb8t.tfm" 1136768653 6880 f19b8995b61c334d78fc734065f6b4d4 ""
  "/usr/local/texlive/2019/texmf-dist/fonts/tfm/adobe/times/ptmbi8r.tfm" 1136768653 4480 10409ed8bab5aea9ec9a78028b763919 ""
  "/usr/local/texlive/2019/texmf-dist/fonts/tfm/adobe/times/ptmbi8t.tfm" 1136768653 6784 37b32cc10800b5afa030d935c393695a ""
  "/usr/local/texlive/2019/texmf-dist/fonts/tfm/adobe/times/ptmr8r.tfm" 1136768653 4408 25b74d011a4c66b7f212c0cc3c90061b ""
  "/usr/local/texlive/2019/texmf-dist/fonts/tfm/adobe/times/ptmr8t.tfm" 1136768653 6672 e3ab9e37e925f3045c9005e6d1473d56 ""
  "/usr/local/texlive/2019/texmf-dist/fonts/tfm/adobe/times/ptmri8c.tfm" 1136768653 1428 3f135d3346fb7bfe71989ef2e19a9f01 ""
  "/usr/local/texlive/2019/texmf-dist/fonts/tfm/adobe/times/ptmri8r.tfm" 1136768653 4640 532ca3305aad10cc01d769f3f91f1029 ""
  "/usr/local/texlive/2019/texmf-dist/fonts/tfm/adobe/times/ptmri8t.tfm" 1136768653 6944 94c55ad86e6ea2826f78ba2240d50df9 ""
  "/usr/local/texlive/2019/texmf-dist/fonts/tfm/jknappen/ec/ecrm1000.tfm" 1136768653 3584 adb004a0c8e7c46ee66cad73671f37b4 ""
  "/usr/local/texlive/2019/texmf-dist/fonts/tfm/public/amsfonts/cmextra/cmex7.tfm" 1246382020 1004 54797486969f23fa377b128694d548df ""
  "/usr/local/texlive/2019/texmf-dist/fonts/tfm/public/amsfonts/symbols/msam10.tfm" 1246382020 916 f87d7c45f9c908e672703b83b72241a3 ""
  "/usr/local/texlive/2019/texmf-dist/fonts/tfm/public/amsfonts/symbols/msam5.tfm" 1246382020 924 9904cf1d39e9767e7a3622f2a125a565 ""
  "/usr/local/texlive/2019/texmf-dist/fonts/tfm/public/amsfonts/symbols/msbm10.tfm" 1246382020 908 2921f8a10601f252058503cc6570e581 ""
  "/usr/local/texlive/2019/texmf-dist/fonts/tfm/public/amsfonts/symbols/msbm5.tfm" 1246382020 940 75ac932a52f80982a9f8ea75d03a34cf ""
  "/usr/local/texlive/2019/texmf-dist/fonts/tfm/public/cm/cmex10.tfm" 1136768653 992 662f679a0b3d2d53c1b94050fdaa3f50 ""
  "/usr/local/texlive/2019/texmf-dist/fonts/tfm/public/cm/cmmi12.tfm" 1136768653 1524 4414a8315f39513458b80dfc63bff03a ""
  "/usr/local/texlive/2019/texmf-dist/fonts/tfm/public/cm/cmr12.tfm" 1136768653 1288 655e228510b4c2a1abe905c368440826 ""
  "/usr/local/texlive/2019/texmf-dist/fonts/tfm/public/cm/cmr17.tfm" 1136768653 1292 296a67155bdbfc32aa9c636f21e91433 ""
  "/usr/local/texlive/2019/texmf-dist/fonts/tfm/public/cm/cmsy10.tfm" 1136768653 1124 6c73e740cf17375f03eec0ee63599741 ""
  "/usr/local/texlive/2019/texmf-dist/fonts/type1/urw/courier/ucrb8a.pfb" 1136849748 50493 4ed1f7e9eba8f1f3e1ec25195460190d ""
  "/usr/local/texlive/2019/texmf-dist/fonts/type1/urw/courier/ucrr8a.pfb" 1136849748 45758 19968a0990191524e34e1994d4a31cb6 ""
  "/usr/local/texlive/2019/texmf-dist/fonts/type1/urw/helvetic/uhvb8a.pfb" 1136849748 35941 f27169cc74234d5bd5e4cca5abafaabb ""
  "/usr/local/texlive/2019/texmf-dist/fonts/type1/urw/helvetic/uhvbo8a.pfb" 1136849748 39013 b244066151b1e3e718f9b8e88a5ff23b ""
  "/usr/local/texlive/2019/texmf-dist/fonts/type1/urw/helvetic/uhvr8a.pfb" 1136849748 44648 23115b2a545ebfe2c526c3ca99db8b95 ""
  "/usr/local/texlive/2019/texmf-dist/fonts/type1/urw/times/utmb8a.pfb" 1136849748 44729 811d6c62865936705a31c797a1d5dada ""
  "/usr/local/texlive/2019/texmf-dist/fonts/type1/urw/times/utmbi8a.pfb" 1136849748 44656 0cbca70e0534538582128f6b54593cca ""
  "/usr/local/texlive/2019/texmf-dist/fonts/type1/urw/times/utmr8a.pfb" 1136849748 46026 6dab18b61c907687b520c72847215a68 ""
  "/usr/local/texlive/2019/texmf-dist/fonts/type1/urw/times/utmri8a.pfb" 1136849748 45458 a3faba884469519614ca56ba5f6b1de1 ""
  "/usr/local/texlive/2019/texmf-dist/fonts/vf/adobe/courier/pcrb8t.vf" 1136768653 2184 5d20c8b00cd914e50251116c274e2d0b ""
  "/usr/local/texlive/2019/texmf-dist/fonts/vf/adobe/courier/pcrr8c.vf" 1136768653 3552 6a7911d0b338a7c32cbfc3a9e985ccca ""
  "/usr/local/texlive/2019/texmf-dist/fonts/vf/adobe/courier/pcrr8t.vf" 1136768653 2184 8475af1b9cfa983db5f46f5ed4b8f9f7 ""
  "/usr/local/texlive/2019/texmf-dist/fonts/vf/adobe/helvetic/phvb8t.vf" 1136768653 2340 0efed6a948c3c37d870e4e7ddb85c7c3 ""
  "/usr/local/texlive/2019/texmf-dist/fonts/vf/adobe/helvetic/phvbo8t.vf" 1136768653 2344 88834f8322177295b0266ecc4b0754c3 ""
  "/usr/local/texlive/2019/texmf-dist/fonts/vf/adobe/helvetic/phvr8t.vf" 1136768653 2344 44ff28c9ef2fc97180cd884f900fee71 ""
  "/usr/local/texlive/2019/texmf-dist/fonts/vf/adobe/times/ptmb8t.vf" 1136768653 2340 df9c920cc5688ebbf16a93f45ce7bdd3 ""
  "/usr/local/texlive/2019/texmf-dist/fonts/vf/adobe/times/ptmbi8t.vf" 1136768653 2324 51908dae6e03953a90119973962f0e4d ""
  "/usr/local/texlive/2019/texmf-dist/fonts/vf/adobe/times/ptmr8t.vf" 1136768653 2348 91706c542228501c410c266421fbe30c ""
  "/usr/local/texlive/2019/texmf-dist/fonts/vf/adobe/times/ptmri8c.vf" 1136768653 3564 2068501a2226e54ce367edd5b047e424 ""
  "/usr/local/texlive/2019/texmf-dist/fonts/vf/adobe/times/ptmri8t.vf" 1136768653 2328 6cd7df782b09b29cfc4d93e55b6b9a59 ""
  "/usr/local/texlive/2019/texmf-dist/tex/context/base/mkii/supp-pdf.mkii" 1461363279 71627 94eb9990bed73c364d7f53f960cc8c5b ""
  "/usr/local/texlive/2019/texmf-dist/tex/generic/babel-french/french.ldf" 1554239484 67761 0a9fd69cc4fb4808b91419646d42b923 ""
  "/usr/local/texlive/2019/texmf-dist/tex/generic/babel/babel.def" 1557004175 78303 c54368864528e704f6f347e670e631cd ""
  "/usr/local/texlive/2019/texmf-dist/tex/generic/babel/babel.sty" 1557004175 17694 218403ecedc79eb72e8ecde7bc3b3f87 ""
  "/usr/local/texlive/2019/texmf-dist/tex/generic/babel/switch.def" 1557004175 14454 24b05ffde1fce7ca761904a613e8ce1f ""
  "/usr/local/texlive/2019/texmf-dist/tex/generic/babel/txtbabel.def" 1554327732 7435 ef73091c345c1e2e85b0f9a441eb1f7d ""
  "/usr/local/texlive/2019/texmf-dist/tex/generic/ifxetex/ifxetex.sty" 1284331290 1458 43ab4710dc82f3edeabecd0d099626b2 ""
  "/usr/local/texlive/2019/texmf-dist/tex/generic/oberdiek/etexcmds.sty" 1463608860 7612 729a8cc22a1ee0029997c7f74717ae05 ""
  "/usr/local/texlive/2019/texmf-dist/tex/generic/oberdiek/gettitlestring.sty" 1463608860 8237 3b62ef1f7e2c23a328c814b3893bc11f ""
  "/usr/local/texlive/2019/texmf-dist/tex/generic/oberdiek/hobsub-generic.sty" 1536701967 185392 b99a6d53180e04300c35e18725f31231 ""
  "/usr/local/texlive/2019/texmf-dist/tex/generic/oberdiek/hobsub-hyperref.sty" 1465595255 70864 bcd5b216757bd619ae692a151d90085d ""
  "/usr/local/texlive/2019/texmf-dist/tex/generic/oberdiek/ifluatex.sty" 1463608860 7324 2310d1247db0114eb4726807c8837a0e ""
  "/usr/local/texlive/2019/texmf-dist/tex/generic/oberdiek/ifpdf.sty" 1536443070 1300 96620a7d94bc0ceb261d968770ce8315 ""
  "/usr/local/texlive/2019/texmf-dist/tex/generic/oberdiek/ifvtex.sty" 1463608860 6797 90b7f83b0ad46826bc16058b1e3d48df ""
  "/usr/local/texlive/2019/texmf-dist/tex/generic/oberdiek/infwarerr.sty" 1463608860 8253 473e0e41f9adadb1977e8631b8f72ea6 ""
  "/usr/local/texlive/2019/texmf-dist/tex/generic/oberdiek/kvsetkeys.sty" 1463608860 14040 ac8866aac45982ac84021584b0abb252 ""
  "/usr/local/texlive/2019/texmf-dist/tex/generic/oberdiek/ltxcmds.sty" 1463608860 18425 5b3c0c59d76fac78978b5558e83c1f36 ""
  "/usr/local/texlive/2019/texmf-dist/tex/latex/amsfonts/amsfonts.sty" 1359763108 5949 3f3fd50a8cc94c3d4cbf4fc66cd3df1c ""
  "/usr/local/texlive/2019/texmf-dist/tex/latex/amsfonts/amssymb.sty" 1359763108 13829 94730e64147574077f8ecfea9bb69af4 ""
  "/usr/local/texlive/2019/texmf-dist/tex/latex/amsfonts/umsa.fd" 1359763108 961 6518c6525a34feb5e8250ffa91731cff ""
  "/usr/local/texlive/2019/texmf-dist/tex/latex/amsfonts/umsb.fd" 1359763108 961 d02606146ba5601b5645f987c92e6193 ""
  "/usr/local/texlive/2019/texmf-dist/tex/latex/amsmath/amsbsy.sty" 1523134290 2211 ca7ce284ab93c8eecdc6029dc5ccbd73 ""
  "/usr/local/texlive/2019/texmf-dist/tex/latex/amsmath/amsgen.sty" 1523134290 4161 7f6eb9092061a11f87d08ed13515b48d ""
  "/usr/local/texlive/2019/texmf-dist/tex/latex/amsmath/amsmath.sty" 1544567569 85093 77cfa18ddbae4d9b74ade33d843686d3 ""
  "/usr/local/texlive/2019/texmf-dist/tex/latex/amsmath/amsopn.sty" 1523134290 4116 32e6abd27229755a83a8b7f18e583890 ""
  "/usr/local/texlive/2019/texmf-dist/tex/latex/amsmath/amstext.sty" 1523134290 2432 8ff93b1137020e8f21930562a874ae66 ""
  "/usr/local/texlive/2019/texmf-dist/tex/latex/base/alltt.sty" 1523050425 3142 41d54e810bb4bed45b915ab99f1df119 ""
  "/usr/local/texlive/2019/texmf-dist/tex/latex/base/fontenc.sty" 1544567569 4573 e9e01f5b11821a77b916dad378cb86b8 ""
  "/usr/local/texlive/2019/texmf-dist/tex/latex/base/inputenc.sty" 1544567569 5052 b64c57f4a38aae0d2745f8298fa50814 ""
  "/usr/local/texlive/2019/texmf-dist/tex/latex/base/makeidx.sty" 1523050425 1942 125bdb0eb122d38c47905721b0682b1e ""
  "/usr/local/texlive/2019/texmf-dist/tex/latex/base/report.cls" 1544567569 22992 ac205d2578ad3f18cf73b50579632d1c ""
  "/usr/local/texlive/2019/texmf-dist/tex/latex/base/size10.clo" 1544567569 8294 6d6e23d5169c0d89d173f6c7e08a005a ""
  "/usr/local/texlive/2019/texmf-dist/tex/latex/base/t1enc.def" 1544567569 10689 ce0f2353f9a1f42b29f591f3fe8e040a ""
  "/usr/local/texlive/2019/texmf-dist/tex/latex/base/textcomp.sty" 1544567569 16156 a293f9cfd4f8552bb5d1028389f53e72 ""
  "/usr/local/texlive/2019/texmf-dist/tex/latex/base/ts1cmr.fd" 1523050425 2433 cdefd2509a12ba58001f2024f63aae9a ""
  "/usr/local/texlive/2019/texmf-dist/tex/latex/base/ts1enc.def" 1523050425 7769 97b639552068544f7c98d557abb19f41 ""
  "/usr/local/texlive/2019/texmf-dist/tex/latex/base/ts1enc.dfu" 1544567569 4973 923be56c54607ca99f7cc085a8c7e52b ""
  "/usr/local/texlive/2019/texmf-dist/tex/latex/capt-of/capt-of.sty" 1264379041 1311 063f8536a047a2d9cb1803321f793f37 ""
  "/usr/local/texlive/2019/texmf-dist/tex/latex/carlisle/scalefnt.sty" 1137109962 1360 df2086bf924b14b72d6121fe9502fcdb ""
  "/usr/local/texlive/2019/texmf-dist/tex/latex/cmap/cmap.sty" 1215522782 2883 427a7f7cb58418a0394dbd85c80668f6 ""
  "/usr/local/texlive/2019/texmf-dist/tex/latex/cmap/ot1.cmap" 1177721415 1207 4e0d96772f0d338847cbfb4eca683c81 ""
  "/usr/local/texlive/2019/texmf-dist/tex/latex/cmap/t1.cmap" 1215522782 1938 beaa4a8467aa0074076e0e19f2992e29 ""
  "/usr/local/texlive/2019/texmf-dist/tex/latex/fancyhdr/fancyhdr.sty" 1548974385 11128 a53805799bebfed6358fc1658a18e41f ""
  "/usr/local/texlive/2019/texmf-dist/tex/latex/fancyvrb/fancyvrb.sty" 1547588382 42733 79eb4d8b9f10bca9c5d3796630226536 ""
  "/usr/local/texlive/2019/texmf-dist/tex/latex/float/float.sty" 1137110151 6749 16d2656a1984957e674b149555f1ea1d ""
  "/usr/local/texlive/2019/texmf-dist/tex/latex/fncychap/fncychap.sty" 1292029257 19488 fdd52eb173b3197d748e1ec25acb042f ""
  "/usr/local/texlive/2019/texmf-dist/tex/latex/framed/framed.sty" 1338588508 22449 7ec15c16d0d66790f28e90343c5434a3 ""
  "/usr/local/texlive/2019/texmf-dist/tex/latex/geometry/geometry.sty" 1525727744 41645 0653033a985e06c69a2a9cea9a95e31a ""
  "/usr/local/texlive/2019/texmf-dist/tex/latex/graphics-cfg/color.cfg" 1459978653 1213 620bba36b25224fa9b7e1ccb4ecb76fd ""
  "/usr/local/texlive/2019/texmf-dist/tex/latex/graphics-cfg/graphics.cfg" 1465944070 1224 978390e9c2234eab29404bc21b268d1e ""
  "/usr/local/texlive/2019/texmf-dist/tex/latex/graphics-def/pdftex.def" 1515537368 17334 520b9b85ad8a2a48eda3f643e27a5179 ""
  "/usr/local/texlive/2019/texmf-dist/tex/latex/graphics/graphics.sty" 1523134385 15272 5a97061616e0c8b2aa79c6615ff769f4 ""
  "/usr/local/texlive/2019/texmf-dist/tex/latex/graphics/graphicx.sty" 1523134385 9063 d0a305975932762117cd1f06a582f896 ""
  "/usr/local/texlive/2019/texmf-dist/tex/latex/graphics/keyval.sty" 1523134385 2591 6404d0c7d28505fb38ce0d86c2e28ae7 ""
  "/usr/local/texlive/2019/texmf-dist/tex/latex/graphics/trig.sty" 1523134385 3977 cb9221976ed8a183afad65b59aa8629a ""
  "/usr/local/texlive/2019/texmf-dist/tex/latex/hyperref/hpdftex.def" 1543704539 51744 477aad43ad6a7ba8c462d20c3e0808e0 ""
  "/usr/local/texlive/2019/texmf-dist/tex/latex/hyperref/hyperref.sty" 1543704539 236074 d994150943d35d6af0d586a60cc78dd1 ""
  "/usr/local/texlive/2019/texmf-dist/tex/latex/hyperref/nameref.sty" 1465687530 12949 81e4e808884a8f0e276b69410e234656 ""
  "/usr/local/texlive/2019/texmf-dist/tex/latex/hyperref/pd1enc.def" 1543704539 14098 b4e1ecab4699a0341b8e1349e4c53fb1 ""
  "/usr/local/texlive/2019/texmf-dist/tex/latex/hyperref/puenc.def" 1543704539 122411 537c1e113664b098b6572dbc27a726af ""
  "/usr/local/texlive/2019/texmf-dist/tex/latex/latexconfig/epstopdf-sys.cfg" 1279039959 678 4792914a8f45be57bb98413425e4c7af ""
  "/usr/local/texlive/2019/texmf-dist/tex/latex/latexconfig/hyperref.cfg" 1254097189 235 6031e5765137be07eed51a510b2b8fb7 ""
  "/usr/local/texlive/2019/texmf-dist/tex/latex/mmap/oml.cmap" 1215649417 1866 c1c12138091b4a8edd4a24a940e6f792 ""
  "/usr/local/texlive/2019/texmf-dist/tex/latex/mmap/oms.cmap" 1215649417 2370 3b1f71b14b974f07cef532db09ae9ee0 ""
  "/usr/local/texlive/2019/texmf-dist/tex/latex/mmap/omx.cmap" 1215649417 3001 252c8ca42b06a22cb1a11c0e47790c6e ""
  "/usr/local/texlive/2019/texmf-dist/tex/latex/needspace/needspace.sty" 1364856750 852 0e34dbb72efc69fa07602405ad95585e ""
  "/usr/local/texlive/2019/texmf-dist/tex/latex/oberdiek/auxhook.sty" 1463608860 3834 4363110eb0ef1eb2b71c8fcbcdb6c357 ""
  "/usr/local/texlive/2019/texmf-dist/tex/latex/oberdiek/epstopdf-base.sty" 1463608860 12095 5337833c991d80788a43d3ce26bd1c46 ""
  "/usr/local/texlive/2019/texmf-dist/tex/latex/oberdiek/grfext.sty" 1463608860 7075 2fe3d848bba95f139de11ded085e74aa ""
  "/usr/local/texlive/2019/texmf-dist/tex/latex/oberdiek/hypcap.sty" 1463608860 3720 63669daeb0b67d5fbec899824e2f1491 ""
  "/usr/local/texlive/2019/texmf-dist/tex/latex/oberdiek/kvoptions.sty" 1463608860 22417 1d9df1eb66848aa31b18a593099cf45c ""
  "/usr/local/texlive/2019/texmf-dist/tex/latex/oberdiek/rerunfilecheck.sty" 1463608860 9581 023642318cef9f4677efe364de1e2a27 ""
  "/usr/local/texlive/2019/texmf-dist/tex/latex/parskip/parskip-2001-04-09.sty" 1536789184 2757 ea00cb4f4e9abc702916f74d3812ef67 ""
  "/usr/local/texlive/2019/texmf-dist/tex/latex/parskip/parskip.sty" 1547677674 4152 3f6e512e6999979e82f39978a3e61b9e ""
  "/usr/local/texlive/2019/texmf-dist/tex/latex/psnfss/t1pcr.fd" 1137110629 798 d5895e9edc628f2be019beb2c0ec66df ""
  "/usr/local/texlive/2019/texmf-dist/tex/latex/psnfss/t1phv.fd" 1137110629 1488 9a55ac1cde6b4798a7f56844bb75a553 ""
  "/usr/local/texlive/2019/texmf-dist/tex/latex/psnfss/t1ptm.fd" 1137110629 774 61d7da1e9f9e74989b196d147e623736 ""
  "/usr/local/texlive/2019/texmf-dist/tex/latex/psnfss/times.sty" 1156702453 857 6c716f26c5eadfb81029fcd6ce2d45e6 ""
  "/usr/local/texlive/2019/texmf-dist/tex/latex/psnfss/ts1pcr.fd" 1137110629 643 92c451bb86386a4e36a174603ddb5a13 ""
  "/usr/local/texlive/2019/texmf-dist/tex/latex/psnfss/ts1ptm.fd" 1137110629 619 96f56dc5d1ef1fe1121f1cfeec70ee0c ""
  "/usr/local/texlive/2019/texmf-dist/tex/latex/tabulary/tabulary.sty" 1403566480 13791 8c83287d79183c3bf58fd70871e8a70b ""
  "/usr/local/texlive/2019/texmf-dist/tex/latex/titlesec/titlesec.sty" 1458858524 37387 afa86533e532701faf233f3f592c61e0 ""
  "/usr/local/texlive/2019/texmf-dist/tex/latex/tools/array.sty" 1546812253 12527 31ab547f6520657998ecf91709f950ac ""
  "/usr/local/texlive/2019/texmf-dist/tex/latex/tools/longtable.sty" 1546812253 12131 6791c5e94fb3ca8579d185a449d8b41e ""
  "/usr/local/texlive/2019/texmf-dist/tex/latex/upquote/upquote.sty" 1334873510 1048 517e01cde97c1c0baf72e69d43aa5a2e ""
  "/usr/local/texlive/2019/texmf-dist/tex/latex/url/url.sty" 1388531844 12796 8edb7d69a20b857904dd0ea757c14ec9 ""
  "/usr/local/texlive/2019/texmf-dist/tex/latex/varwidth/varwidth.sty" 1238697683 10894 d359a13923460b2a73d4312d613554c8 ""
  "/usr/local/texlive/2019/texmf-dist/tex/latex/wrapfig/wrapfig.sty" 1137111090 26220 3701aebf80ccdef248c0c20dd062fea9 ""
  "/usr/local/texlive/2019/texmf-dist/tex/latex/xcolor/xcolor.sty" 1463002160 55589 34128738f682d033422ca125f82e5d62 ""
  "/usr/local/texlive/2019/texmf-dist/web2c/texmf.cnf" 1557092114 35484 cb1661360667bf4db662a8895053b554 ""
  "/usr/local/texlive/2019/texmf-var/fonts/map/pdftex/updmap/pdftex.map" 1557342064 3277517 23507ed665b4dd9046f0f2a94bbef2be ""
  "/usr/local/texlive/2019/texmf-var/web2c/pdftex/pdflatex.fmt" 1557433531 4259635 c04014c6f0379deea25ea6c16288c656 ""
  "/usr/local/texlive/2019/texmf.cnf" 1557341546 577 d150fef99ac436ad1156e86b0892f6ef ""
  "footnotehyper-sphinx.sty" 1609484009 8888 1bbd7bdeae8c8bed1d10d551bddb1cc9 ""
  "mooc_nsi.aux" 1612787932 11241 0dcd25f42fd38257bd3d0ed4e44b2c5f "pdflatex"
  "mooc_nsi.ind" 1612787930 4788 ccf4d5bda3fcff6dd2f155908dcfb7cb "makeindex mooc_nsi.idx"
  "mooc_nsi.out" 1612787932 297 8a0cb1cf75f0e04cbde5aa922d5cfdae "pdflatex"
  "mooc_nsi.tex" 1612787929 48023 b5c1d3e6e38be312021921718ad54707 ""
  "mooc_nsi.toc" 1612787932 212 4599294e75e0c38d9aa32d2517e66a91 "pdflatex"
  "sphinx.sty" 1609484009 82250 00bd36f302b7cc8960761f445d02b13e ""
  "sphinxhighlight.sty" 1612787929 8137 38a433148fcb7611515a989ff1750dd5 ""
  "sphinxmanual.cls" 1609484009 4236 124cd90deb92742b5d3922bfc2cd70c0 ""
  "sphinxmessages.sty" 1612787929 742 57bfa84249e53808c286b99adea1854e ""
  "sphinxmulticell.sty" 1609484009 14606 0b6edc2b1a83546ed92026d1f6a311b5 ""
  (generated)
  "mooc_nsi.idx"
  "mooc_nsi.pdf"
  "mooc_nsi.aux"
  "mooc_nsi.out"
  "mooc_nsi.log"
  "mooc_nsi.toc"
