#FIG 3.2  Produced by xfig version 3.2.5-alpha5
Landscape
Center
Metric
A4      
100.00
Single
-2
1200 2
2 1 0 1 0 7 50 -1 -1 0.000 0 0 -1 1 0 2
	1 1 1.00 60.00 120.00
	 450 900 4680 900
2 1 0 1 0 7 50 -1 -1 0.000 0 0 -1 1 0 2
	1 1 1.00 60.00 120.00
	 450 900 450 270
2 1 0 1 0 7 50 -1 -1 0.000 0 0 -1 1 0 2
	1 1 1.00 60.00 120.00
	 675 900 675 1215
2 1 0 1 0 7 50 -1 -1 0.000 0 0 -1 1 0 2
	1 1 1.00 60.00 120.00
	 1125 900 1125 1215
2 1 0 1 0 7 50 -1 -1 0.000 0 0 -1 1 0 2
	1 1 1.00 60.00 120.00
	 1575 900 1575 1215
2 1 0 1 0 7 50 -1 -1 0.000 0 0 -1 1 0 2
	1 1 1.00 60.00 120.00
	 2925 900 2925 1215
2 1 0 1 0 7 50 -1 -1 0.000 0 0 -1 1 0 2
	1 1 1.00 60.00 120.00
	 2475 900 2475 1215
4 0 0 50 -1 0 10 0.0000 4 15 135 2160 1125 ...\001
4 0 0 50 -1 0 10 0.0000 6 150 465 225 180 Capital\001
4 0 0 50 -1 0 10 0.0000 6 75 60 630 1350 a\001
4 0 0 50 -1 0 10 0.0000 6 75 60 1080 1350 a\001
4 0 0 50 -1 0 10 0.0000 6 75 60 1530 1350 a\001
4 0 0 50 -1 0 10 0.0000 6 75 60 2880 1350 a\001
4 0 0 50 -1 0 10 0.0000 6 105 75 630 855 1\001
4 0 0 50 -1 0 10 0.0000 4 105 75 1080 855 2\001
4 0 0 50 -1 0 10 0.0000 4 105 75 1530 855 3\001
4 0 0 50 -1 0 10 0.0000 6 75 75 2880 810 n\001
4 0 0 50 -1 0 10 0.0000 6 75 60 2430 1350 a\001
4 0 0 50 -1 0 10 0.0000 6 105 210 2385 810 n-1\001
