{
  "type": "service_account",
  "project_id": "msgff-372514",
  "private_key_id": "f79959a5589b179f22ae8ebc9fc04bef695c2758",
  "private_key": "-----BEGIN PRIVATE KEY-----\nMIIEvgIBADANBgkqhkiG9w0BAQEFAASCBKgwggSkAgEAAoIBAQC92yqpyfJ1MQsg\nco5PdGVsPtx3kE+BzTu/LdtKub+7/VpmxWGMLwl8bD5HFA5vpArDtjATJsYlsRz8\nhx0BISX0sUNWYMJmK6/Mid+QYceXc6n7EtenCdFTzt/f8GV3XeMVAn/BnTCLaPCI\n16+7jX/4dMC3cfKg2FOygu/Z1pc/VZGHRQNGj2jjMdGTOoq4HdcVvMmx5gPUCGgT\nm01vb4x4g62exmgAbQNi4XdzLkQCPRj7fXeij/CTPi2s5gASpVJH4sRA+RaJZzE2\noNFlHChmYy5AJeJBP3rLHQLdjHpGgSz542FKzAbh43X/DXIIWCBNIOBcctIBgtJK\nHNjHdi5BAgMBAAECggEAAzjz+o2KU12lnROAsZ3NxmZzPsbI6LC7d8FfIF+yfs38\nMbQeNZ9LQ4zBSlrPa2rvAVcnbf3JnXRqA+nFruIZhzOWi2HpTstlSJ0a+bQFK5+L\nli7B0QygPFJNt7r4d+wUqYPBOB+zRhx9/66chZwPXN/bcQmqtvrxAb3J9So4pzsk\nuS398lEUYc9iaUrCh7XOZ+EZ6Ttdk/4vBcNPftT446PCYOUcZWJPlJz+4XdSEVHX\n0PgilMx++fj5iZzyyB/XsjP/qhZQ7zXp/r9eif3OZat6iRDMsIkvuyRfh7F3kRVt\nbRfVPiblTFGW+g6wqurt+pS9hYUY1Bk0q0+IQOUcaQKBgQDcrwehQqL1Nm3mD7uB\nyQIPXg9N2qFtZ/aEvFFDGVKbp3CNsQ5RgiJJaM04K1UqHkgRB2xwVY2vuMP6n4Qp\ne8deJCnTbimezTzP09P0OLZ1/UwYnP67Xf81m25MZuUjES4S65Gg2YRHC4+l1aVX\nMn7mJlayPdmmsp/fhOrhRHcDiQKBgQDcPTEvbc9Z5WAiBAvroIZzh86sAcejMtlb\nV3FVpSTqdk78OL8gXJYplSVdd2H/MN9lQpVnZhN6p3SWZOybZfZ51t50eLc9nnR+\nv7iTGdllUdiVYfJc3T0LX+4TgqZ5sEb9DcVKRR6Q7Qzy6FNP1CD/Hl44wtUKPQOf\ntyOgP6BO+QKBgQDCTQEkxK0BxYiBdPycysQbj69d1s8mqtBsEfpiX5tSHNyGhIuc\nzD0v8Swu9kgnqz28cJLTXSBAxScYNPaCJ89jXefNlkLi5MVUHqeRcZWE0R381c2a\nXqpjIpS8hCPe+jNcyTgRLTK/8rfpRPAsk/MS5FKU4MwPb1o/zKGY8VTwMQKBgGAK\nYz9+kFRwXUqYHyaiet84ktyZbhhx3S0i5a5mdMG1093TVS1kkqsRehjXLaneAx0i\nOwq7DbWH/qRy4GcnwKMDG0EJP0ckqUJ4kqG7PP0dAuiprMnoRG2IaMajS7t3Lo29\nipJHr/udE+99do8yPy1hbc8sz0BGuSTV9Tg1Zs/pAoGBAMHqf+ti1/qUbXXzOLwV\nF+h0OxVdUzFhao168qozetpWTdcqXDRGdI5GbMCQKCtDjbqOppnTLVEq1MLwKrlB\nc4b0xYtcYL24d5HKWPD7FflIkezCxsYbRAxPGIMSnuawqMB/WM7h3BjwftHbHCj0\naueZYOLuvQ2Q6Q6J/FoYOjeG\n-----END PRIVATE KEY-----\n",
  "client_email": "mfc-n5rsjfjvmr6zevs61jo-hp320w@msgff-372514.iam.gserviceaccount.com",
  "client_id": "116618382040262877393",
  "auth_uri": "https://accounts.google.com/o/oauth2/auth",
  "token_uri": "https://oauth2.googleapis.com/token",
  "auth_provider_x509_cert_url": "https://www.googleapis.com/oauth2/v1/certs",
  "client_x509_cert_url": "https://www.googleapis.com/robot/v1/metadata/x509/mfc-n5rsjfjvmr6zevs61jo-hp320w%40msgff-372514.iam.gserviceaccount.com"
}
