{
  "type": "service_account",
  "project_id": "msgff-372514",
  "private_key_id": "5c3ca87b40a170ede094afc035d479a7889baddb",
  "private_key": "-----BEGIN PRIVATE KEY-----\nMIIEvQIBADANBgkqhkiG9w0BAQEFAASCBKcwggSjAgEAAoIBAQDjkiJ+mYHR3e41\nxmyxJHh5hl0Y8bGDtgRteKyJFQgYh93RACfUZqCt+7mWpoTk02fBk1VqiPO38krt\nsemhASII0h0yFjpMEAtJD01KyVKZ2DYNBUvPFDhur6gwOXpBwByW7N2jlROvTd7d\nMvkCYetuJ9xsBpNK8L0GkQII0RnU52UnJ+IlGSp2h3LFvbx/irZa6UEW5YKTnEDY\nbnPlDLhDZqubfjdO8Lbz/fsDV4ZqVSg7x5um74Uhh+lUHcDEDG8N2RjzarjhQ/q2\nqngRcBfPngs6Qn9x3n4pR0reIkssOw140r4OgzkyTg0Udwe4w3GraoaOI0C55nCR\nV2D+RTXrAgMBAAECggEASxrGkZud8aJZ5Jt48bmEnS7P+NSDbmGa8noaDx/GzTnB\n5iE0A/Be5SynomWQhGiU3JkAXqmWLcYkHnBSF5XlIp4djpMxaDr/TnxjWOQ6g5WM\nuR1fWJdmzHjifA/sHlkF1nWT7FHd7kQ34i7ZaYThizhSkcBVyizLZahj0H8aFF4u\nYWatoOPiCMVtJodgIEo1Veuj49lmY27ukhQ481BrF9IF+f1pMCG4SS1/XE7bvVxi\nZlQf/tzru65jxczOX/81Sp/PkJVIUn8mHijecmP7ak6yU+GKtIoZaoPcl60K6mek\n+mL1nmhIHsaeVE06QP3WX8n4hX5LfETiHWN0Bd5WmQKBgQD6hSnUmZtBugitZKc9\nYAWptO6K6qhc+wFqVNn5K+KnY98zv8AorDckMRIRCaFqf3EQARr/L6eDSSN2qJW3\nJ7RnKn+5mtMk0jfkk+uG75riCBsxboVQXaSnx2XTUSA9eqh5JM/7gJlNnmS2jXJG\nh+tzkHLHrNhqk56Q6gQ8LafL5QKBgQDojHZLSU+YjUCfDhBwzjn0ZRtSad2CbXJ3\nJsnb9hFcBFBfy7M5pB9ko0xk9BAh/6ZZacl5qxmgeb0eGZA/55QDFayl5UOpmlPF\nBS4G7lFTAr+xIesNmx9og4DfWIgcx3lsZ7ThGT9z1SqNirp9P/IA800mdn+mGccR\n9w6SvlX9jwKBgHzZYmhuiP5vjSWEtQgUU54o6nzWx0NXYHQyh1LzeQh88F6k4Eok\n0XI69ksBZq1hh+I2+tJUWIJIL+FR0RMvOWv0tSS1sSZ3kZ1bzpQ30xN0gMDY2J2d\nnZJ0AB4ZHx0khNOi8ffgNgaFuqFzypC16jR0t48lZ9Ftcie8SJIJGse1AoGAXbvA\nMrhqDONimLnihpWZZpkaWi2xy1CyQrSvyKl2ddCHVRWWODWfMcFgmZCGsC2Lr56k\nRxZgTf7D684CBsAhON0TqgqvKz25ZkCgPMrynLMO8Sbqx6EvF8FpwJy+wFrm5nsm\nvVSf7uCNNmAkqzeLJDbtcgNxkFHzm5oplZyCrKECgYEA4TgeINTZtpJvGoym7HkW\nFco3rbTAArz0ScN1ZRMuUVMeFWTRlfpShIGqEZ4S4a1zS2Tyhf6W0cVAs1EWr9zN\nhzvM38pJpmgsyGgYiz7WjVxYoGJW/SbBacbDFoFzS1NwAXhr/q/j3+dGKOdhHzPl\n647+NUP2q2yD3zCLdCmSkVA=\n-----END PRIVATE KEY-----\n",
  "client_email": "mfc-1cw9t1ursxgw4lty-mdyzggblv@msgff-372514.iam.gserviceaccount.com",
  "client_id": "104140664090788774642",
  "auth_uri": "https://accounts.google.com/o/oauth2/auth",
  "token_uri": "https://oauth2.googleapis.com/token",
  "auth_provider_x509_cert_url": "https://www.googleapis.com/oauth2/v1/certs",
  "client_x509_cert_url": "https://www.googleapis.com/robot/v1/metadata/x509/mfc-1cw9t1ursxgw4lty-mdyzggblv%40msgff-372514.iam.gserviceaccount.com"
}
