{
  "type": "service_account",
  "project_id": "msgff-372514",
  "private_key_id": "75659733014bc13f4e9be3cf3109c4491f15b526",
  "private_key": "-----BEGIN PRIVATE KEY-----\nMIIEvAIBADANBgkqhkiG9w0BAQEFAASCBKYwggSiAgEAAoIBAQDptLlxk2M1j+CU\nLxJqq/M2GKkWzA85Uy2eWlNG08QSdAyg1ywHcS2C2azbK4SOvYyiyY7/CgH82LSY\nEqKjB5AqpdZm2nXwRNvYLpdJoIdGDgEw5xTHv2nICfvoOYJqtoMBDkN/jUYTS3P8\nMKjN00I/Un6wey4pQ0MuM8eL4W1GtaDsVi81DMJZBkAuogowjvDCQrrgtVR8X2bh\n0VcIRB2ONBeZo/tI5nTIGYDXGm4hrLS37YYP4ihw0GSN1250YmZhu7SrFG1RcFms\nifGH4SohhUMqYdWaCbhyZ8HOTaNLpgdPEGC2M1VrB0IUMLxq2wxZhJ1hSoMWeeRh\nHT9RQkWTAgMBAAECggEADqYxaZkfgt/958v7j4wvtphdIPyxh5pbJa3rwmjLxYxY\nrkxOijjh7W3Pk/1qVbgz9JBF0l7COSMsTsv8PdPfiYzTn6bZ9bGbRjXFbewODqoa\nEQKrHso0y0E09R2Fu0Kte4d1W61zUwpLvucd7ajsYiO9pTpTbmq071R3kaETxHbH\nahOIYaEGtXz42uV4iOru9eZw+U1y9I2ExOV4+6zkdSs4pg5NomxrYOyud70FYKbi\n/7o0nM4Wi2xtKEvKw/JVEn/pqcQLF9ql/5RZZEf+FRhFwxl64PenwbIkvwG8pvD6\nXxbqpButkmc4JHkW/1GytI1u46jBNHyCWUWCQvX3gQKBgQD/a4dbVIsBT4Qv4fVG\nd7054Yy1eRu5RhsWrSIj2pcLRjnBpcbBsfhZZ8izCIrEbA1OrehvMjz1ctvXWn/h\n1JAmR+TlvhJyn0fAahqfNLkWoOCx7fZlengW1uIPK3HB1qC3/i9kws585sZHby8S\nkmeCmwHCBASReo+eqDjSvYwJUQKBgQDqPJLZiaxbrUxTHKuNuxiDubzSUgMIBKH0\n0pTo0xMDsfAAn21SeKP2JrsH3E2Jcw0ZWbYMtRhm/sRoA6wcOE5SvouEycEdmZ8i\nt7HQ6iCzN3XGnm4OgZ+Llmsffs8wbu/Kc3JzKZcX82D56nnYLydid/WORZ1iM50S\nQv8gBZ0nowKBgEhdptPxeBC+/qyyUFPOyQYFKWChF4G+ox4hn3KZFAJVuzdqSI3I\nZpyuEubmnKpaEssf6qLWkP7Zs/+n3GOXXd/6rpeI6qEfD60sYq6IuYf3vLGswgqu\nUCfoadPycyCANrjqg3MA3o/0smi6z5Nrd3hBgpX9nW26U8aX0sGignKBAoGAcZXW\nEC82qW4r6NGqTxw/EwFqkwK5/ZVhg/rpws04Fz6eB29H8AoYWDEH2RP3dYOZAoYC\nRb87ihZY36eIOlcDhBRqS4YaY2QvSwKQ86HVIZLvRdVlwRsSZvoWEDvJ9M6W8TFy\nem3cmvymNgqB81dKXfGV3dvcKdalgEmEtd6DCskCgYAk4ItlmiIuSO3nEDI5EqAh\nKv42cYUY+tpaB9q5SOAnCRzbysA8s5wxKI94w8DIJg0PIdXWBC2Zmun6NfFXq3bJ\nJwCvpWbyK2pjWMGWJV8r9WkfTJeCYa+uSlhsiJFISV+jaZG0B+fxLZ4wUVn2md9j\nNU082MGKeOrFOM8mCVPTYA==\n-----END PRIVATE KEY-----\n",
  "client_email": "mfc-xqg1u7ims63rv9s1mwdy62k47i@msgff-372514.iam.gserviceaccount.com",
  "client_id": "114599735193957846036",
  "auth_uri": "https://accounts.google.com/o/oauth2/auth",
  "token_uri": "https://oauth2.googleapis.com/token",
  "auth_provider_x509_cert_url": "https://www.googleapis.com/oauth2/v1/certs",
  "client_x509_cert_url": "https://www.googleapis.com/robot/v1/metadata/x509/mfc-xqg1u7ims63rv9s1mwdy62k47i%40msgff-372514.iam.gserviceaccount.com"
}
