{
  "type": "service_account",
  "project_id": "msgff-372514",
  "private_key_id": "1e8e609f661c54a6dc453d6b140277d44d1b3241",
  "private_key": "-----BEGIN PRIVATE KEY-----\nMIIEvQIBADANBgkqhkiG9w0BAQEFAASCBKcwggSjAgEAAoIBAQDdTi9xF/IYzEJ1\nd34zrTeO2CCwegxM9mlTrL2+B23EcTCpRErNuXE2mnOB70RHRkF62ALh0B7iLL1j\nXLmyLyYwrcH0VlvpCzRFuL9rnT3wjZGfhtSkOwY3CwKSWCoUYnLQl9noxpy1nfHF\nU6XDiKIGTkSsxxJ7XjI3Iwf82SUCi4z+5H+bjX+MzPqk8kZFFmwLQnl0d5vYkBiA\n2HjaaqF6+zrKna1uceOWpTO//ouzsf61zQC0Xu/lFUGgpCRYrCttPIuBxU/2MYbs\n/sBm3+oK7ivUWlEXyLHuZxedm8JTdFxcPWcmLG0qaxfjFqUvXA3dFb0+odbFfKma\nEVLx/DO3AgMBAAECggEAO/r9Y78UOEFgP9snotTvSnFshrhFjjR4/ptCf/ceepAd\nGrtuNMzukNiStuRFErZJeASE33QbcryihgQzNkaOKMJnX5Rqa8LEI6N7iiy/hWux\nTNXr2yk+OXvr8gMgQI8gREXr4ym1fon05cESm+jz1RawiU2ZRkOVA5mkiBTIcaQl\nBh7rLyAlh7UU0DtCRHu3Qhh1fgW2vHCrovrQ4uiYsuoTKo+QBiClqXOkfYNtbqdo\nVeiEYG99Fbkf9tnlpvWHzfhApmILELQSASFGQEAPdOtk6gBn+gALjTId1I+hHRF1\no/yPQOx/J7qNNQcsxTGPPbtrADYNIrnFU8JGe4PcNQKBgQDws0fwyQlhZ4aqw3PV\ngCpdJb6WD5v4UjDxhy2PLkore2eCUsmPmQoY3mX+qbH7dGRgZNBdwBAGOCodljv3\nGi0uAoMP//lj9FtiAQ7N12Q37DOCbBm8Bb67kyzQHYxluIjsu4mJuUKJpqWcbNmv\nOm13tZTfUHe+LNatoUKkAj1sdQKBgQDrX06RbipC8Umej40emck8ALj/I1nHigp+\nJ1Ol0MyjDvrclWRtMVM+KzBBXxUy9kGeyZPRf/OpFVN2TpCrFKsugz8TipQAqe0b\nfF/L6c7ueOF6CQSP7w1zCqj1dl5GNJkPHbDttjCWaZTE8xDEodyHXO2Evp/azJeK\n07kKJ8/J+wKBgAKXy9SaNdGozdiVFnBcWxh5yZ3QOTvplsFjVWhPdVkWkTzkK2uy\nmFtAOhUOOu6ciGBJdb0szn9ip4F+FtNIouf1+vd3KHadMUbTABfTlC7OCpgDFhvi\na/WVVkw/pT2LSV5Tft3O8xqMgwg2W/n5RSie+iWVtlSEIyPnstIVfBfpAoGAEhRO\nCqm1oVK7XuyT4Gfbpzo++4oRmVwnFi2bJT92mIfMCSmIf0KsrDfRCxRsom979uBw\n9ESpyLEUqh+6yQlbZMU8ERox6CMlTVkuWpFpDbRHTYJn0U6Bb/a/p6sh7q6Xmyui\nrX+zF7qgbMhm31O3hsZCkFG8IahZc5Zzvi30rgUCgYEA60jBBtgL1UfEAt5QKUal\nrMQMP2psu5ZTpEImB6F3MPy+MlpK23rkIeqiReqngLr/dO7F1CV7mr7yQx7DZftP\nTYrHOJhf/dtMZ3DT02GSErLYu6eahVlNkxdUygLh6FZ0loTx1AgWCSjMDDm45DXk\n75Xq/TDTqbLD9gGyqxq+Ixk=\n-----END PRIVATE KEY-----\n",
  "client_email": "mfc-duug-bsw5dzi3u1zauw1mz0zie@msgff-372514.iam.gserviceaccount.com",
  "client_id": "103339593318087752490",
  "auth_uri": "https://accounts.google.com/o/oauth2/auth",
  "token_uri": "https://oauth2.googleapis.com/token",
  "auth_provider_x509_cert_url": "https://www.googleapis.com/oauth2/v1/certs",
  "client_x509_cert_url": "https://www.googleapis.com/robot/v1/metadata/x509/mfc-duug-bsw5dzi3u1zauw1mz0zie%40msgff-372514.iam.gserviceaccount.com"
}
