{
  "type": "service_account",
  "project_id": "msgff-372514",
  "private_key_id": "748b20b136a8e0654edf991053ecbb7369777d89",
  "private_key": "-----BEGIN PRIVATE KEY-----\nMIIEvQIBADANBgkqhkiG9w0BAQEFAASCBKcwggSjAgEAAoIBAQCdoStHp4y5qPKz\nd1Laduq9qWn5g3RPUcdqdqhBc0pIiJf7oQMN0gyfX9R/slvciiJT32OVU+2w9iBj\npIcHtLyC1f3e3mt1RMnzzeQkiUGAopSkxRxpBArQrVHwfUrTjGq4bPJt2lz5tmY/\nS05H6J7g0ijnf05VpjGahYJIi2/63y7T9FUByXIZjijcujrm6FmDUZdpDpoRDq/f\nxCKH2MUc+8onRwWhKSqjqNdmWxWjTsYkwGzauXrwLfZ/JwQylNAlEE9LTjClfAd0\nsvc2T6XYlh2d//kDSNp0L3OQOvnddIxO6hdb0cZpuikZD8u28CgBzWyFTuITYiqH\nEwPM1ejfAgMBAAECggEAIk+2RYslmTY62jDTkqVG9JDfdgYUt71T3ItGlbScS0yc\nVJQYP5Zk0/4+mas/zrIsxbf/C76wow/4PehO0jEXxZ0B/VTJ7EVUdmLvUbqkzPTW\nyUT0qbFND15i0yfatVC/3DQu0xWwnlSDTiy8te9fQg3NBJMUAJXD/2AnW1Yqwl8h\n8XAdCMQol6h4C0MjbkqzmkdYxnWG+jOe5yAOFMcDEwnytsXXmcaB7cJQlNDqSkzO\npPDHWjPQ7pmApBEGTmNFTia8AwtEWATMbIJGm8Y5cuV6xDZSmGe6mbJSYrA96ycI\n602kGndPJIIBKEcz4icsW6KxScaXzaD8fqXIMGu+IQKBgQDMZZUD/EEJJoOvVC4Y\n0VtBgnJUdx2DGmMSnEIKdSp2L30IZ+GeChDjAUI8OKCbbElRaxaxq2yyGXWYzRPV\nxMGkGp2V98ats1M2Kadp984NWgF1n/RAs2elrgvyxO9Wn0JyNtgbeIkBHZ+RuJIr\nTzA4kA3W4/kXgXMy6r25/aDWoQKBgQDFbPZtGW5LAHaFM+VM4pxbs+e9Xz3hEcZu\njCSV+xlWWOORyyiG9OcGaDVgN3kL7Xq2T6uApbEPm6COn1rbiCY/LAhAQLDOTW+m\nJ+eKzX04001bM1nZQ8B0qTG0lZdyMO0JrUj8/VMYqCuJq6hTIo9twaPumFZvl4b4\nsagCsngPfwKBgB3/7t414QnJyFwse9OSrtUvoz44eXFrpwztOFg2mDPehnh8XsYG\nbjITVjhmi1QkkaJMmHkdUwfU6sixmO6wQUenzGddhaCrCFSTyomoIGsfQcWU45G3\ng0fzArfwJbzOBT+kQxXNHDa4tVn7ACExLz+uDQn0TfQgQNtBTvWEf13hAoGATQ4R\nRFW3qYhdufGeXprX4ibenRgOQ8k3RLBoGy2tHvmEoMPFZp8xiFul8Y7VLOWcjomb\n65M//1KDoQbrZGHIY8Gg2ssk9vBcUmKiyZcYd9RpDd6GA/mgpSfgYZY9TPFxouRC\nZ5PMGgSRMaORCBmmF3WLsTU+D0H6CRj19U+I8qsCgYEAj446Um9YEVB7l51kvKOp\nTnmOGZSLj4gApqmt//JCF86oMhywtbTLQufe7KLKWs1gJSVSUb3HEPGDuxG2bvc6\npv5qJERWHUX6fDlFnE/NgBWFrXmYIFTPCHx8rFTAnx8044IURlP0EfNT5zn2eyLC\nMSPtjnAZ8e4PDxI0X8JKo5w=\n-----END PRIVATE KEY-----\n",
  "client_email": "mfc-49tw13csrsiw8bx7p1y0zswlq4@msgff-372514.iam.gserviceaccount.com",
  "client_id": "118400734476687640308",
  "auth_uri": "https://accounts.google.com/o/oauth2/auth",
  "token_uri": "https://oauth2.googleapis.com/token",
  "auth_provider_x509_cert_url": "https://www.googleapis.com/oauth2/v1/certs",
  "client_x509_cert_url": "https://www.googleapis.com/robot/v1/metadata/x509/mfc-49tw13csrsiw8bx7p1y0zswlq4%40msgff-372514.iam.gserviceaccount.com"
}
