{
  "type": "service_account",
  "project_id": "msgff-372514",
  "private_key_id": "ccaf1f91f9a8b526ae650652030c01c3356a638a",
  "private_key": "-----BEGIN PRIVATE KEY-----\nMIIEvgIBADANBgkqhkiG9w0BAQEFAASCBKgwggSkAgEAAoIBAQC56ESJsuW2R14N\ns1O895g7sGeDdc5dtwakWIu3UJzsyOa//mhd15Z+FznbaZnVBUJUTTd8AENpCs1Q\nRXMqPUU02CY4X2EmM2eW1zYXg6I3LKKRJ1xNjicR+u9L5NL5O0p4jwMsvTkLpdR/\n3BdeAn4pxntM75BoMm+1Ntc81WOrUyIatr2fLSLmRzb4j9ZqnZX9dtOwUpKidHIZ\n7BndmbmjXWK7XY7PMrXoiHw7a8N9Ukv+XAQLxk8bc/bELeulif71TDSb8OZCSrL4\nHo3ra3iJrp88IQ+9c5a4nusqPkRyjj3jaj2PdpRbSyDJQNo9zH/ZWlUATJncdPyF\neM0oNmyFAgMBAAECggEABRj2UCREojPgw1VodWUAmppirDsdtnofR4BaDGO8ec2k\nbh1GtVQE/14ZqweBPVMQl4kqfU7wij/Ok2XkG4Nkk2dd3OvYmRiNvZgXFpv4ZbTm\nnD5NDJ9aOOb9isIyer0CdL3PI3nox4X7hqn9RgmhdfnIRbrH5eOEJp7jVfqv6fGo\njpbWO+k65ZU81QVh2kSSMWZxz+qv9yYiu/Gb189egZyDx/wZsJkoMpjFpFMbJCNz\nMp0PMJxpA/INFce1xO6q0lJpGwMNwQ0mdO5rB+yAPEygz57yNAp0Ms8lvYY8Z4gn\nyLIMEZmSzraq7Ktlp2hc7Ecw+WsnWsgiPe1cgja7QQKBgQD23Y1adLGx8wz76mCV\n+TRVUCLR6E8UIb9E11VS27qtp0QuX+S/0pFsmt8JrkDqH+nCwOb6rogpGSzW2W0/\na2mEobaYVsQwtOS2gY1fbISyWKrR03HXP6dLRbaJ9wqempwulwHPDpO6dFpg8Fid\ngJ3gGd7bBGXWeclUQEGe5T550QKBgQDAyUkuWW2B7e/zOAmElqza9wgLs7aVLVq7\nR/QeavntN1vR2LX4V9N2Eh46+nhH4PT0E2Ub7lLbvJsHcB/B7o+hpZus4LfIfAgs\n40ga7hYwx503OJFURdw3UxcHNlbYcyWVzTcsmEzs82jAgvVMJwb5Hw51exmC3ELy\nMsCXmYzAdQKBgAjRbywtAO/vU6Zn/907kp/9hdDjsHdyoSdvXa/hA3ESiX/ykvQ7\nLFCp04+/9remPi5jv5xywZBeQtjF2X4rcxB2ylP0vXtT6tuOEyO2d6L7QdbO68EZ\nl/s7WULiXTG/KhcL89eWmLZPU68kxrWRk5IeunQuWwjnPsbQqMdpPusRAoGBAJBH\nVAxrAwiFINnea0keVrj8vbm8Qn28VrXocKs/FlJQ5tfSnsUAPZKUlqk/ADuTAN+V\nkErp/nrS2Rck8694sWehgDNOblyNbrThV/pHirXw/hjwrdrq+ZcyCP7tzOrqqgtF\nbPBj/tYqiI/isl/OqWpRssl7WilUXInUL8yFLxBtAoGBAM6cPuTPU6cbvpDHl/nk\nJM1e7ZVr6pUUS4S0jMiHpGV8brWk4QtJSv8xEdQOXsDhnzaH1I4h4PbiCo+QfFZv\n857zT4Pu5KYRnm55siSf2Q0fNmqWP6fpooqwEdFKM8Hsx2Un6D/ip488x3gFRfGF\naZSds3hq/rWHOc0UCx+AQYgf\n-----END PRIVATE KEY-----\n",
  "client_email": "mfc-173qujvtci89r17ojt4qrj7sal@msgff-372514.iam.gserviceaccount.com",
  "client_id": "103395540884837691574",
  "auth_uri": "https://accounts.google.com/o/oauth2/auth",
  "token_uri": "https://oauth2.googleapis.com/token",
  "auth_provider_x509_cert_url": "https://www.googleapis.com/oauth2/v1/certs",
  "client_x509_cert_url": "https://www.googleapis.com/robot/v1/metadata/x509/mfc-173qujvtci89r17ojt4qrj7sal%40msgff-372514.iam.gserviceaccount.com"
}
