{
  "type": "service_account",
  "project_id": "msgff-372514",
  "private_key_id": "5f3a40ea3c6f82549a876c98c49976f4a163a7fb",
  "private_key": "-----BEGIN PRIVATE KEY-----\nMIIEvAIBADANBgkqhkiG9w0BAQEFAASCBKYwggSiAgEAAoIBAQC5QureZBvC7UCd\nMDMEJk6s4UUjRJObAA+5M4RIH+cgSxgjlac2YkJLlVMDB8YGvGyorWJYpKzDpRHu\nEXoFpS0iknqOwnHZLmrlqsnhRt6iOnYaIpf5sBTXEQkHuE7WofclxmgD9IUr+1g/\n6q0frop9zNSSSv99Iw3uF8LAKiNvP8BDK3JvRvV1erXZh/JecAEmKQ9XeGVPxKh+\nUIxTSVw1yR9rn3b4+2wyUoGLB+28GCzW1hdth0vUSnEsjt1eRlplx6oXLwqI3+9T\ncwnvzgArqdTu+eerQiCOMQMxKNu/M7QalOWaY8kddfElZTzie2fNe6/g6R3ocd0w\na0dSirA1AgMBAAECggEAHU3i9euS4poBuvt5TmI61qjJdWMvD/kKA6sM9RWqyxZl\nypcs/HK9dtQ3bcbIgZ9Ddsj6QfhGZaoSNHyqNwNiKNJPtY43UPnBKfQCe/JoW/Pw\nY4DuVi4OldhZe9GhEt1KyTxhjqKagBMBahbWbKkAuhZw13UqhaJKXUt/4EKqGToQ\n6wHuHj9MiU+vcbgVBCnqNtW17k+d3sj0eWGB2dAJ9zxcLRz3xJS3iaMO82jJEkp2\ntYHPTaZntqRBG6WJpaRO3aS+t2CX0523FJ3On0ikf+TGEVX+1M1jXOiBOsaEUTpv\nwzJdhx5rCzep2dN0smaEtuz05eI/EuyDwzNvmOqSUQKBgQDbdjM2I6GKDkAlbNaO\nhc8eS5KhPgVkZ/TaG9AmXQRydA55ypUnfob914swgy0ZSShK8LzJNr/5G2LEPcE/\n7xkYjyQsre8UqKx2UpoBMXwz9Xm6dZ6xadSl2eqpP1XyYqn2m+w0Cz0CP0FKEEuc\nStRglcKkokTaHMIhJyRZTKrEeQKBgQDYGwvjvC7aKEN5BCJKGH3CuDbRLMjAkLeP\nzK2I7zi0+hZUP2Fv5s3fiPr9Dm4fjoU5moUBOoCc0XosCkKmO8zSwwcy+kNgK4HZ\nemx4JwHUGc6Cj3s8tLkN13S8xE4WbHXDIl7vx0jNa9BKcIzacZ3wB894pa19SyjV\nd3kqDDFCnQKBgA5XpDMmkvkNw11uxnrb/dQyBiwpfHq6XIMgjDLlo1PDh+qntaW2\nHCZcvsj12a2sXUjAgOX5gQRLqOHAU2/VNWOofym4WEaWW2cEMPJhBIf0w/bOlwdr\nLi2El1RmQjyr/AWU3RPtpBgQgDjR5c8aCNUjFGxj+nHyrTEzeKmpXAOpAoGAYH2D\nC4YkrUe5CLmtzcOts1mpMDB82m5DZ7ON8ExP146qladPDDXTynFRD9h3lyN9nMC/\njlLexiZKFIvoQm0FAT4PYtWXa8NBUSd2cxeHm3qCWI1UC0DuN53yA67q5tw6oIwi\nM5GZkg8Hi5VBbu+4A0qZelcPZZg/fUDBGuMiw4kCgYBYRYbJ8g7FZ+63/bJ0YWD5\nejT84x4cQZqfuCzlWCyvvNilLq0jSyWmnUOW3q9bkD4/Zo3QTxThNvRqDqPVanE7\niDOE7CDHMj7TWgM1s6q0E75JHfBf0S580/mI9d9aWbmQGmsKzNofC33s7pYrCLRy\nbGhDf3sBPg+AEEn9n1UzZA==\n-----END PRIVATE KEY-----\n",
  "client_email": "mfc-t06ukak1ut05zwh5e3f-k4cubl@msgff-372514.iam.gserviceaccount.com",
  "client_id": "113540319692299965512",
  "auth_uri": "https://accounts.google.com/o/oauth2/auth",
  "token_uri": "https://oauth2.googleapis.com/token",
  "auth_provider_x509_cert_url": "https://www.googleapis.com/oauth2/v1/certs",
  "client_x509_cert_url": "https://www.googleapis.com/robot/v1/metadata/x509/mfc-t06ukak1ut05zwh5e3f-k4cubl%40msgff-372514.iam.gserviceaccount.com"
}
