{
  "type": "service_account",
  "project_id": "msgff-372514",
  "private_key_id": "0376d1cb3d561b548e5d78a39e96f22f1202c95e",
  "private_key": "-----BEGIN PRIVATE KEY-----\nMIIEvAIBADANBgkqhkiG9w0BAQEFAASCBKYwggSiAgEAAoIBAQCrwdQvZm3fA95s\nPeaBl7rrnpgHt8Pv4YnlWJrkN6AjNxPLN+Fbd+8es0fHvMzdo2TLmnTwcWCvQl7t\nyXifPOE2Xy9ejAhYoSo9vcbRS0BxG/g1CxqJeJFK2ka5eK4kJmGItHrnrks7X5SS\n145nepcT+CS3eyUjAxRSFJMSON7kfAeiM8XwZlgZD9ZmBxNbgrW45m5Hyk1Ewojy\n06il5grxtzTRMb9QGoPLru8JQk7FlYenDaH0dP3c3NPhg6SF2liaXRU7w8JcdLLx\nTnk/N1DaUrKjOA5e8SxeluhWDmgZyMW/v8FxILvveM7E4ZoBCTrlPMfZknIrIH3O\nYWM/eB6FAgMBAAECggEATInE+NRvzKxILzsMX56SRNI5FGNfFKQQU5v+9gkVuuud\nzfbaXWzeKXOh3o+zSWc5EQQE7WrQt3jfnZ4kuu0hvR2AmeTUCU7UaIwLr5OVpXHd\n0yFeE3mfYVhQoPD2xRQ3bXhjtp90VgJ7Tk5xXoqCDXuMPRlKzMXgBc22Vi3yoaUq\no85+sYZEw+gyfAI+24yPwviTcYQzUMjSqn9UxBEAmHbEMsrqvVGeKJ6TpUAACYgH\nhfQblZCgyMU/0EhKhGTaB9r8/zY2Lo1BYLc1z9EdKtSeVOWL3omep2VsVqwRS4/g\nCMonR/uVtqFy2V4gVNkY1u2GLJLcicg8E9SgIaSyRwKBgQDajYG4PpbTYdr2d84V\nhvKwv3KziDju9ooHfuRPVZtcYvKJUh5BDm8JVmD0DBEfhJCu6ENIlCSqjmWNW1xS\n2yNZEXHUwhlkrrE94BHkVx5zXPyy1q86VG6/14BfFg78Vq7tzVWSjF1LrpLkSAXG\nmpkRpuneGuhWnhETUuTVtODuAwKBgQDJL7Ohnwahc+PfBYCjxcehkxz0FrvBuiFr\n5AFgtV4UP+z7di2JOG6VLbij2HrT5HcGVhGoidS71biz1TurpngOZBkg+mOXjo2z\nqfmepApSqqKLfpubS4r26a0ON5eZc9tcOtGDc5FboDGbzItOWD85e1kWcMseWJX+\nYv0iS06+1wKBgHEMuYkAdywodgb/uc5Q28Cphz9uu2SAiq2N6bNP6OlFFYgKvjOQ\nr8b4s3YJt+HBxMV0xzkHyF+hAM6572u8hvBPob4YGOKHqo8DFL40gj/SXbR0cHeP\nrSn24yRMWLwWaq3/hMAlcyzuxHTo/HPbDEqhOF/3My963AJO4qfYxHDZAoGAf8M2\nTTYjTNa+6DujVN3eCALXyT7Cn6VnYg/avCKRi0SJZ6vGATWALGZrsklgvz2ARNrV\nvfVBzsNL15Bbo4dFCMaSmrnIE1ApNuaDqjY8hADu1q1hfj58Eo+VIck2EfJcZPbJ\nZLQ4pDpYJru/39H03LkzeyfIJg5VusX8QRIYAOMCgYAIm8a09tq7D6QEYJfMXkQ5\nSj4acQTpPo6MxK+G2KAN0Yn6XpXIdpYGGIlyJwTwFkI/dDpoqyNHhwEd9+QaP2ge\ncNjQQXhT1AIKY4RWUQV66CMMdmQdkUt7dkJdkT+POPd/M4UxLqaf8W1sZooOTaGo\nAQ9m4Ma3kf9G+hD7+AR+MA==\n-----END PRIVATE KEY-----\n",
  "client_email": "mfc-agwjy2dtbga-mfcfyrlk8rhr1b@msgff-372514.iam.gserviceaccount.com",
  "client_id": "111059736288267843814",
  "auth_uri": "https://accounts.google.com/o/oauth2/auth",
  "token_uri": "https://oauth2.googleapis.com/token",
  "auth_provider_x509_cert_url": "https://www.googleapis.com/oauth2/v1/certs",
  "client_x509_cert_url": "https://www.googleapis.com/robot/v1/metadata/x509/mfc-agwjy2dtbga-mfcfyrlk8rhr1b%40msgff-372514.iam.gserviceaccount.com"
}
