{
  "type": "service_account",
  "project_id": "msgff-372514",
  "private_key_id": "928a6653e8d797a1098e6201303189a0a4a61810",
  "private_key": "-----BEGIN PRIVATE KEY-----\nMIIEvQIBADANBgkqhkiG9w0BAQEFAASCBKcwggSjAgEAAoIBAQDctaYoJx0q3rRH\nRs8VBOSf9WK/Tk9OdLkBTdfw+3HanIQAOZBv5OOcD+ZF+lyBZ+hJdIP6xg6XGygc\nQRn7VlNc6W5IyiATfT8TlACqJ+AFbIwgQk9w0LCgtxx4EUQnxXHfu40hSvaP4iur\nxVi+xzePiYxJQpx0VCpfsYA94/mIWgrgIsfhhD9nuMJUHuDPCgZyetf9z+bzgbNw\n5MfIFh+Ky4VCZZY7Z60vVZYHS6hERhWNMS80MKrw88JyauDSsgLLiH1cjmw6RtHW\nt5DCh6KZFSItqsFYPy00I5StcuHN7Q0XarTsyB8wzsKGYIvWXRVUM2Nc2KwXYsBu\n+W1pkyJ/AgMBAAECggEAJU8ln9sA0Lrl4bikD+sMVMfv4eP0fxA3J/PHQarXs7tK\nixkwA+I+4aZEaGbqlUuB1kz2dIFffQavsJsGr9iHbgjdxjs40eKVs5MMy7bC5VfU\nli1vbWQxv3FExD0y9sAnQEldkZew92Clvjs1hcZ6a262grnaZcXGhfek9JFhoL07\ndqBHeoF52GzElEFmo2s6lgUmiyQTG5b3Ae00gtzyiuzPtsnGXpMnhpFJ1B51npJV\nCDCC3iyei/R2MN4E/oJ0AWCu2xiDmWL8HKITt1m8jv7OV9ksv1j4npp2+ObHfigS\nBR36wo1SgbQWtF/BiHbPSbjkVWOo0UCVzW6GSqF/rQKBgQD201z0RFavnWQKnkQq\nmojdJ2rF/XZap90AitdxdDeFfNYhh0SSwqeqUK32IYaRys//tYbBSDN9GuVUN6Eb\nQpZP9ycK1MCTsJviwNv6RfZhigkX/l3XTbI2R0IgNQQvwMc8Pd548InJSC5X5T+v\nriIRbMlTWHrmGroPMfMkf2fSuwKBgQDk6cgrbb0ZbzPeqHa8+tePs4oRDBX5mm2D\n3XxZP8owLWxYbc95Visr4Yk3lFTNJxJKs3pXNs/5nFsfQEV7jzhCbO8jn1Sy1vMr\nRFipk0iSEcbhvhVQiRKNN4RaD7C9d9XHHfhV5mea08IQSk03tIt7f2zJumX4zZcv\n2IJwIAbdDQKBgQCi4IFzk3EcvCDbPOtAre9o+OzlsEectS8Kf5SCAq3swZ9QSsH+\nksMvicPyKtdxd8NgO3qsKygHA2uX8om2wm8MX8z8wb4+94k2zgubkPVwEjXEBpAI\nVvYmCUnilPmpRW50G2OmrRxPnfku+VHYbXF/zCjiff3DwJlNE6oeSJDLpwKBgBNo\nDmRAJWvmlYsm1QooaeXw3p+bWrGSef5X5JbcZZO4BhtpE9HBkF9j+3IOzTGnQlG6\n7YA/UVpj+wWnOTzEY4yeF5f5hgCzYGImpS2bIuffQfEZYE03ka8PKdVIxz8IzcLX\ns5n0sovZr/YZlnpGgBy0LNDdUI/LPin8PPKshGhxAoGAM9jYnd+kXmJ0G4GAEczx\nFWZB3Pwz6BRHi6+jlPwDYSRuwDZVBU/KQZWW47wbjfJS8vyM/QeeCBs+WxO07pRz\n6Q+LFyIE+bUKWZ3QzZT5a7vo+YIMVjM0g1leW7c5LnR9kDqNNMr+s5TNncoLm+1u\nBNqUK/a5ocdN3h4pSQ7MEqU=\n-----END PRIVATE KEY-----\n",
  "client_email": "mfc-p9p8d2cgaq6w09xflw3lacrery@msgff-372514.iam.gserviceaccount.com",
  "client_id": "100812738548317091903",
  "auth_uri": "https://accounts.google.com/o/oauth2/auth",
  "token_uri": "https://oauth2.googleapis.com/token",
  "auth_provider_x509_cert_url": "https://www.googleapis.com/oauth2/v1/certs",
  "client_x509_cert_url": "https://www.googleapis.com/robot/v1/metadata/x509/mfc-p9p8d2cgaq6w09xflw3lacrery%40msgff-372514.iam.gserviceaccount.com"
}
