{
  "type": "service_account",
  "project_id": "msgff-372514",
  "private_key_id": "34e5933c8af9cf40a0ff4ae257407364b0697729",
  "private_key": "-----BEGIN PRIVATE KEY-----\nMIIEvQIBADANBgkqhkiG9w0BAQEFAASCBKcwggSjAgEAAoIBAQC1Qld/Y33lqnUr\nP1SVRhg6kfhyyTW8SDhEWZj6Kcz590Cyw/0N9se1XXREURU5LJxbuwPOKiBW7v6z\nBPSNiOv/zzpDHNDPUo0ItMNEziDQZ1uBNGbbasT+FzZ2pPsAz4zY1AQseZMYsiLq\nwU5lgL/N+nrKsOioK/gYd/bQc7z/mWOUDIvpKcIIY/BZRX3Da13wN7DoUO6IOSAx\nvflaPpoUxM4okCH+zkX6BRTYJMaBCLkSdu3irpcvmNiswlFzIk4+zoXJsfIfHQM+\nDsmXMamVIAJL0qZ3FW9zLKiAO1bVcSPzTfSq4rz5fyqqOQsPYH7420e6YjiOon41\nGcFO9fefAgMBAAECggEAOgaG5C0BfKhY4gNgHHlYAEgCdRycqy2jdZ4JLux6xfq1\nJ4U+WV4LCLBmLAiY9rilRWhVC4bI24ue1chcUYLnqfi4+gsbfYM7yvGzIS+rqYus\n62vPEabYcU8VDF48TEIlILSesW4p/Nnp+6TuZ+gTfukUrhZ8JHoO7iZZSNoEQv5Z\nkggHenl3o4mWI/tL4m/aFVe7MQ7jKKkUiQ0qB9J5rayrO+gdcxKCPoX73arJDpwq\nwp/lns+aV4LUZlClh7XtkTTO0JLKICrJfgBTQV+HqJ56ZE10KT0E1J/rzFMCL7Ou\nDX2uGZfThnI9st2+w67FQkmuIKajKzGH+tj1BeMKYQKBgQDkASGthV905aiTpOBM\nrUui61mQGSADlRHgOI8EYWGR5LxN7dqzdPphzoswa9BTLHpwrobvmBZC358istWy\nTtOIlSe3+hP8XIzjd18K3fc/qXKxkgC2dgnMFmlKYVDX51WqBJqp7rjdMLWN6ptX\nzPQDvLesKsDzyzPGEBxS13RvbQKBgQDLg91tkCVBHdYKMwkXidoTGoQ3cmGHPWNR\nhLSz/wHQsM9Vzs0i2LPbXylUS9cHTODAkkXkoknt01pzPcFUm2gjCzDI9k1xKQyp\nsvIb7UXSg+Jh0txT+siZViozp4uU6Nyv8vMv5jaAe40Wj4vqAUttNsh6MkyKGQir\nypXcl7f/uwKBgQDfjDx45UuyUXn3SLCifUardhVaM0gwOvhL3yhaIyCG6r21qn/D\nc+4J93iBATRAWFu0H2otf/BToO1mF/Ft4duFDrjiqU7vH88DNwb4oKjKwlixwXTx\ncMoqT87sHn4lMavMBred5XFbbWaUvnGQpGKbR2zOYRzN623Xw/QBRT3kAQKBgFKq\nETr7neZBNDuYV00UVVwFHUdYUn0YVks6WBv0rMwTxWPZSEGrPAMTODphQ8pXU8Nk\nprcjpFvRyZ+dqfWv2jDBzuMSCIq6XcZgRS9KxV2o7D9H4u7JosmF0kaA+5VUsK9X\nQ6hlHiY6CSjszawTMov+AJiB7cz6NidxdkXP6pEZAoGAJT8CVAFihXp8Fm+EmkzT\njK6EaA5lnNePhiy/rjsyKAR1BWRdu7ksNVDjykM4n4lwLoiARwS8/oNr0ellOx+B\n20tPluHNfqM5Ha6Eox29svZk5YXdCQoMy7/rmbCTJvZLUuamZuU1WTLi8ZjKwwO6\nJIGdnpY7KUvU2VnGucSHCig=\n-----END PRIVATE KEY-----\n",
  "client_email": "mfc-i9f0be5jslxvxwd5s2hsxeifqt@msgff-372514.iam.gserviceaccount.com",
  "client_id": "101900346510780176805",
  "auth_uri": "https://accounts.google.com/o/oauth2/auth",
  "token_uri": "https://oauth2.googleapis.com/token",
  "auth_provider_x509_cert_url": "https://www.googleapis.com/oauth2/v1/certs",
  "client_x509_cert_url": "https://www.googleapis.com/robot/v1/metadata/x509/mfc-i9f0be5jslxvxwd5s2hsxeifqt%40msgff-372514.iam.gserviceaccount.com"
}
