{
  "type": "service_account",
  "project_id": "msgff-372514",
  "private_key_id": "d70ed4209fbea6833e958597d88306133a9ca224",
  "private_key": "-----BEGIN PRIVATE KEY-----\nMIIEvgIBADANBgkqhkiG9w0BAQEFAASCBKgwggSkAgEAAoIBAQC0WG8/myd1PTOQ\nexvK8ojDw3Xo68M5tS5EdRio9lNKhRc0+ueALeSruvzlNkLI5UYioJCgk86K62q5\nRlhrnWdmZN35WgrxcFIkvlCtaWK2ucoGn7qU7SsnyFppX6Y9k2fM6YAZQpSpQ5+e\nZneyQ3+C9Aw/P0+BcYMaSyR4HfYY6E7GtmZfZ4zX1Ge1kLrIFR/qDVPuJuizeSrA\npgq+ATlM8ODqYogZmL4BJK5oCi16Jt3g8wBYqbj55WPaFiY7aPn/kCqoAVAndYSD\nEmgF3+IDZLMWDrHsNtoAhIPselC58l6CsI8AHAxymZCJDvhq/UmENLYnJhajTbUY\nUfJfmZ/vAgMBAAECggEAK1hb+K4qWCfLBm1IW0larK6EXuSXaf3Nbn+0WxvFHhKJ\n5t5tGKYvIUVSdibJ+237ouPzjtynlkUJxBkPtGHDEd2paj6Fhc0IuTMSwfMj2iYi\nU+A9IIE2T5v8evoVwxP0LVBrzOZvQ5VwvkoDd9F4SrmsXeEyEzr8lyu7SrFszkRT\nuObNd3iZMd1w062T9U4pO/FsSIYJaMmD3Nlm+w7KvJ8hv8cVYbduAFmh3oBfSeck\n1xPbzaqzE9WP25MEUUUk0/izi3GWnYgDaB55jDOHx8GNrfn7VDpBRZEXpWDmr3kS\nVCM+ZUFl60404ptpaKtljzKt6JIwMxop2pS/gbUKBQKBgQDr/8Rz/Zl9bH/y/HK3\n6hK1ImQCugjmZhANSfCQcO2Zc8fd8cr0Gx4p9F50CbHnwnGD2o/eLJAEHCgQNZOZ\nGhX7X5erHCdnbikDEgEb5GjVzSYYoCIKxL9//tHhRLr6P+51VWswi/9CtyS0NJlX\nvtDJ4pgMuj/OSXhCVLll5OCwzQKBgQDDoTTicS28S/43rVX1O7w20boq0wlL3zAb\nd4RoBIu5mgWNCW6tIbWBjNMxoXSL/RU8q2L/TWKktfF4MS08aGm0rsB1qZdKGSdO\nCo6unhZarprDhZr6xPu6QaD/f2h72/blWJMJ6qcgMy+fTAccZI1074fCbPiaUspj\npTPEHLWjqwKBgAWdLPgxZTBVn2mRVc1INS+35Lcn48RPUzxtsNpOxWgsF+oQsWpD\nJuGKnaCXBnNj7b1cOqXnW3mtjcps69jthO5Y5Mu+PLW6KiGXkQ0vzsqfObPGQ2kM\nKx4JWsbIEsaXNL33zTf3bJgSsT3ULn2m3WKgEEvlNlVa7BBv4YUp/6pVAoGBAKLJ\nE/6ReyNCgQnHfM2RpW5gWm+kKAowcBGLBGyhy7rnxVK01JnQgP6KNnsIBLkwIWnY\nm4oh1MGGfKYtFZ08rSkieRfvxOptv90av9vhxGw0+qdUF8AwBd/ZGKVCWaknQm1Z\npRENZ4BN14TQeOJRcbwqTWel0cBov+zm3QqFcUf9AoGBAIkJycJ2eUHBHxFO4b4+\n6PfioWaP6w/TkSSVxRMhuU+mZOj6/C7i9wgbpKdaSuB1b1T2pvcZsyq2Jw8QNqI9\nc4R2GwnZGUbxb/l4rMt9xGBtfCBlok8LauhNIApxV+s7bzHEzS6vPvkT52tI5WfK\nTadhwCJYQfpsi9sknxVxBteK\n-----END PRIVATE KEY-----\n",
  "client_email": "mfc-ycwhmt0ky104qv9vxwv4upysy2@msgff-372514.iam.gserviceaccount.com",
  "client_id": "110461025009965948722",
  "auth_uri": "https://accounts.google.com/o/oauth2/auth",
  "token_uri": "https://oauth2.googleapis.com/token",
  "auth_provider_x509_cert_url": "https://www.googleapis.com/oauth2/v1/certs",
  "client_x509_cert_url": "https://www.googleapis.com/robot/v1/metadata/x509/mfc-ycwhmt0ky104qv9vxwv4upysy2%40msgff-372514.iam.gserviceaccount.com"
}
