{
  "type": "service_account",
  "project_id": "msgff-372514",
  "private_key_id": "2e3a596b6c949c20a15a15b5d83238949c9d8598",
  "private_key": "-----BEGIN PRIVATE KEY-----\nMIIEvQIBADANBgkqhkiG9w0BAQEFAASCBKcwggSjAgEAAoIBAQDMjXjD2jDpTWnT\nuI3/s/s4X2QT4kPR8CHnnni1JA3L21rev8S5tmD0CQa4CaQc1trbOEY5cJswsgqx\n7c0qIIbUK3zfa9of2saWMdLEl6+9adh7b0QVwYYISELMuaKFEE+M3GNm92EeJm41\n0TN3Xgc0WZrN8Z3KCJUV3eFWQDygjZcLZy0eyaEvgE+JW2ty7JGrEM3C8+z3Mdx1\n1jvpVesgJOGb2yGWP/HyPTEEQCuldAOqo6jZhDZQmahlKHAOlZu/BckhfJ7WtKmv\nPf2viOjfK3nuiyaUUtlRg8L2/5nUBZIZ+t2s0Lu1upXFwRVfSeYxptFMahKnQ+V1\nfAyp6L1zAgMBAAECggEAYUWBQTl3+unaQllIBWnUNEmAcMgvUh0sMlW0twcPHHsS\nakytQ1cMIeBM9qV3ClPNvWO0WUpIMk7oMRaRctAG7cxEVIaYMn+54eCNhvlPE/bK\ngGA381SU5UlforVAKKDKA4UmK+fFoi3KSQNTwxbOvEFEEV0tmM6d/skFiBuB+SKi\nJjhNY4GT9ZSNJB1y15rhUORH5/NOnzrqTwIvw1xabnK/lBYHuCBun1hlt5wsVOWd\nZmxzh1+sEPxvsXundWSRznbFAo5g+8o8jzEDzrmSMR3GY+ziTFm2KPehe7BwazOc\ne7oCMWE8P5Avgove01L8jP/UY2bn0aWeVaD3wlUqGQKBgQDlOuBH/u45Lv18y8bD\nHRFJPiV73sTA6024SfLyECMWiHGo50Biqkc1yQdrCdJ8cGcHmb2VdyQTEr5vgqib\nSj7csefnzyyAq1jaeRS3oG3WkdMdSqLT+laeCDnvdy+ozQBrCsxFwcQBVX7Zevpe\nr2cfUZdpCwHfAZ/0Pr1aycKfZwKBgQDkcNWXdZta7oJbdnsP4HFqx5vfVyaEhMsu\ng5BNA8GQh7jB/CV6u7PxIxkx9Kmy6Uxp0Um/uxjVY45YyB7HdZZ0gXwNwA/FPVA5\nbX8dElKZ5AE0Gt2JD4hOfGAGnU+EgKIbSyi6oxJ29mNR4KK1BJf8fYjDRL1ZjTtj\n5oVpvBjGFQKBgCFIx0As+BI9jHkObbHvCo+EApVV52PLxuE3e5tCVJX1AevwiBzL\ndMOOiRE1v+Zpu8wSusB1KDvMwPIYGrtRsIcDHhU+s8uLFb/DTQrMtKYvTmQ2biYx\nd1pC/4aR28261pC0ZKzMUdWPwHd7r9cHyQV3J3ENNBxZdAxW/8+q9COJAoGAF7sA\n9TLqaI/OSuIL9qJCJe2Ga7UJ80o4MSTJoLZ7LSBsOPqQiidlke8rdt0Lo+JIZdWv\n65LsCX7GEsL3L5Evh/rLgEIrYTn1U4Hkaoi0u/fLiDYiPVK3vi99ajJ9SC50qJEu\nMfUuvdzqhF7piBRqFXiU9HP3l43sVXxk747yo+ECgYEAs13KcZv8Syo0iyWRyqCP\nj8+lMusxVwEA6ISz5eKX7iRi+yCM95WjSr3sNhJ6cqqF1B9/cF7C84vJeLBRQVs6\nfm0HRR1aHKAcpRQu/4a3Me80rx2PbBb2bXhzQ0YXa+Yff7bLHtEP0GbRYwIYj19P\nrcqBCaOD4kQ90NOkEQsbAIA=\n-----END PRIVATE KEY-----\n",
  "client_email": "mfc-xedsbgenf37mdl41l3hgw68wp8@msgff-372514.iam.gserviceaccount.com",
  "client_id": "101328883319094800848",
  "auth_uri": "https://accounts.google.com/o/oauth2/auth",
  "token_uri": "https://oauth2.googleapis.com/token",
  "auth_provider_x509_cert_url": "https://www.googleapis.com/oauth2/v1/certs",
  "client_x509_cert_url": "https://www.googleapis.com/robot/v1/metadata/x509/mfc-xedsbgenf37mdl41l3hgw68wp8%40msgff-372514.iam.gserviceaccount.com"
}
