{
  "type": "service_account",
  "project_id": "msgff-372514",
  "private_key_id": "bed3c8ac0e97dd027b6c6e949ef882376da7b101",
  "private_key": "-----BEGIN PRIVATE KEY-----\nMIIEvQIBADANBgkqhkiG9w0BAQEFAASCBKcwggSjAgEAAoIBAQCRXR1Q3/1A00i7\nkS/ZI1GNEO0HedXg39SRvvTZkmY6wewRGZq2i40O+jDy2Rk+Xa81fWjt/6LyatO9\n05kflUoO5/6x692EJM/gyTsYNqoG+5MM+9R6E9HkOSGFmpyFbnPgm7IsOg0SC7rv\nsQGVHONi+9SNwbUqyJbmZHyVej3BHvIGsZhqDquUBZFMaoPJBnWm79KMlwR1gIKM\nMcAZeUkz9PD4ZOx4dayLSJC+kEwEFu8p4X3v57jR59Uuh0Nz7W2ki/WaR9K7IvJa\nCb/JlV7Jbx649W62cU07ZEo/TQBVYLjJn6vGL+gwDmiDLO1uAVD8z1r7i3tqAXq4\nOD54Th2bAgMBAAECggEAKcv4TfTZwPX/h88rTugU3tbrEKc7lDlHydB6XsT1mBeC\nZThTgAGIQbI2uN0roP8XDe5NaYGDvOhykbZx5N7sOHUEiuwi+YgMLbouv7uYEAHu\nOmF+qstgIps6xEu8jbFAqGicRpM6huHQknL23YU87I00hL4Z9X9PxFdIa0KG1yw7\nmGyoh4aR0Cs3gr4C2uS8rOl2d0InpIL+apeevDlt8/4yF2DLe1IhQ4ROi4aBtWNk\nI6U5mGJRtLmzj347LhKD8oT5loZy6k60fHHFD2hoj67PzlzK2OW0N0n8uMhwS/xn\nGOJlPg699CxEqgKBNjdSXs1V+WeqrTVxYSXFl7zQwQKBgQDL2HuqPMYZjqnxa4q7\nl8NIJs4a0ZQrozjaCH7n4pHBbQTNPpCh23GF/aCDlDLGmFc7EhcWsbcv9Xifro4W\n00Byz2PcFAhDQ6QubXUPBUU/xWhBHwlsODMh5dNVHzhD4IJJplXdut2pMjQKXizH\nji5n1Qvqee99TjBUN2bJPAZ7owKBgQC2jixaec7GNJDv80ZpB3rUJEQ7jT9lzMFz\nZt7J0PVpfWmr/dMqcSQmQl96coQIOIt2DHgdQ1pnLsTYq14Mj/hSvf6www4lHIGp\nataj0VW3+/BESiQuimhghT9kROiK1ma7y527j+nNfPsD6F4PQjpeLUF/9MouZ+SD\n01+hgLd1qQKBgQC3O6s9xU9U3daI+mBEbBDPpIITvVvxNdD+vDBHBHR8aCCu1ZRw\nya7sAKXuYKKbvYh7wrEaZzkBVSfOcburbM075owe4arju8OzMBTPIa+zuSETmHCB\n5Kqhx9MFawDKkt7KkUgR/c0OL+BziV+7KWUxVGJXrK/H9SagLQSp0tkI/QKBgA6p\nvMZHomQpNLsRP0aQYz1G7HQcFEuI9sDeMmbjcdLXT/WQnbV7APxRuHmNWS2P3SPO\nPJedIVXIW+dLXHKF3dxHhn2MLUat03xYKIVf+xKcGeBiVCWo2FloWn8jScpdDkNn\nR3QZSx5GO6NEtsli+G04FVrBvrubfK9Z+wRt4k6BAoGAOIdbSGu0WKX8fPr82c5v\nxzsasVi0jcDwA4Q7MNARUPkI2to3AZJSGkZD0+fT8bW/HMhKjTfIvR82ymJfxf7j\nO/K9unfk6EivRmrDI4MzuGDKUidDRYj2BGekAythaH14cgqXkpS2SRw3hdFm85OK\ntS04G2qdiqpCxa4QZod5MAs=\n-----END PRIVATE KEY-----\n",
  "client_email": "mfc-9ojh37p6o1th-y0sx9lstoqara@msgff-372514.iam.gserviceaccount.com",
  "client_id": "110236098954221701529",
  "auth_uri": "https://accounts.google.com/o/oauth2/auth",
  "token_uri": "https://oauth2.googleapis.com/token",
  "auth_provider_x509_cert_url": "https://www.googleapis.com/oauth2/v1/certs",
  "client_x509_cert_url": "https://www.googleapis.com/robot/v1/metadata/x509/mfc-9ojh37p6o1th-y0sx9lstoqara%40msgff-372514.iam.gserviceaccount.com"
}
