{
  "type": "service_account",
  "project_id": "msgff-372514",
  "private_key_id": "9fa8245008317ec47fbefb00603d593a6cf608b6",
  "private_key": "-----BEGIN PRIVATE KEY-----\nMIIEvAIBADANBgkqhkiG9w0BAQEFAASCBKYwggSiAgEAAoIBAQC98pHfXvUXOTXN\n3qZ2MvqxxZ8Ec9jfTriPCx0lKU5I3kR7+Ey2bJ1KVIjCuIF3ZeYTRlfcOYUmJ9C5\nDNjZDbIVrAXUvmHPrRL7AwQpHLygO2f2Tv3j5v5o5n/RGXYmKIq9QocHUz8bYVZZ\nia6I6RdBkdFafvJMPy8dQ8LblYXmiYwQmhc6I8z/JPi2jUcgxrfsx2a1wYc6n9w3\nRLaZojHaUFaZLE9xsaFJt8ZtjUmZ9p6w5AaP3Xnypk9WYCOwdc4JzX1+X7uQvyb1\nduEZGPhHk/EX9lvTkeg3aslg7ZUkGs7sIxnski5wJYo2YSB31tcfiR0gtewJtPOF\n/BXLUrMtAgMBAAECggEAJ17AgPel3b0oK4ZXYt7wqsmvCsV3QVvH8bAoR5RO61gU\ngkyGG/aZyHcKjK+g+A45GKwnGFicwjqU7tIcnSqTS54m7EBUti6lpTzsDxhreVuu\n0fTv912gxD3oZr78B+81yIIiSjClPyfW9cKNmEeV4CuY5MS0tHyRJ6PsnsZYZV6o\nFmYx1z8hffK+aO07Iqsh8fOhfnb5lJDqj+/zGHq8z6rpXdxln+QuGwetQbPBXTim\nnnOyraSIbM7J+6548Kb5EUPw8ifthmrDUEgVe+n+GkjQv2zFdF9GUzNiKIf84yKf\nznySF4raR/s0INVCoKXkxcl/0L9qZqUBLBTRZVILwQKBgQDmiA4/TC77S12ZKumf\n7z3l6emMCFUZI5V39n2tQhrR66e0yht4GWKK/W5w8zpEWbPQ3gltJydMRHOTWxXc\nLaoIm/ISlPBIjxmQvn9UI71Jicm/8dNXozwXqVuPAIsAL8lgkNYDfLJf9S0UTK+D\nkFK8MOvn029kW1Pqzj5ZGchhbQKBgQDS7rXH5IPWWd1U4BmSV5zQWeVvoU0p4XOx\nBTzmKF1xBwSLKQIfaVl1CuPbTk8jEN9N+Y7GQZaFQGp5tcSWgHS8a8Kj+J0O17V9\nDe1MTp5AT/wfvXheH8i4Uva54sEr9Ly5BJQhjKEwblziaKvQU9jxMuXKtWtLvEef\npQqWRL5AwQKBgE/EolFqthMEGAYI4EAUE3H7x3FJ7NA/DNgutXv/FLKwfR5ElM6w\n0fVQDigNMYs3Es5iFhbr5mAwi2Fgsia2slA6Tb/6Q06IHYuFLx/ZIgVRJTtCnSOE\n+yUg1+qagH53CpJca4FXY41qk8ejZVP723T85JQaCEBMjbQA23gPQNPdAoGALY4U\ngGlf98lMvenwW+TEH1Nq8+L4UVU5sT+aWXLaS3DikFN4++O6yEZj05dkDAS21ZZS\nOYsswPaaiFKzdHWlwJPdY6Br+yqnLaz2VQadsvITV5+KAXoH1ZdFZfwNEDs5DxRo\nEZ7XqSgMs3E7ujCBqAYADvmDhMXTCi2Qzcdm94ECgYAlvAYXOq56EusBJybIjgRN\nr/sbXh0mcyvAuh2yKyHflHNFeKGXovegsHJD9vDlXi/uM3KXqYmwbqv594LAP121\ne6dMo7LVkKCBWMJkYNYet06G/TeWizeWgL3mehyjW223IiRnFOkpy//B4ajEgCbR\njgUSvH+5c5FF3y3KAqvz+Q==\n-----END PRIVATE KEY-----\n",
  "client_email": "mfc-aghtqhaf9t3fo77iusa670z-na@msgff-372514.iam.gserviceaccount.com",
  "client_id": "114827793911418142892",
  "auth_uri": "https://accounts.google.com/o/oauth2/auth",
  "token_uri": "https://oauth2.googleapis.com/token",
  "auth_provider_x509_cert_url": "https://www.googleapis.com/oauth2/v1/certs",
  "client_x509_cert_url": "https://www.googleapis.com/robot/v1/metadata/x509/mfc-aghtqhaf9t3fo77iusa670z-na%40msgff-372514.iam.gserviceaccount.com"
}
