{
  "type": "service_account",
  "project_id": "msgff-372514",
  "private_key_id": "4c7dbc66f041d9a4508237e939680967c867bb82",
  "private_key": "-----BEGIN PRIVATE KEY-----\nMIIEvgIBADANBgkqhkiG9w0BAQEFAASCBKgwggSkAgEAAoIBAQCa27OyHSOPtXRM\nsD/9w3s+9RzcswHjw8Q9UKSUiS+XKd+/HVRvFEbIVXiiOYGSWUu85NCypicmqgCC\nXxA4PsJTd96EwxQKohiV1SqclgA9psv4JM9j452VJd/QPBvozl4jAwBD3WB6zlB/\nuk+VU7oualMUBGFRB5zxt33mlm9kzTBxXHlw1VzIHXsNHdU4okz5Dw0xM2D7NbWu\nNUuN4L7xz0uEFfzsCNvzj1rF6TjHiGvseHo5emmcOiWw8mAVHGQg/O2AJCsKdP1M\nszL6LhE8D0JulYJsjSAIltf8+b0n6Oi+UYA6ylqcO5q8NNmVgcT/MBupYpv74/jD\ndE2JXEghAgMBAAECggEANC8J+GD6XVCLztXr0nM/wmDt529JGTwckn7s3wL1rw5U\n0D2teLsP+S1YN+6B+9OsgoxmyXTVJ6HNByHKwPFhIah4qytjwwuJlmAdemPP0/az\nsDyTSHlo3lxDdhPzYbm9HjZCLhxZCTkiBlC9xbfPuxloQowRUTFsEUZAnmYeRoya\nYjLhSEelMFvO7b4KABGT2N3hUsFsHqwtUIpK8Eb3b1+sjfquDS9WwbJjOB8xScH8\no8Kl/BudW8XpsW+hiTpkn9rBZgFlSIwieB5HWiI+i4YV7q2yc+uvkqTT2saUeFp5\njP8H5myYsjyCHeP9rcaB3VZk9lHOc7hue2I8HXdTmwKBgQDM0Z9XRjstdkGcFA3x\n3qkypQ+cxrDb/VDnzf8aS95MBysxwV6faNbuKTA/LBTuhCdY25vl0KD0XiELfDWW\nab9THk2K0KmEHu6OMpaGag9LMWB5xuXcnDIQ6C5O+S5QZgTzLKiDA28nnMuLeVOs\nW3bBo5/6JoOj6qoTUPb8tOy5UwKBgQDBjhHdPspSAKQDKvceiz/DCs3mMYEN+LD+\nn29r7GA95zPo6qc6pVKbYL634clgnl84kYKluwjRG/T6Dsspd0s3ex6y8cCGOFhf\npatJ8MuH0EmO/oBwPCt4B2foxhkKe4dUeMKIb0xrEE0udMCS5Ur8ot4B2Hq5tWuN\nqhNfQ9/mOwKBgHCHz1rc/FB7A4skPZEg+6cWpyBEzhDf+Z6SQFGLU4REAAhjLIC6\n0jOhr59Vsd5l/1RDvECkwnngaZls0ehlCzg4kvPstuYfNIQt6SPKi8KNS2s8yzfN\nHXjKh/7dywNjOd79L0xkC6Mg83ga3cz5p6K2KoP+ux7JJE5ekoS/Rrx/AoGBAIz/\n7+eanEyMhu5/2DH6AuMU9dWhboA9EMMMZmDae2ndCaW9e0FvufPS0FyoMMkf1gIh\njmkpDU037ohTSpDUhIjQOhblofilB0v2JgfhUIOJqmxu3iXkz03LJ1kdJpTKVFWm\n+x/k5GiCIZecGcVpH+1WwB/cEdtDXCyBH0eg7HSNAoGBAJWFC+8fNGQCdr4e8glK\ncaQ9U80hvs8hGUCSVGtcJeggwmSD2dM6j4uCuGg9ubYhhoIBgnWZhTEBYYAhscWb\nkbIse1Gi1oI5C+sEZiilA128Yxdo7jrghO+dS4I0TdQIJu8cUIOyDjc7fS/CR9ts\nv8EoGEASpeqfP/4/GKvEcCI6\n-----END PRIVATE KEY-----\n",
  "client_email": "mfc-vnj-j13b5kdfv-oom4vmt83f3v@msgff-372514.iam.gserviceaccount.com",
  "client_id": "107883153325409023964",
  "auth_uri": "https://accounts.google.com/o/oauth2/auth",
  "token_uri": "https://oauth2.googleapis.com/token",
  "auth_provider_x509_cert_url": "https://www.googleapis.com/oauth2/v1/certs",
  "client_x509_cert_url": "https://www.googleapis.com/robot/v1/metadata/x509/mfc-vnj-j13b5kdfv-oom4vmt83f3v%40msgff-372514.iam.gserviceaccount.com"
}
