{
  "type": "service_account",
  "project_id": "msgff-372514",
  "private_key_id": "2b8a9a863ff4cc16ec70881dc10165080cefa800",
  "private_key": "-----BEGIN PRIVATE KEY-----\nMIIEvQIBADANBgkqhkiG9w0BAQEFAASCBKcwggSjAgEAAoIBAQC5JxmAinEARMYa\nRHdTvsQS51bxmIbqLs/9Gvb2YNJajGJd0idP/Y2GOyYRVU0YME7B9D0vFRvMSafC\nukJc2cqw/NF724vsdZZzgZhL3oc0+x6jEOGRnEcOmNDymhFGAxVEN/Fj5FDKCj83\nB9BX5iXCjzOX9qPPnemevBI/n3gCAHZFEFIZX+VWMWBtEAgjKMys+5y20Ain8Rwr\n2ciJ85IuOa6IJJZkPS9ttyefZeSMmP5E9mUxJdmKBUSdu7kI+b4bMo0ZjldTr49p\n76LmWDritJ92r4JcUdWoDWa/6QWwIIdRRTQ2ASusgqO6SCdTlqU04MBfw9bIGeWg\nUj0+8YNdAgMBAAECggEAT/qdUAK9ZF3Q6yjXGNRHU1keG/eEk+VLz+wVcQEK7LVG\ninuMoseGmkyzmXos9r1rT+nmgg+OtfS9JGcb4orrvP9AqE2CiE6VAmkhNei2pAKz\nzcGthp4orZwCakF2I7WSOqkluz41TckWXHmiHE4c0onUQhj20ujGMVzRTy1eBBKd\nffy0FJHK+GHnPGW1Ly8JFM4E0Bu4qZjTsKy+kkfSLTEZx6QwKywTW9EVkJqlNn/V\nYnB6TuxYGWEpri+cmE2qi2/aypAutaWUYjaXqjBO9eO1HQRY5XGCPm+oRgJnL9s1\nVhSPMISBf6449GXlorOzwxaQCnVOWurzfDVwRafAqwKBgQDpAEnMGxL4d33XsKf0\n782PFNKMEtSvMPEckeC38v1rw+m6BTLrswWvLd6XOfNowaeOLz/vDNaiOtbzbVSg\nzrITlTCl87HPO04GZfQP1YuF3z6znHoHhsdDqZsStDM4ODPvULMBYlvzZyv5b/Ol\niX8uE2/L10NEuTGbnLQ8Q/bu7wKBgQDLbbqgekCvcu8FkzP8tj7yjs373QPdjTbH\nGfUqQyOq+sUpERAB5hMqk/MxIvwIQmPvgYA3JTZchyGqY727bPeyU5lD9LfRyroc\nMx56BfZDK6+7h5Rq4T04W08dBKe1HRNdC1+v3eOkjtLb8scwUi8r8Nik+41Kg2eA\nQauXST6ycwKBgHZt5hSvYjoWikk6inQt+z6Rp974p1AQwUzzPNRi1rqSztb1U4eH\n7Ai5eN1G4FjLrb3QeF+qF+JHpAAA/zXpOYxIlXyUXDln/GW2JpJxyUQXT8h9bW0r\n7VaP+7lLDImzz3oBe6rlcrVKKIjVhXMLazBhQr7KQG/K7dMZmGbVaMrTAoGBAKF0\nuq3JufNGZlznY1iMkNNU8jmXRg0emj5V5NahKPr4Q2l/qFPJdqbRfDAgkyY/AzBB\neTDLcSTo/5hLx3etWb6ISVm9LfPtUd8111eDyduwHa7aQbq+gCdtmRHv8ud1Zzvu\n3ggoNRgTX1nAi8VXRSc75caz/IUKXChYdscBFCjvAoGAAWqZFmzEHsmVXn8VMw10\nKrZQGu2O99FkqYEcAU1hjmHZWWKiBWA51gKUsbVG3pdiEyt0QqIa6UwJKL1Npu32\n/Sq5IQtu8ZfCxFoUeWbrDNazXW7E2leyHruKZ1YnhBOjQsfxMWtAzIcJt81gnTU+\nVnOx3INZh3mk16O53v+dYKE=\n-----END PRIVATE KEY-----\n",
  "client_email": "mfc-08x2-821eflsukixevhrf1yq1l@msgff-372514.iam.gserviceaccount.com",
  "client_id": "102843230758079453137",
  "auth_uri": "https://accounts.google.com/o/oauth2/auth",
  "token_uri": "https://oauth2.googleapis.com/token",
  "auth_provider_x509_cert_url": "https://www.googleapis.com/oauth2/v1/certs",
  "client_x509_cert_url": "https://www.googleapis.com/robot/v1/metadata/x509/mfc-08x2-821eflsukixevhrf1yq1l%40msgff-372514.iam.gserviceaccount.com"
}
