{
  "type": "service_account",
  "project_id": "msgff-372514",
  "private_key_id": "06f27259b837331e3d44e816bd477c6828e20881",
  "private_key": "-----BEGIN PRIVATE KEY-----\nMIIEvQIBADANBgkqhkiG9w0BAQEFAASCBKcwggSjAgEAAoIBAQCY7abgaCL8Ims0\n4dvkd5xxWHY1N8QqlA5xUbiKCx3jL9pCRTkJhZTQedL9mAmzoyGIoggx1b2uiAI/\nrkKm3TfbUHe70vYSEzz8WxWQ14jkZMmLZ9gD7Z+nMM46k3ukXb5ue5BhNQ+M9ZQw\nI+8/CR/tJ6Y/O15FmVY3gsPc+meJMh3417DMhNElDtcsk7EhTf+8gggjAo5apvxy\nng7B0tJWzXsbvmD+7HuNJu+7VVyPndi5Cjme1Lq4SFqR4Kz9Yrwt9CpAjRqqeYVw\n6McrYVdb9DtqzMuB06wuP8/wtZWr8eeccd9e1fRrMuHfXfKxJO6EEULkoGjmb0r5\nzWKboSHLAgMBAAECggEASH3O7u0uOEqwev7dV22DkQ8X6Z4ntO898WWFjpo6bqkO\nUv+xS9wwcKpu45sgbjDUAoqcS9M/+O2r8zfNjH+srJ92Qmh8EJFiBVW/4UrqLym/\nh/+PnD0VwxEVkRq8L2voi0KzbADVAEKhHjjKfhz7L1XuLmccBu3quqGX6rYgQh3u\nFRekBdGMazfsID/HDqJpnhO3IQdSfY9GyLxNuHGIptwkF2xS8k6AAWiAHy0Tw5hK\nHuqr1Cd3KqokybXGhkj+ddzrMqaW33gts3SmJF+QwaSJcfhHmMlHGsMxEEK6YRsm\nLC0BiTddOaYJHTfoXqe5Qa8NjzkHLG7gYz4Wv2BF0QKBgQDGeyJ6LlTUQr9706Sq\nxoz9sIlIENXIlum/zAS43XyNnzHuz8N6Q6xXHg/EHRznJ3g0Nn2Ok3ECaYM38l1a\n3P+0Cg3uAG7rSznDsdYOmhnp0Mgs5KcZvzXLkuWncyFRR19+LfjH1BBs4ECndoXQ\nZOZ5RsWqmKufyvh8Toh39DBKjQKBgQDFPxDSgAOiqRXC0F9hvQ0diHmW0BULNVyF\n+Y45OapctdqlZqjSmlest2e3k+S+YRv0QHQ4ely4mnCw30YCaD+GhrmL6CkMy1sj\nf5oM054b3sDWrpxHbqezcs5u712xcwNg+3mfKahrmVtSS/YIsrjprtBr/k8l2by+\n/pwiZbjztwKBgBRTEaG/UtJ1j1QnxQnz0QY9aKFnj+y9f2wzgRxJGfMKpTtWLSc8\n/M3i9yxW6tnE0etO1SafdIgRs+0rtWGTld+i0/BWPQV9K4odkNTn9NVbmtP2CiJ5\n0RFqlnfCM1w2WdH69SnJTnFHuXcsjOFdI7ixhZZFkfWH/FAGXrUh3TwVAoGBAIVz\n7vjNHiiOyCdf/jjNxTLnJITyUlqcBvaqaxyytF43uDBSbgTX4lv8VxMw4AIjB9vR\nRBD2UQehjn9NATwdtmVZf+517Fg4unghHGRzRTVMGCLoTtpRtutF0P/jufuWeoHC\ng345nDb4sn3S4SrvaQbKfT+j937/e6Gp+I+ZTXKvAoGAIfxKnyfXSnqGtH59aNBA\na2UjPBbE/3wgyx4bD6Ay/6PtiJg7ZI+HJ4qmBKB10kFHn8dqccP8Dd9DVABBabDW\ntCqCkVDzo39gmScJyF88RPJ8siRubFMlVqMkc41/SFv29A4Jo1Dv4V9IjSxaU/Eo\neavHNwHAvItEe0YQJDLx03M=\n-----END PRIVATE KEY-----\n",
  "client_email": "mfc-f73epkxamekgtq78assvurazt9@msgff-372514.iam.gserviceaccount.com",
  "client_id": "108979174620412735999",
  "auth_uri": "https://accounts.google.com/o/oauth2/auth",
  "token_uri": "https://oauth2.googleapis.com/token",
  "auth_provider_x509_cert_url": "https://www.googleapis.com/oauth2/v1/certs",
  "client_x509_cert_url": "https://www.googleapis.com/robot/v1/metadata/x509/mfc-f73epkxamekgtq78assvurazt9%40msgff-372514.iam.gserviceaccount.com"
}
