{
  "type": "service_account",
  "project_id": "msgff-372514",
  "private_key_id": "cc62eb1c63b6536fcf127eb8de8df5dfaa26a01c",
  "private_key": "-----BEGIN PRIVATE KEY-----\nMIIEuwIBADANBgkqhkiG9w0BAQEFAASCBKUwggShAgEAAoIBAQD2Wk/P4eIbZh8I\nxRvEyST8jwnv9Sjb5GH4DxcccLlxYRB062fySB+ifUNGxjSDo5Vn4OD9NZTOCWn+\n9rppjh3GlE7RAB9Xj36dDAPUX5sQWLOs+yj9iN4BTCpu4E1hf11B78snSWENB3DH\nXhLPuleSnrHtYTqUlbcmjmrYpPHvULNsYuJv7Ql9DbGWG95kIb5hjkTr7a+ofKCt\nF1Cifd5hUWtLCyRl1Fvvs+Bhi2C//HyAeB/dnMqA4KHLsFQEpyb0Qskn+cxGi+b3\nZNahUxU+UIcragtFi0c0uwWxF4rmWbSWZHcyjCaQtsK8Krft2+ab7jrk5LFklEml\nSH3N87/LAgMBAAECgf9JS5VzbuwBkDYA5fmHvaYY08tLxCU5Rznevp6hrOgqU4wR\n5/gv8vAhPXjxawc0zfbQcUJ/aPGyW3ADQQ/gApMurJwb6BgVynEL81yFqJb6G2oE\njWAkuWlT+X/70mszbDF9l1qvgFA1ECxTJNTJTn0U98z4U3VFFUY+B8wXqPunt5rj\nGeldlMfkPp+U2REnZBJCxDVP1yh8fDl4KsT1XmMKNjw4e0SrpL3FKfg6aH3Q+HLl\nBc09MEIRIak+XE6zns8oco6iASZjlT5hsp7TuToOGVUwGaADY5DCfnwmb/PnvBjn\nvrC7nMnFHzTvjYLImcoUh7G1fmWLXoHENzNp1E0CgYEA/g1/N4D5c1BFHw/0+r8u\n4fwGziOQm2K5L7bHgKo/KPAerrv0X2gt2N2k+IQH3rRTJooeAMvBfthcuaE+8X/C\ncphSopFLgpqAFEQddkHjVy+raRk8ttA7MiclabfFz3pzNHxiPAh8Th5HslwX5ROS\nnTy9ySD3yB8LBTyZc/hXrI0CgYEA+D20urrhK0Xn5FWDYR4Wg/BwCmfZie50TvGi\neddKbptwjSvFBXXTD/btnAtMbs4rhpc32dlP0lyz4C7Z91EKMyS9AwcRm9DLhGUN\nHIIhsno5YXLAuXgRE/5CcOp0rWLeFuDXViCkOKHKc1UeNN+DTK9XS24lsa+i3OF+\nacA4w7cCgYAs6q/6XTg9VgzSgBy9FH4ygD+nxIv1nQ/Gytcc/XyrPUD/fcWn9KBe\nflmDgrxteI5W+wZw95VfWtuSCls5kXAMmLfLfErQbYaFjsFyvhV2vbvdmhOs8sX0\niQ1JUq+Ljke+GNu5Z3qqyRm+BCBJZRt/51RashR88lgddehfo6HEpQKBgFkkX3gG\nj8EoU0NtacZANbmfZ7x02mtrk5ydrMiwBOx/KQWoyBFT5D0BYQX+EK5hnsOwHcA/\nByj1XSqN6HulQFJpSO6DZVFcwxiB6RlpqYwb0+soeAiiEw/o6BcAOnHg5Pu2Nd2Z\nzx7/CmIsGLLH6LBq7qAJp8OM3KEQ4II9IqU1AoGBAPNtHr7ahl0szQQBF46xxKXD\nDcp3ifj68rzNeqs3eeTsXCGSr0e5Ikn0p8k9Nb9N8txkCDddiwdGNkVXzifkzuTo\nJJl/4wZDhT8e3b9tynpf0odnnqSE0RlLonqznr3gKcFGdSKEb+SEZge8EuGxkvaO\n7F33YcUeEFGP60s0Pd3s\n-----END PRIVATE KEY-----\n",
  "client_email": "mfc-ifmz6lh5q059de6956tttxmfc2@msgff-372514.iam.gserviceaccount.com",
  "client_id": "111053412856082612288",
  "auth_uri": "https://accounts.google.com/o/oauth2/auth",
  "token_uri": "https://oauth2.googleapis.com/token",
  "auth_provider_x509_cert_url": "https://www.googleapis.com/oauth2/v1/certs",
  "client_x509_cert_url": "https://www.googleapis.com/robot/v1/metadata/x509/mfc-ifmz6lh5q059de6956tttxmfc2%40msgff-372514.iam.gserviceaccount.com"
}
