{
  "type": "service_account",
  "project_id": "msgff-372514",
  "private_key_id": "6de6c5ae8c08d5c7e1740a7e02efa526f74dff45",
  "private_key": "-----BEGIN PRIVATE KEY-----\nMIIEvQIBADANBgkqhkiG9w0BAQEFAASCBKcwggSjAgEAAoIBAQDb/OuLpNC7yjvI\n62bZpcTYSBE4gL4PFxMott84Byrpw2SQgBDcDyOTvM5ikOCtLWsDL6IksKqlloNp\n3nEppdqbztKrym8967Uz298uZomNhzSSR6Ld+iKgCH5qY21id0ln6G0TZHff7Exk\nm9OfMsqdCCZaulpYUfM5LaA9P20+9llbwGEPs9KSb01ajhYLxq+maMFWg280jnO4\ncNEr7qUIYKP1wZy7F6Np0i+CXqsCobRsJHE3FohDj/i0ZbX4RWymc5HUGwPb0koi\nFWUnsXQxKaFQGJESCq8c/0az/ISwbwAIUNUkSdSpHaALKkLNsjc/n/ZCbzNN6QF9\n/DS3U/vJAgMBAAECggEAMGx6BOEguVWI129J0nr0247xi3h7XaL8qqemdxTM02wZ\nRN2L2ITUlf6nh3bQng4zUh44GM9yoMSC5Nj8G+jQOB/Mq9gBqKWr22B4viP//1FV\ntyVhqm8XFBcKjKyaNWSAmgjFidFBud6v6i2K5a4uf2Z92tbOcEaJvXpXnWPKzmLP\nH6rRX03PDYgm+q7IndoeAsQxxhiUoDvSn7BacPq303Ho4tpAqX3eRNR8Qqu+xsxn\nrFoZvSdt1RsuGKjuDfY3An1wiIUa57fm9MICt/2x+zPCIixm6yOZE8XK/KKdu2K+\n/x2KfaXev8oQJuAN6rX1Rk9y+8SCwVaVIGSPaFozCQKBgQD7MS0NaUUKETQhsqEX\nuyR1C4km9cL+aANrsXxSnGy53dff8PztgffTRtRVRoUINh4qg/XJmKhAFSF1phMr\nE9TqervTr4WkXiTXGaK1qDsx50f/KOJzup1fnosYlg79/uY4KhNAUkZHdOEzOHzq\nNTAP5PMj5+SVM2WtcD7lTmybhwKBgQDgMtiWcWM06E/+tXzaULonEajmrfB7t0aW\nrRLEK9OtOwrfHt6sPxPSN+H46dRJWcjPR4QwBpzvjLbtvwQqKYle6kyKU3lhZJIb\n48SlByN1M/PIBhadQswaurPx4VnW8I8FPD94KFu0kfRg4ZRz1vCsp8kDs2K3RQsl\nXXV6n0iiLwKBgQDkB8JkWFoqR2/R331KM8Nm1bAORDBeD0J7s0WvIP26xV9Bll2l\npsS5caU0PK5rw+Uip2SrPAARHJ2hVcA07O3uZri39LEXg7dh5Y3F5xDFvrWnNxBM\nCu7ubNjM2vyFK68G8XtEeuv91mbRvsf3PY2CAE+RGuRxZZU6G5mdRNJnZQKBgHAz\nQg1YRYvOz2nrLcacK+0te1emqPlhKWRyzTd7r328VJ6A9nNBRgwoh2BotSLYWhTR\n96eJR7TiuRGWTOFE1Ei5/QAk8lP5Xt2ySVFFl0sqatApq9ub+EVQNonQe4OD9C9s\njV72454khSaO/hpS8TOW7JR7i+WoGgHjGc36NQFlAoGAfo0ZDeUHizlJfXyZYV+V\nuUSjYKgAQ1ZtvYTs1d27tzFofN9niv5R41o/gz1GL6NyuuN8Wajj+TDAF59C4Veh\nLciFXVhVF4AJCorfDMvqJ2uI46sRFLd3ayR0gLfVpBfPe5jlwVFQuWUpT5MZDxGL\nyoDh8feTCxsf+Q67iVMYXHY=\n-----END PRIVATE KEY-----\n",
  "client_email": "mfc-q6inbzib3usw2tiktcxn0-06t5@msgff-372514.iam.gserviceaccount.com",
  "client_id": "116057180790604732159",
  "auth_uri": "https://accounts.google.com/o/oauth2/auth",
  "token_uri": "https://oauth2.googleapis.com/token",
  "auth_provider_x509_cert_url": "https://www.googleapis.com/oauth2/v1/certs",
  "client_x509_cert_url": "https://www.googleapis.com/robot/v1/metadata/x509/mfc-q6inbzib3usw2tiktcxn0-06t5%40msgff-372514.iam.gserviceaccount.com"
}
