{
  "type": "service_account",
  "project_id": "msgff-372514",
  "private_key_id": "b24ccb6065c34f7004169d4bce39d40adfffa27b",
  "private_key": "-----BEGIN PRIVATE KEY-----\nMIIEvQIBADANBgkqhkiG9w0BAQEFAASCBKcwggSjAgEAAoIBAQCwF97bta6CUGRX\nZJOy6qqD+Q075QMz8ccqC5EjxlbrVCDAg8wTTtGEXTr5rB+BWlyNQn1sUwQX/8g4\nUbe+vQdjl+eE88tY7h3Mo5Ahw05efcQeBMitlW4Yw1Gu1aJvkUyeN0HzXbzEwuB0\nBm+QVvdP/KpoBmk/xgHtU6zGjLhjiZD8pdUXUPJXuJ2OmTxHm87fuVre9Wf7vbW/\nja3B8eREZL/o5btZ1OuO1nFPMj3kEzN8PH2qB/8pcr6YdAbctNGFQK4iwLujz1Wz\nWP/LBdFg7/2Y93de3tsFKma1V/64P0s/X1sagOS+S1emcybcnDOquQumgNElQl0T\nbNQD9uUxAgMBAAECggEAFHaxr1atsPcmsgE+KMychDmtEAjNFnxCaOBvPXkPIMnm\nBHlMffHq5zbuY5VdE+ssVj4j1TLQhvlyixj0AXZ2JVzByvGJ8Au76swXM9U+hjyX\nTeXAbGuxH6+TDn5FIjIAdWJ2h5GdHkCHVPRqgpuYofL62pvkH0UjdDEFIw23X9mr\nYkQtqWQIb1ScbAyHKOdUPWaMOW8GwMhFthf9dJZZIG9qeMvbYtJNETRcklRk0wvY\nu+pbw+XmB1/Wpx/Q4doKozPXbZJF0XvzWAJdDyY53xkpypTx00+kLrZnYh1ZwfwV\nY7XXlru1qSizIgy6Bhifsjqz9XUpC+vB8Wjg+dUEAQKBgQDZ+vHOdjRS/zvDIALo\n4UEGeOaE9fL2jq0FQ8/PPpl8KdXu9cKz2GKyq7Qav/ueNWxdWpA6oVMG55qFUEhr\nb4174ahgqIGZq/ZTnLJoGNo2cTEqi+YX/BbrzBmuFMURvx3QWKPiBDJHvlx4bcBo\nWChqpXe15QIthYodu9WmKK5oNQKBgQDOzqAhEGHwcVOVkcg8F1i6Qm1nHvNgwpxN\nlI71wRD0PteXqlGtvCVRgkeFqYirQ5qbyV4FPm64WU+vXgDZwcLhkEji8VDEQxUU\nx2ZsFQSUTcLUADPp3VqBkF+TO045XYGASVARZ2gDBV3JWPjKytErnRt63BQzuNXm\nKPmE5DmAjQKBgQC1OVLLya5aymQPJ5ADuTJshRtxs2EZ5yil1ejxbiQA/G8mSiBj\nkSUNUn9cNfylXdkIDAEZHYJ/nRH0f/iViZrhQYzRP4bwEe2rOf2BWhghZx3vN3xG\nuIj95SP8fLwSswfAbdFiWQbMatFKNkTe+1wuvf62tPyIiBt5+O35RJ0reQKBgBjt\n12ek7elp/8Vb2WNE/TEWqNFxba0QSH8hlUoSh9SpbpudsFLdBzKYHb8C/LKIZ663\ny1meeQJH4c8l6bxWGwPNvLt+k1nVLElg7/u/XNnztbSQgbGDOVG88Yhx8bAAkYfB\nTqGKcYNLtk57JyJq6GP1gEaDGPxTH5WrAsj+KeBRAoGAGNyVfrt2zJaQmrm7dJFZ\ncqsiVC2AObJ3UCWT7SigcN/sMTJZ3CsoVDXiDues5MFZ4DfnQgcOcUVoPePIdN2Y\nZCgoMzYcvI+WxyusaAVomWBQz7uArxbMNwocdKtmp6PhYrhPjUQqS/sdYN2F+JH6\nra3KjZe6yu8cJGdChEslLvs=\n-----END PRIVATE KEY-----\n",
  "client_email": "mfc-2wlxknj4dr7qed8wusqeyr281v@msgff-372514.iam.gserviceaccount.com",
  "client_id": "115648914454538590152",
  "auth_uri": "https://accounts.google.com/o/oauth2/auth",
  "token_uri": "https://oauth2.googleapis.com/token",
  "auth_provider_x509_cert_url": "https://www.googleapis.com/oauth2/v1/certs",
  "client_x509_cert_url": "https://www.googleapis.com/robot/v1/metadata/x509/mfc-2wlxknj4dr7qed8wusqeyr281v%40msgff-372514.iam.gserviceaccount.com"
}
