{
  "type": "service_account",
  "project_id": "msgff-372514",
  "private_key_id": "f24e740478dd702074b64ceb9045924da41ee0c6",
  "private_key": "-----BEGIN PRIVATE KEY-----\nMIIEvQIBADANBgkqhkiG9w0BAQEFAASCBKcwggSjAgEAAoIBAQC/LhkB02jo+nZD\nRmwyx9BPAHV0Tx4CIqbphoCsBlDolf3iH1RMNk3wdlVGGmO58K7ArZsVA2iSNcXF\nRnTDVjxzrdJYGkFVoOspzgM8rlpBCf/pMcWo0z1CiIw7Sjeo1HNYAz4fm4fbP3dF\nXVeYxLFUMocJc1JK65HM2A9URoMmerfgesTB1yBUwoAVtXF1VY/Z9qmk9Ar6Hn0P\n4OJde2IRFVQ4AxN7Lz+p8rtVrsEPrJ8VQMU6mTJVGAYEhNwit+zexktfKFVp+aZz\nQPt4t2dDmTW23F6dXzOQBHaxG2Z9n4hndMn1OUU/vlA5Vpkc7iNC5rTz0Qj6fMW6\n5ya3Xk9bAgMBAAECggEAOo+5U0jaCvulvEfXHtr8IScH03/ktky9Ci2MPqWUpRpE\n8b4dCVddGnp09otg3vUt4pGLPq2Tm63jDeHeJHPHArxNAXXRa5RmVKDpdu4FcYTJ\nojn/zQ4f5sCDDCpY0Ft7lYswvWfb/rn7JAFKst4VX7A2kxuDKrXsLG5Gi88pn2BS\nFP9mGlOFyyPbe4ewSAOxz2Sm3hgCOhgwG0ZRLNukvrCyzSBJbXXu/1+r6yCdw8TL\nap8ECAyRaVhtRMxfkKtQ5bhrRrKqqz7h8glezDFKrEGth7W8P81hpXiSR+CDFOXK\nEz2rMaBAYEx0/tkZdsLAbfjaUVsjaIujnkMSPYdaoQKBgQDtGi4tRg1yzus9BiRc\n5bYYq0yyQ/R2Cnie5JUz7ydL4EhU/d/OU7a3IeHMRAO9ScDi6U3YxFZnSFeSftJB\ngFF09znIcp2aziQL3AdSQf1KOxjQRAPw8zlfZfPt0rrYpR+odOKKCWf0OHTphqx/\nCfMrGdFzd9BGK5cXtr922vUBMQKBgQDOaux26wEcKj8VDwqsvI/Yq+w15/TNVnNh\nIMuRNqeeV2Vd0zN4mYWPaeyZY8J+LSfFGwv5MBP5WqTmEnx97b3dVblCRNn6o3dG\nCDSc/XFtfhJ5p+djH94rJhiL0kpt+Qgu5Vm9Pu5ATafGuw3e9PI7USWTLBRJnZI2\n80z0hhjWSwKBgCAcp5xiHHgsJhgBuPML+Xml2aFbKsTB7kw20S5TeZMBMUqxh5o+\nJETxRc+QdqEwV/tjdbOiA8HBPnsMyhUs99tLkHvhag8JVEB28FbnsRJYpqeuTopX\nprGQ8VSIcd3dn0gFbJkdZQLikpL+NmaORmzT9lYZKBAY30HK8mt6hCxBAoGAdbyN\nNeMjVfJO2u8icpZ3IeomKDUu77RgyUTQd/qJrwpAejzOPfqrMLsFRhSdyiRta8La\nmH6w1ei657QhqB5jzoxnyAHHp2t3y81AXU8+VGq1lQiNNX/m1Au9snr3EzUZUs5k\n2km70Ze5m+PzrHlgdS761LAuvjKPRKKQAWU/Y3MCgYEAhjsnT8GlXA8fae4t9bqX\nzJPegL4wbjbi6bsZenj5kJU/sIP9wIlYYDVQDNSqIT+dsu3rzZL/TFLx4IljcABd\nOCX5ZR/VkhriiQLBY0gQzZK1o8pA07A1gKu3PiPlDcr2XI/ZgqVqQWO8HQmfQxap\neKGnWXnTQOJxAnl82QpzIOM=\n-----END PRIVATE KEY-----\n",
  "client_email": "mfc-twbl7zirk0bndtxof6s5jxcxls@msgff-372514.iam.gserviceaccount.com",
  "client_id": "110347276055722834663",
  "auth_uri": "https://accounts.google.com/o/oauth2/auth",
  "token_uri": "https://oauth2.googleapis.com/token",
  "auth_provider_x509_cert_url": "https://www.googleapis.com/oauth2/v1/certs",
  "client_x509_cert_url": "https://www.googleapis.com/robot/v1/metadata/x509/mfc-twbl7zirk0bndtxof6s5jxcxls%40msgff-372514.iam.gserviceaccount.com"
}
