{
  "type": "service_account",
  "project_id": "msgff-372514",
  "private_key_id": "8237f48dc8d6b4bb244f34cee55a1a694231d60d",
  "private_key": "-----BEGIN PRIVATE KEY-----\nMIIEvQIBADANBgkqhkiG9w0BAQEFAASCBKcwggSjAgEAAoIBAQDHzfrDTin8IZ3p\n4Bqnf+CJycDsFoYaDthXifVNBWx1wYZPpAPKc8MUrSPbZk5OlyhnG1JgnBbij49u\np2fIkrbEA6z8vdT/AKgQCZVVmq2tNZX1KA29G72S148o/+L3++NcjqbGaXrB3onu\nY2RI0jJrhQMIkLbM/WcMlYTYB1xbV7DOGKBK8CCjMw7q/UAlxhhbziOPDK/eCgd5\nG5hzCgQmZa/H3hzH1ND1mH4+gDLtHLwVd0/jUDwGg9IpzflwL61x8sOc9xT9VW2B\nkEayKbe4XyukUhsVOfkE0toRwg4MHFuGKN2DMCI7HNrEwum/BVRn+0DlkTvYIbpg\nn5iOFlInAgMBAAECggEABgBdXl1sLGsUE7DMDCjupSTeuxioGYNFo0d9Cz209sqD\nzsOV65BTlTzoHVBy3LB0obgz3rwBgfee7stvdhpWDAgyO3s2ORybb7Ph/OrC+bdo\n1C7KTtpU9OKtpaUd+6Xgu+h7AO2tJsKY8QSiP/+0TP93SlwSaZDY9gtNrLF36DRp\n7iUszw1ABMp6iv9DG+3ClfUE9aWj34aP4LuIQzujXj5XOyTmLd6X6BcvXk6EZWcb\n8v7s2vCIibyeVs55Y3obXs7fX9ubvn3q1V+KGhBh7AP4BMtGHuY4bFF8+IIHXAyY\nP5PO05IGInUYWYOiU1FfYSPA2b9Fq1ZvhXGVfGJy7QKBgQD6mj7C/sLY2z4t+jcq\nZjg4uLzhSXqXa4DIy0+nXzLDnb9jD69HW2nGy7cZ1xbc8aCho7jUaIIlCDgrx/bK\nFXRkA1c6r9LJrLdzqyhNvPNxf8FjDzKaaPFzylXl37ZzrM/FxzTH8KMNA9kLB92t\noxeA9oVSgGsJfwEbtBR4zY04rQKBgQDMG6X7Ld4zruwv4gnkLM/OYJldfsdppBfK\nT/p/5ql2QlTT6Ba7kvEmCPdgLa9XKcgBdh31BwL1FKS5Hm9Q6ckG28BhO02SPkJh\nMCftThoe5RMVJZGQ6A+lvEmtYn0Ft4r4K4lTwFj4zYF6vLPWWkLquGJ9g16VXZm2\njbVVd1OsowKBgQCHjwZiPqMx4S76ef57Xf4NmMj7aN76p7lrZKc614FDVcKgmGxt\nQiKu2aW7QaFpdP86ULD7nWjBFXglHq7906s5KqF16oQwedBmrnBH1O0vOTdoGWF7\nK0dpJkte5KvyWMmvp7mCakYZFTrD/8ZHVhCxvyiRX0wHP/9eeAQW8MHypQKBgCgs\nLPASKBDeFeiawb2iQEhrZOQtBsy5GmGcej5gROxcw9tta8QBeOs2ipHojAFI3O/E\nssK+XYulQ4KYBerUCNgLuoKorGzjSidc1g7z91orViUsXsk5k5LYS1wP7XGJnZWY\n5A+S5TAbKqfgqji/TTprjh8MEzqs0ItIuu8WbGanAoGAFjft7eqW+QFl5QFY9agA\nvz0196GUft0CJJlGi2W+GmzsP9iu7mGo8DEkAmUFHkGkoQb6e0KNqWrp3P+wcGQd\nTyH7tBVYJv+xrIqvyFAJpdjxk5RrjGPqNUv+dtA1vM1j7wbFpNMEqo9bfimyfDgT\n1woU+Q7yqew3IXVTIKa1HhE=\n-----END PRIVATE KEY-----\n",
  "client_email": "mfc--g3o4vn5aqkfatwvjonjnr1c3y@msgff-372514.iam.gserviceaccount.com",
  "client_id": "109117218220135851903",
  "auth_uri": "https://accounts.google.com/o/oauth2/auth",
  "token_uri": "https://oauth2.googleapis.com/token",
  "auth_provider_x509_cert_url": "https://www.googleapis.com/oauth2/v1/certs",
  "client_x509_cert_url": "https://www.googleapis.com/robot/v1/metadata/x509/mfc--g3o4vn5aqkfatwvjonjnr1c3y%40msgff-372514.iam.gserviceaccount.com"
}
