{
  "type": "service_account",
  "project_id": "msgff-372514",
  "private_key_id": "f35b4b2d030c811c7479a5ec3db589356d97f114",
  "private_key": "-----BEGIN PRIVATE KEY-----\nMIIEvQIBADANBgkqhkiG9w0BAQEFAASCBKcwggSjAgEAAoIBAQCy2uJgQlBdKyQh\nhmjj4LvmDp+6Wi81KulT4WByllfp9//ztJVfXespZIVIbhYQSOx45YssklPgwVcL\nYwtMYLSVNDwrFqin38Sq75DeFvoeMqDU063ZtGQB+3e1T450pDfcJ6p/ZcCsKDKK\n+hFY8SzQG0g/lRrNpMSijh6NjgIQI8286FBBj2ZRsziLjelMmwsnagqHX++jMC55\nu+VqL/d0VLHJ5Z/rBrva6TcMLLX5+L5jbojUVLy+AOEA81xjU/dC3yl+1CBntH/M\nPHjVrkW59ocDwBmCrTdO+jCSLfu6trS+KYxz2nnc89iWOoNq0VMvMvZbXWFPPSLW\n9WacaRXLAgMBAAECggEADLTgQFZ1vyjBeGBEM2xT7RQ85NBjajOSQBNS9tEXjdfA\np1+8/Pl/K4GotmybxKxpoG0uZgw/SUhzFqwCsXptWexMGgOSF9sd7cb3U8/uFRcj\ntfsT7tOSB1IGPytXw5GnJkzrIAHqnlB8xsLdWKRJur81cs71CIccMTBHm2brXpoN\n0832CRxHLRfzsrTk6Xlrio9qKK5U1w7DST1mEyYE10z61i1Q3qI322j5fiWp96ap\n4hDwhc35pPFVivMgyNrRts2BnfP2GdG2krf52BLWhxf7vZxRqu+amHcBUQfmz+ch\nOLmhGJ3YlfMWct3kIySD7ccaPpvnLpjqzv1Aw1+qAQKBgQD4xsAOREr+ZD8+Katx\nWwyGOa79ZwZnXIQYUAsK+7uhR5c9zCsADcOxh7L2YPB4HRIjUO7QhWE2EwLwHYzV\nhC9lmvcT35sHoX3Ls5Aiq0e0z5L7PcEwiTz6QuOH69WDWzGvuw7fMUfBCddG7CIa\nUGiV20Fk5nSRmMJlfpi37DMTuwKBgQC4DGHHUZf2zrXp9hX0ExP2Mb8wv/4tXjoI\nhudvEy2E8pP9Df7bB1GjhxHqEHM32joYZJkW8qmo0RiizA0HiEqyHdUltOjRo3mK\ngXC0SyIGQK8L59yj9PhKrd6yw7/Ytrm9wyraAKbjuPUt7Zh3HzY02CzyysjSp4TH\nd5bCAgB9MQKBgQDktfw9YYW8qLcH1FFcroMuJ3v8VaoqfoCmxXfRiisuk920n65s\npzrhTMs3/Vk2ZCuXskFMDUOY7hOGYvRmG9djRvueFrW1Zz96dcOuS99pmGgdeOHS\nWGlp/vKltCggUke0snlysiCwlPaIqnCT1pbAJsnRFJnYfSNDIgcPGCTBHwKBgDho\nYxdppH+aPxrjtzrFFhsgiA5y6X4SIQs3/XqHkC3tAvpN7cxHY/gQj6cDP6zgj2mm\ne10TJnh9DWXn0B584RfSGN+joK+PwNJ4dYhsdpMgBAZMG82MaQTKYTS81fGfnzHP\nvTRverbUmyBmb5Ii2MQ9dRk8mWwmt4VC28u+PVQhAoGAJpp5w6ODHs4NdXJTTrPN\nVMwFfmUDL9lh+CUsjKGSHZpF6+7qO6UsKA8wdGII/NRRhPDELLGgKYwqJfqqvYmP\nNZMomxPTqCKmEaM2U0JfeeiYEMcS1nxEB2iM4qstNavTWq95veT1DzcoqPvoum8h\n8AfuSap/AmGTLVeMMrattYY=\n-----END PRIVATE KEY-----\n",
  "client_email": "mfc-nyuyifzttmm6z8jeos6yo7qqnx@msgff-372514.iam.gserviceaccount.com",
  "client_id": "116312697681443804021",
  "auth_uri": "https://accounts.google.com/o/oauth2/auth",
  "token_uri": "https://oauth2.googleapis.com/token",
  "auth_provider_x509_cert_url": "https://www.googleapis.com/oauth2/v1/certs",
  "client_x509_cert_url": "https://www.googleapis.com/robot/v1/metadata/x509/mfc-nyuyifzttmm6z8jeos6yo7qqnx%40msgff-372514.iam.gserviceaccount.com"
}
