{
  "type": "service_account",
  "project_id": "msgff-372514",
  "private_key_id": "2a467cc5d0f2e6ba52c9bebbfbe3a4b5ad489e6b",
  "private_key": "-----BEGIN PRIVATE KEY-----\nMIIEvgIBADANBgkqhkiG9w0BAQEFAASCBKgwggSkAgEAAoIBAQDZe+YM4uKPtU5q\nlG45uzzEkZ5ONjCLRxaTP+mit7x/uT9deG11M7Ra5QiGfab6hDqBbasww3egrAC0\no6DkRspQ90HKolEfb/dr/mYJsHB6iNsdhZ+h8trGyhU/8XoTcYLhs3QEnjAFb8jx\nVztfbnScXKlJTU1IM1HYEc8JmSjoqnb6HakVJIg1jKljjYxS+LgASutZQDsEY/uZ\nEakfa/pAW7vb9bfZC8bBtZmex+ZhUY/EPL647Qq6nHdH0LmsVIQGZcKSEtvbycG0\nIYGG/vCj8Y6Tieomg+x1ANRBH9ImzEqUDrljyhY+K4S8sr4hnOhaau0CpGmozOVC\njdJxHUSzAgMBAAECggEAIAdGmGQ7cGWHkFuepgLkjqBRW3xQhtpnwTS64BtF99tc\nsRPAru934qDzMfdERYV+pjvz56EJt5BNJE0qryObvPPE7SYdY09WdUGIXmntDqaj\n+kOJAE0nGfp9yaZyz3U6jKmkbt+q+8n8Ikqx9DpskvB0f9aSCI2CQptQzb2QED9w\n14Yg3HXnsLLhSiv8cpFQ1kY4eBDEKjDI0AjiMw2Rz7YqOOFN451vV7oxX31hWWM+\nEUtY3vlk4Bxj3Tj72aKY5C7wg/iIF2vmG1qQ6RyDefnLYDS+/d9orVDoom0DaBCi\nBqWGoDXQbv7lyNart3VTThTjHFJmprP5uV8DFbPpsQKBgQD6+OWVvnGKLMkZyER/\nQ0gADS2vfx22FukIj2S2OvR7NMCYz/4f/2//QlZZCXvzKrwF4tXv6mncUTTCNSnK\nfa0Xyl3/lPagOnTOLNmYSf237jWB8yUPvFnjr6Qx8227BuGef/UPzFeD/Vcrs9i6\ndGncE2XCqHG6jazZI5zNFpGg0QKBgQDd10IeOX0hbaJdsxjQMx6w7nvyJYLIihhD\n7b1+aY8X4nQ9nBYukEzAQ+4VV/cyGGxp6umwH2sCIRDrk9RvWEkPxr54NKNHtprK\nCaFe7BgcFyNdnmNc0ZJ1m5VsiwC57eCd9ct2HWJLdvhfrDQClexTtcSB1mKCF2HD\nb1SiZhjOQwKBgQD0Ivry1/eK+lYGBpLbWY/IvQkcFwPIBjFaamMGAgOhdoeEH5CN\nf+Zq4RUuN9OjkIanEyoZ4GZqM3SnFyA4IlknM2yNG1NuOm81wNtLEW8GZWsXpnb+\n/7JRkqKfFLZBoUgI72BspdLcSq1pjeHePzBbLWNoIIPBfeAOul3mA3ZWgQKBgBot\n6vmSIzgsrfqMxiLbxYVvv2TGFHcCBPcPOUuPvXk+GiWjI+L+2G/gFFqkdOGOjEy7\nkjRcoM4xhMOoQGubaZPZCmU5IQO3gvDQziBbkETQXjYQGP29JaGHaMzUYpOOhPFf\nLlGUCiOJuKnhsomTk74VN0lzOVDM3Zaorr4zej3tAoGBANPJa1X71imL3PQ3yI9i\nignpt2KQdAFGiYq50+7TcbVSf8amhpzFI45QNiQIVh2paD1pyJr2v15rRguCxhft\nJg474jNwh2aqUv5C7meK0UFcGXch7W3fASHpQkqvLVo+rjDjJhsXYfFn3S2x8lYz\n1PIdohDeY3FDcfznScK8Q6P5\n-----END PRIVATE KEY-----\n",
  "client_email": "mfc-3hjjddh3fmvsb77y1zqkhb1mam@msgff-372514.iam.gserviceaccount.com",
  "client_id": "104457936149200557439",
  "auth_uri": "https://accounts.google.com/o/oauth2/auth",
  "token_uri": "https://oauth2.googleapis.com/token",
  "auth_provider_x509_cert_url": "https://www.googleapis.com/oauth2/v1/certs",
  "client_x509_cert_url": "https://www.googleapis.com/robot/v1/metadata/x509/mfc-3hjjddh3fmvsb77y1zqkhb1mam%40msgff-372514.iam.gserviceaccount.com"
}
