{
  "type": "service_account",
  "project_id": "msgff-372514",
  "private_key_id": "bb13a9c2d2d04977d8ec864dfc8b249fb6fa0812",
  "private_key": "-----BEGIN PRIVATE KEY-----\nMIIEvgIBADANBgkqhkiG9w0BAQEFAASCBKgwggSkAgEAAoIBAQDgY3QuqjxwAZpv\nW6cb0NmDwYCZDcW8i1LBhd4Q5IdWzQrHERrf4AG9aenuUAr2xguOxfT2j5jQ7Zuk\n7/F0QPOCmiv2ghPnzCyvQB6VL/+pcPWOLPvH/zlE/RkKKOHNxZvTh1xBJ32+hAIW\n8U//XkWIq31OKUZZ12n3d1PJH+mcELKGH6+sKpiqr5fvKJ+9nzseFtdOzticR174\nwFaPk9My7kRUrkET/lrwTmVQF2SYNdqeS55TqrVFRK+M1jcH8DDC8SZHATlebVUl\nr/4SXp1GR8m8D7v8Aqwt1a2toJrbMXnGdcnaX+CZtO+2dr8Evfmo7flBh6qxDpy/\n1Qq5WkurAgMBAAECggEAMamxaDajY8LnFGh7putliQTF2poyvpUzfsOLL7/0uGBv\nVznQ8eXZXLvZW7Z5hr60higIHJ4Rm4RLY4j7rthFTQ2kV03Y6//DkBIn8qsJ8c2f\ne5U3ML+rRDqkVRxRRcLLx1h5Ma505TrAX6WPKB0MVMBn3mnCOVY1DOFrOOOIR9L8\nBoDJumNGjQI5iSASKjiQRH8P3uIFSAfwq2tTYg48nB671bJcGZbRzTvM78zXqkOe\nKmTs8ZYti46M/qXcqpPshakXAFryrZ7guhl4QJuZLKB+rX07H8I3GJd7MPFq0FLl\nzC1YPjYFB531uyGiM/T7tDL4B7TZCYZqi+54RRrI8QKBgQD773dRgd6B6i47gQSQ\nUXhRk09nq/QWbOJVFoOozxMj2EvXUp0oAX+LTgsc54Lf9DD9gvHKIuWGA3T4EcnY\nfg0yus67950lIcoA1zhDF5Itxcu1NHxJ9V4dzt8++LgI03arXzsAXqgjI5q/XQto\ndvoTT1XtYQcYHeg31gJcVEjGgwKBgQDkAjbqWUvy4k6pzDMlJLIVl9nof4Fc7nEv\nvBRstVZnVueKWdUPMI2cnAEhjWHkcCSx79yn1E32cwhy5I6dL2OwDDxiD2Vv/APP\njOyhuPPVCHoLkGt1m+Ci3W0AukxhW8wisadAO/JrRqTjC3Buyw6mUN0IWlYGbzng\npR1i4cIduQKBgQCOazjQYtIeLvwjtzOVQfj6ZIQm3xYE91ibMTcMXsM7KDL3bkRZ\nMT+gyGWP2XAqmih3p2Z4FnIZ6Cpfce7g66EaZHAp4jh7nTZMc13iz5hbN82IijsY\ntBSYVTHurzuaAbC8AAGim+AAvUfllfu0+k00TU0N/CO+hmmX5us+tobNcQKBgBJe\nm04GI7hNw0iqyvQTIMXclhHFNAborvXJkVuwwGVS+xSKaD/xCXe0meK6IUjmQA6V\n5JEg6acRXXzkLRk82Cs20SaVVvbOtv/huq7M19gx9qM333B6Pn7gmAeW+tBdNPUW\nmwLx0XYTGvWv1j8W3PdJTIV/wa6DB4axxsxQo/MBAoGBAISut9cmEh2Vj0iXXblT\nWrZcKVPDEDFZKPP31iJek1snxKJWKBtbX/4TxjbOx7uySjLDlk/V4788iESQACIy\nbKhW0sH3fSbY540LkS+sdGROCXZx9Flap9cs7MvPgaXhUBCYTQ9XfrbOhEPhYy/r\nzvw0mEGD+PUgqnqE02yb/gQW\n-----END PRIVATE KEY-----\n",
  "client_email": "mfc-bp-utu1q-myy1zd3dkvfobjw5k@msgff-372514.iam.gserviceaccount.com",
  "client_id": "113735173877618481204",
  "auth_uri": "https://accounts.google.com/o/oauth2/auth",
  "token_uri": "https://oauth2.googleapis.com/token",
  "auth_provider_x509_cert_url": "https://www.googleapis.com/oauth2/v1/certs",
  "client_x509_cert_url": "https://www.googleapis.com/robot/v1/metadata/x509/mfc-bp-utu1q-myy1zd3dkvfobjw5k%40msgff-372514.iam.gserviceaccount.com"
}
