{
  "type": "service_account",
  "project_id": "msgff-372514",
  "private_key_id": "cef2a19c56bea16a66915ef522b19f66300e3286",
  "private_key": "-----BEGIN PRIVATE KEY-----\nMIIEvQIBADANBgkqhkiG9w0BAQEFAASCBKcwggSjAgEAAoIBAQC12Jgeamq9/uyn\ntWjcQeGpnrSbicJlLQFoAcTXA8FRZQVWuIbJ8uPo3rcwUGlnRLx0ZJUiezO+Jh7a\nazbFj95G7mteWNwE5P/yvMTwRytcs6OUq53Bfeu/dIvmIA773fgfm/zTJvOpD+aO\nwoeD4g7IMMhjI+h+JMj3lG/SNFen2upmZC7Zi03v9jMaaFIIs28oK6YN8D7IZmWj\ntuuZs8TJ+nRIqjjd85Z8W4t8r8en2Ms12zcpL0Tn8e/wNmhIlClvsYdbjns9sbS1\n8P7Y1WM4S5nEO+kAtaVxO+91pbGbjBMsXwklB8HBujux4cUZkVEAZi06eDOTosfy\nADajzZCPAgMBAAECggEALAfMWX0B6Iw7yCXcRIytM9FqQMj76Vya3RCklT1jBy7T\nOprGhEqMFbwrlga6ZtdVXEdodudm8XEwgkl4gyChPQKIu9j/OS4rrR44/0b0QGd8\nwchGE+5F8V8qaqeziRfHdvvhnUzura5ccI+4mV3Yn290bdDpf/WvNYdbBgZHfSxT\njFm6MEvqWI6axLDg3rQV6W+lLE0F9k4AUGQMLGi5LM3Xv8adVnTDlVjRgvFYRm2j\ngbNrEThKw35GnQ0JE/LEyPdjKSAO9eHVm3r7GMGcpSR9QUQXK5zl5XZjmLW63p3o\nB3sKd+at+k3nMR2fCkj137TDREpDiKiF8NuI+8iV8QKBgQDftfoDXtyfPiZoAh0R\nAJTpbvMS0raAh9vGfrOgYE00Eosnl2FlioBtfnvckTyUBk8I9X/jOy4avPGn/KHB\nIsyP9TYPGs2IxTQ1e4iu+au3hs7JSZaeQB0XAvXqtPhrsPUX349P9nrsZCSEIA83\nhxmluhIZyzDQhBv3liRs/xAGHwKBgQDQF7tAaS9UVh1m6CC0DkZHfeBYH1ZTbMUC\n+5xd7C8E+cFr8o8jNqKpchYiD9bhphrjfLOwlcL1LQZtBNcTp9fVTWeye7sdJG9G\nugwOeXWmESbSPdH69Q7ZMxIDo01dE8F01jQX1SpF+rfai3YP9x5hcwWEyhrW80st\nnXx+ugjHkQKBgQCFEnKN3rfN4eJmrBsuKfJqiRz+bWkyO554DJY9KAvEleNAwcOl\n6yVJ/JshMSOfycDpy18vg9yA+zOkgZqWkGSunWZyxbbNTMEprzo3Gz0SBparFaMK\nr4ieT5yI6O184d5pPQq6vhuQ0mEGVyu2FB8lffGWdk+rOWqJdD5mt7KIcQKBgAjy\nnEievTxBH66HGLDlVDxKu1TOtCWOLcJ9EzIur67lFl4P5fu7o67piu4YBENboxhZ\nCljzd5iXQQl7BcyAkRVI6MaR72/HW0mNQmt06YwkfKjZo6fI1cSdH48sfG0eJllh\nxIep0NGFgFZTXNY+5/2Etp4JGrJXb8ocVXgVg78hAoGAJTfw/TW4KQLiWp2yDclZ\nauDVUM7dqWRBVre2WHWn9aVQ/WZcf6aBMTkNAkP5Cb+YwWaUB+WAJ63j2Iam8hFr\nwXIAlYz3rosZSZdquYGAG6jtceYdJMTik4cn4DtYqq8ctTCAy3sV8fXsd/USSzmM\nO6hyMlDZRnZ/xdMW73UC750=\n-----END PRIVATE KEY-----\n",
  "client_email": "mfc-zk6bwagrekdlzqft07k8eygqst@msgff-372514.iam.gserviceaccount.com",
  "client_id": "112554576203901925883",
  "auth_uri": "https://accounts.google.com/o/oauth2/auth",
  "token_uri": "https://oauth2.googleapis.com/token",
  "auth_provider_x509_cert_url": "https://www.googleapis.com/oauth2/v1/certs",
  "client_x509_cert_url": "https://www.googleapis.com/robot/v1/metadata/x509/mfc-zk6bwagrekdlzqft07k8eygqst%40msgff-372514.iam.gserviceaccount.com"
}
