{
  "type": "service_account",
  "project_id": "msgff-372514",
  "private_key_id": "97af25a0ffa26733be5e5dc89bd02e5d3ccf4be1",
  "private_key": "-----BEGIN PRIVATE KEY-----\nMIIEvAIBADANBgkqhkiG9w0BAQEFAASCBKYwggSiAgEAAoIBAQDTNFramoLdsrbg\nqop4j5cakWRH9ajxADn8n96pXvellb+C5EYoemo/3+d2xHA7qCFjEVXkzKFcVuBZ\nZpBVwQbD2j6hwWh1lJm7H12ywNH8JaelcjWYFmcXuCdK1JTOfrfyQW+Ae64sIX5D\nsoBOBk/TVkF51K5TDWFaUXnprYdvEryHObsLkRCv/y2BN1Vyx4e+ngrNi2R5Dohb\nXdjRxSMD88u8qbdvIRMHNanxNQMzcFtR3CYTV97wNeXumuiPqlt1CbART5T73TKS\n75KxIPUBNxnbzpo5ozxUP3LzxY/DNtwGILLyKfEE7AdliJse4qMUHTzp9P0XzIb3\nhmM4+nadAgMBAAECggEAA3JXxzh9STvo4xq1XslNGHhl8AywwJoV2CsNuarclL2w\nXeT2xiNVR4ySXOxQvpB8Vv8J7U1vlq+uQpc7ZMLdJuYRXpdm6oBNz/FvmIKwCpLc\nvQTznfNDpG3zajO05/fGbbQmqyyZh4vWYSlxEZTlyZefQus3GxDdVVl+CVO1IZlf\nllawg8/0/14b/Uup3GKHvCngeFHZddSOKemMsSxXn/nw/rI7UlGWP3jloMpEk5Ly\nUy08P7ryXcBYb+8SGngwrJduMKap9tt5KzIUdh0P68VASR3F/qPxqYgYaRzR7/zz\n06VFY68MJfdWgpLJ/6gRg98kPeTV0fbVVZTuamss0QKBgQDqHHvIbcZXPvKXdFXH\noddKcNbRJUrh5AQAGviqmRGUV4Zah2F955TLfwx44v0g5nXCLZnWutY5M6UbaS0k\n2XWIb4gHVwqJgro7Xew1wVMrcF4P4p5x+/mg6UO0u4PrFm/Vh+yOlv/LTsNSv8Oe\nUjnjD9jmfy9nTHIL5t/5nQy/uQKBgQDm85eQmKb8JYESLvQv2qikEHlmXwy9it1L\nOK89IOBd4vyWwWAoKdvaINcvdHOjJXpxYK8eZ2t7rkXTMO5p8MfCcB5BbCb6HTxU\n/1YGmYHmkaT2vH7DAqyG1qK2oUg2u6T11W2zYxQqft6CKbUNcsMJ/pq4jEOtx13/\n7rdocrx4BQKBgDpUmH7q4xVP6M/Vu52+9E5m6Q85VHwN/PUtwzF2bAvi9uXNf3wI\nXGmLoUbpf5pX8ZVNGVyINuIPvR6kSQw6Zm91IpZ5mHWErfQmxbjrD1bua3FXzJSn\n7J2sISOB6S+E6p5wfH9WnitA16fhgdMLt8KcazWbEOuS/4N5peqit895AoGAAzQL\nvSCw6Dxo7uSh1GwW/LeRx364AYUEjr+JhrKHCiZU1I54E/aIqxzbfzgBRpkFer8Z\njrVmgz+mjkhWdje1vZeqg8PJQpzXMmKcQdktORJ6FEYHCBNoazJc7WWNR90Qa6x7\nKgrMw84grfOAJGCcHe5fHQItCiMCxcL83kEBJjUCgYAJNVNdwCT4zKdBFtZ41eDb\niRkYDyTVTe3sOWgAVc8LM2xW1eOKvErrV74jfnVV858086l8chwormdJkhf44THi\nlHBQrLhydQNyzQIiy+0EaMHpa195k7rMGy8RrNzXld+KtDJk4xGSNjDV5C9Y8ROq\nueKmUnCmRONJDFj/+ElNVw==\n-----END PRIVATE KEY-----\n",
  "client_email": "mfc-2omxjnqwuosh2oqa6wm9-t181i@msgff-372514.iam.gserviceaccount.com",
  "client_id": "111933750029670448287",
  "auth_uri": "https://accounts.google.com/o/oauth2/auth",
  "token_uri": "https://oauth2.googleapis.com/token",
  "auth_provider_x509_cert_url": "https://www.googleapis.com/oauth2/v1/certs",
  "client_x509_cert_url": "https://www.googleapis.com/robot/v1/metadata/x509/mfc-2omxjnqwuosh2oqa6wm9-t181i%40msgff-372514.iam.gserviceaccount.com"
}
