{
  "type": "service_account",
  "project_id": "msgff-372514",
  "private_key_id": "f7fb55c87155ef89595d81d39b203cc0c0cf1ddb",
  "private_key": "-----BEGIN PRIVATE KEY-----\nMIIEvAIBADANBgkqhkiG9w0BAQEFAASCBKYwggSiAgEAAoIBAQCViSYzf57OuUEi\nnKa6Lx3mNh2ciTwLNE13jTMmdiTSvznJNwRlZHWu37ngqc38IE2wb3/W9mFPNkD0\nmnngHsgGuI1TYre6zsi4PnNbp0YXEhxT6kFtnfzGCcEgess2JYESwrI6MFcSCxnz\nxjuXVwnvN3YZZDSEqrZWP+m/02T2mP5gV1P7QPhqkVldyMRb441tbRFhdTiFSIS9\n9YfTjMhwqCOxRTDN8W9pDr2kOc7FR3/wnMHeri2Mxx8G1zucabMLe6Mf4zCiqXg5\nU//qkcmGHHaueIuEBXgHjABzHC770G7lc3D3qh87iDYY1dZU/q5CFALkB1YaJIsB\n4zNJkppLAgMBAAECggEAGArSCoulU+VzNIZtRBgZPY9L2YQzFDYXknYwWCm8p+m4\n98IRwd+SEEjGUPncNYJYG1sB+eTpJlw5u1ou6DrqvDHl/xcrJSzkFsNrtrvBSCpQ\nRamvVVmGb6zX0UoM7CrBguuszjBBf5QrWwdvQ1jqLv0CzvhOfVoZMOrbwUzSudcG\ndInSO6efDXUPrlJJkI1enIE029wd+1rS0BiK1IDUb/PjXQRid6RrfFW8tuxXj6CQ\nC7SUVe6yCXcSMSQ0+4hB4EMVFcxV244kIZMInmlfvwqW6gbaiXLZP8WYrnZWmWVG\nqKEdgobQCL12Pj2QBgtB5NHgwdOqrpIjUFjXzVpUGQKBgQDJ/Kr9PwKBkvyS6bDl\nN/9ZkOU53WBrA775iqbElte9roVEY/0DyC8HqVKtZYEuZsES/oQ/eT39o8+aEm4P\n/D9G194dFX/29DPn7Cbvi/BBsR3LwQYNpFkhdtaWOpUIhIEWqQ+cZcAMCys6XORp\nBLifESNiO332AHrgRQi/o279XwKBgQC9hdmbSQPGF3NqEsRSnq6Bgy1Cj0H4vYC+\nqO/kIcWc5mzw6xYXZiRJwAuIRbFNQXDJT1/pkO0XGb/Rh0pvDTKHAtTPtPqw2k/2\nTNsvF6oaXxTTfFuqKCMHOdUPjJbeK2oRd0NYFt/6kHap9pjEUyI5qFUyPkItfL5Y\nVyYzdLgelQKBgH1Uq2CSLWLrKo+aM6o3MdmIf8OE6qPcYi6C6vHGyz0mQgjqpf8n\nwo7VcLio6Bw7pAe+J58fAukUMOfgEa0XjsfNgEO5qHo6ks6QiKRQx5ZraRqZvcDP\nPoL2MzZqSTlMxrCh3E7mD+EpOPxw0UWcqVYCE1uLoJ/5MkVgcIpAxcivAoGAJyEq\nk4gYsl6HIsBrLk+64dyOjK59RXkCytqgZO6gGUvt9DPlZMFe/qca+nDBMZ0wRzAP\nMm8MtHdJhl4zfQgxhXSNMbFBDSCV39lwa6GsKjO1XhDP8CrHSKelGMfDIm2+QYrp\nKZfXeKk5BtB2LBqp91OM+4mlKjUWK7EanwcbOJ0CgYAEbhq04Eo7LIBGkDWS+wzq\nGXxJbmBmCqVQQyKXzBgCNeSv1fSZkfOn3IZYlqRRgUkUUglShTWKZo1RCbltz7Nt\nQ2In64SEB98ycbvcyQdIY5e3cLbWV0P3Rjr8XWnSV0Vw4Uiw4sh5ATM3tu34fOV6\nOBuFGMCNpnIuh1ivxXzP2w==\n-----END PRIVATE KEY-----\n",
  "client_email": "mfc-wfv2z6uc3ghva254k-ehe9bz9u@msgff-372514.iam.gserviceaccount.com",
  "client_id": "109919528537064948167",
  "auth_uri": "https://accounts.google.com/o/oauth2/auth",
  "token_uri": "https://oauth2.googleapis.com/token",
  "auth_provider_x509_cert_url": "https://www.googleapis.com/oauth2/v1/certs",
  "client_x509_cert_url": "https://www.googleapis.com/robot/v1/metadata/x509/mfc-wfv2z6uc3ghva254k-ehe9bz9u%40msgff-372514.iam.gserviceaccount.com"
}
