{
  "type": "service_account",
  "project_id": "msgff-372514",
  "private_key_id": "15e5e0f01313bbb0b32410c1979c68889f6bb8c2",
  "private_key": "-----BEGIN PRIVATE KEY-----\nMIIEvQIBADANBgkqhkiG9w0BAQEFAASCBKcwggSjAgEAAoIBAQDW+H3HBPBiOpuU\n+19K3NJq6GeEgnwI8qJpR8bpVpzM8W0v83ZJKngsQbvbkdRpSfZkPlsUOjGRr5Lc\nhM2DXynOLK2a6HWfPOfQgFVoHjZh5v7UrmgjU+9NrRVwxpajoz7ztLjdMX1pIPFe\nBox2y4o4xtoaWBHUA4RKWDrJidDN841h7UXeLCmFsbDOS8kpd7SILZT4KFvJqX9P\n7/CVA9x2qAHqmgz8dMgXB2KdzOGyd/kW42kzu6psCw2cD1GKEDiZ9HYxosxT7sED\nGxWeuOzUNQitdKHVOk6mZgpsKsYBvMp8cnx/CBG//pCUUm+kPBjimOOZ5sKAz5Dm\nuLBIKAqRAgMBAAECggEATzrtzJze5i1Yq1vMfuCNcxauFJItGfUnc+se/mBMUWLI\nDezLE2NiQFmH3gDNC3NVqxOqaPWb0GioFbuirUE1PMaNw7LaqzJ89AVgtQuxmnrT\nQFr5ic/FOtlItjSTT8N6j8LzgZ7cbJNWMoPyYFRbYNq1hxEfnQcgym/jVuWC/myR\nFKIQILbscQhr2Gswk9gGckjxAf/FNsFs3GOVDrZ+xg887O65hVBzVaIRHGem4QWa\nntBfQFj3DhvXUrzTQ+lm5Xp4XQ/ZoFIux1mYXdjaB3S9gC0QOGO3pxsOgUYduhJ5\nS1Df6TaUeuR/VcE7sF3i/oKIhet5V5OZ9LkG953X4wKBgQDyAcEPkZ2XCEhDi6RY\nTt/+xMfzxyKt8X/jNOmpZbp/w8XWHpS4jnznP8jkcd6LbaLxR1no1fI6QbHO7pKS\nbIu4lCwcX47mRlXnPV+R4u5+KLmzoqAfrvBWB1tSXa583dLLOGiJDyShHxDOteI+\nEOJgPtTh6fA9kg5CQMYYfvCPkwKBgQDjZop0uek8I7qyaV1PYjbmmlb+0vPp8UuW\nT2hs7DFNxTExdcOKXVbx2Fju8dElWDo7xpTeGLxZoIcRYmljcmds4LXwEFHx+Xu2\n6e1vrTcwgxU85mL+spd82sRkUJeLfWUBCFt2C8aSs/FM0SsU8rmbV2dSqPEIJAoT\nZOvMG+WrywKBgQCKwYa4Ln10w0Lrt30bRN4ZbSpYE61Gnlj9JLF0dudfqhgclJwg\n1VG4JVJB6Sf4OXxbatWaMlEYJeKVCyTu312dDxfbjM6aKWnHk+Df/IVRwHf5Dx1Q\nDTWvnbg2mZAZ9/WMn2MQcqZF21H/szls7LFfDadxgHhGVR/nzMvH78BuEQKBgEzk\n8rKv3vdwGYSU7nGWg3wM+pfmm4YjCu1D4sraP33NzWmtKbcTAwB6qO/7oz5ejCqE\nZviHIsGn76RoQ7zWBbUic0M/MYaCV1wt1BUsXHoyCS9ztEvt9h3JGBnXyrbnaw0j\nV1Ief0JCSLkyDcBip3Ko5o5kBEU9co7GVJnLYSlrAoGAO7+h8oXPetm112QN/Hm1\nZCLAzku46CQeSaS7zzvFc2tRnZT0F24AKBfR58SNzy717d6ibfc3tfkzAeWRSeR1\nRWD3AYSH9iTYdRcuzCvXt3kD2KmhntA/AEfqP6ZbM4lBvBs4E6TsauT9DYwFp6DQ\nftGhG606RvIfzrhB9vwjM0c=\n-----END PRIVATE KEY-----\n",
  "client_email": "mfc-uavflk2g8p6n3w5p85kjlpbldk@msgff-372514.iam.gserviceaccount.com",
  "client_id": "107744712100205181345",
  "auth_uri": "https://accounts.google.com/o/oauth2/auth",
  "token_uri": "https://oauth2.googleapis.com/token",
  "auth_provider_x509_cert_url": "https://www.googleapis.com/oauth2/v1/certs",
  "client_x509_cert_url": "https://www.googleapis.com/robot/v1/metadata/x509/mfc-uavflk2g8p6n3w5p85kjlpbldk%40msgff-372514.iam.gserviceaccount.com"
}
