{
  "type": "service_account",
  "project_id": "msgff-372514",
  "private_key_id": "75182cc44b6bab8cd0f0e93b92aa546d290aa9e4",
  "private_key": "-----BEGIN PRIVATE KEY-----\nMIIEvgIBADANBgkqhkiG9w0BAQEFAASCBKgwggSkAgEAAoIBAQDS/TyXZiYbkqc8\nRkA5wWLi34SKUFCYkTAM+41K0AkbCKab/8X1Zgn9Sq9wH90DeGw/lyDWUAdKyLgR\nWEqJQPzHA/vWlB22sf/UDKkPiZsTbDYwmkwyplsopLt0rYzAAHLE1IY+kAtetmzo\nbctcVBua0+ZJ+7QjG4Rrxcg9EfFew0a69HNtkrtW438Tlg5mfCDPjcgEathKvR31\n08ILxzmTB1o+6up/B9mErgGJ6JZNPw/JU4v6TWclSj7Fku9VN9aT3uMGP4AWooW1\nRlfus6NBEJDFMuR9YNlEH0x5baV1GpsLfCFaIwvsGaC1WhA7O26GeKLffaJf6yhw\n0/vX1xmdAgMBAAECggEAA26PD79fm081XSufW9EjdKFCHKXVycWCzJNC5xafL0ti\numLcq3MvcmlGlUJPbAEHcblZlWLT24mMROv0umrOMcaE0Ca0nQYkLSTPkysf1J8L\n+ppn5uMB1JVpXyp7gZwAQedbD6V0KeQ5vUYb6rKLiGct9cIcWf3Wl5IuAaBLFsl6\nxz7it9YIFKBF0W9URIdap70bu0lqUN70Kc1o4k9McDsT4NE+2JiRQV7It5GqCbyo\nbXO+pEAcoL0b/zUSuqVVGm3T/j8lbwlUMEReM/fL0XaMP+HB8fe0g6hnc7ojNta4\nLXU3VR0Z6GFZk65Zy+ADiApaV9PUgsrNBjpbTKVOWQKBgQD4Y36QbkPU5ESCxGfA\nMqwHGAXfwV9/FQWN2nyUAfeVyI9sSD9EDiO/9ZNNEMiHv7pKj8zUjK5462gPzqxO\nc1sYFebYjf1RAB7V2aO6pjs/Y5PJCvyGgCx7Sn9E3YvK6YrEbtVjncq92HQ2hf/+\nnws4mca6dz5o+Pmuu2ZV25g+8wKBgQDZdFv1jkHzvPuTrJBbr1dCwqJzdD1lJgrj\nBGOAt6LKzuhLKsDdO7fyq268ja/CzycShtAuEEL7eGK6LOr3Z173OYrpT6PC+f5Z\ngD6ZXCmsFo4j14JLzb0jDRjMgB+WG6r4q6+tU4kM4WSVpQrx2yc6O/jmcVTBqG3q\nz/5VDd8JLwKBgQCypdzBxIzE8ejUpK56bfeMopqW9F3a6SO1gw9W5JNOB5IgL1ZR\nfFn6FoZ7Rzbza9JxDjwkI4rZLXcK53rGcfFywU3nMzieqZeD96Tq+eRjExuX3W8C\nze0wP8SJo06IArDr10ti+np3UNdE39vfJkTL0M4+DsW0el4abm6MEgTOQQKBgC0S\ngT0Uj3cF5N9nFUTrwxqDXUiw/0jH6dnEPxue9I8089Egu3kft7EE9579f0DRzzd3\n2g6yMDAPc+dDCDDfrD9yHejeKQNw7dd/TXpcMAcLZcroEInFyz5IqKs6o1FpyrZg\nX7l9ZxrUXRTncK1Qz4CyjZS2SOsbDi1tjznx9hjhAoGBAJXsDsGHHYMVDUPsSp2Z\n6uq0JiHD4YxBeGxX3pbC/y3i1S+NKLr41cDHQ+Ub7WPGMZBpG083Iqv2SqUG7MQq\nXwkUo67/zgWixAIzVH9eXWt4ADFRoHSc6o1DIt9COu+iBuixlCNiFIEgnTWqUv5y\nBd+bcPphIM+kIRv0wltIpCbn\n-----END PRIVATE KEY-----\n",
  "client_email": "mfc-c8-ivloosq9zwzsnj1yv9yqz5g@msgff-372514.iam.gserviceaccount.com",
  "client_id": "106347696933274301698",
  "auth_uri": "https://accounts.google.com/o/oauth2/auth",
  "token_uri": "https://oauth2.googleapis.com/token",
  "auth_provider_x509_cert_url": "https://www.googleapis.com/oauth2/v1/certs",
  "client_x509_cert_url": "https://www.googleapis.com/robot/v1/metadata/x509/mfc-c8-ivloosq9zwzsnj1yv9yqz5g%40msgff-372514.iam.gserviceaccount.com"
}
