{
  "type": "service_account",
  "project_id": "msgff-372514",
  "private_key_id": "ecfaccc7c5e05f1472f8c713c49f6febc5cd439a",
  "private_key": "-----BEGIN PRIVATE KEY-----\nMIIEvQIBADANBgkqhkiG9w0BAQEFAASCBKcwggSjAgEAAoIBAQCfqANvCUXrw2MB\nyWRUpUbY7O+62DIiTCmIz7f/ygbhXl1FryPYdQzvn0yR/LyS474UpFvux9Ze05eG\nH1s4NIr53v0NXCy4T/25QX1Llbn6Jm1FljcfQO8+K89HlZi7M/RtONwykii07+rH\niKHx5oEdvF22+YrT9uQ/nOr6EL6i+3QFGxV25YGNejI+wLijdzqUBt4mSDIS3VZH\n1FsEfTDkLqKT0herYSBoztjMRIHGGVctSb3nCcBtG4yDrk/T9tlrjIHVyMjnQm7z\n5M6sLnTEWAPuV/eubyJMAnFCoq1hujStmKwdNmxhUcgCPrHOYABrxYmeHh5dUllI\n98S3n65pAgMBAAECggEACAbrfUarFEpzjOByQes5X6ix+OPryVuo7u76okqnA+e5\nqso+dCCWcOnCcMiTNpNquCD3Wk8D0Sq0QJMNBAtoPV3fvS84NGAZMpo/UXCKtDAA\naHI//TtHjAmp10CHOEpJbMBiGczNbSNu229cLQxYy4Tv9UYgm72bBjO+gKoc25bS\ngp2jC88hIi6bH38jyJyGXubjgU5hGTMWv6W4xPwDSOsiY15d7XdRlkLQDCJt2HN6\nv5+o7vb1g9gNTYWtAKJoTeWNprM8DmmOYVWR3ls3v9KRhJYg9mBlDWBFfils2NKU\nhqu0UuY/fuU8G4rYmfDwxvVwOqOX9CRMrwn2F4SDsQKBgQDYvcg0gCi9c7gVCHKn\nEhj5uLdnL0bglUz/4rTgi65Hp103LmvFmr3Qv5hxXX9DCpZoG8tzux2hrM0T76cO\nMpoYDEwr55rM+ajjwiPCJJxTNUFfTgU8La8aWwdzL1szoj41UPBvJ4FlkZdBUIE7\n5aFkFxBCrO1mjxfLieZ4XlyktQKBgQC8kzgF6UhiufuBgaWvYfOA/5K3M8U61jKQ\nw2gDAI4/yx6zYP19MqYGvU3X79wqip30p3zZFDvzpYkyJLH8YZ8wI6vmCDc/oGcP\nIFrJ39LrU2UqK1gg2ok5S2P3cA00bRiZuCmFPtmW6/PJN5wKjaVN8i0Q3ImhhzJ8\ntIdh1SLHZQKBgDYbwuRgbktFnVoa3syYtwV4uMiYw+ADRdLH3RIFrP+UZ7AD9cHC\nLMr1WfBLQB8TgJMDBVqiBva6tgPZG2Ju/YstXsLDMiEj3qbla5nnG+Ol8ukBCEuK\nuCEjQovd8a3FPjR/PVbyjNo3a4RRvcGfRRhArb2HgEjPRkh458F7BTPVAoGAJu8S\nYw4ONuwFRHDbH4HOv7SEuzSCJSqyV/cwU2Za+ErctNZyn9XEN6IAH3RTdakXAbtO\n6Jbn5d8om2S+JsiVEGBdDmpl1cotXQ8mD4YZyyJ1waYfVPEp4d1x71WANHHN4XcH\ng449aI6gz8ueeQNTvOsiaNfPxrzeLKctSIKz4o0CgYEAtftpPN+w51MzO9SuH8ON\n2zMinb+CJTFs9agtq4UpSe2j4BeYL2bg7lxN+iiZBAwKc7sRPrIk60jUT9Y/u5E3\nSN4uIJ2v7RS1WseIB5K89N34M72TD2EL1W+JvEOkba4mVWrex3crafHvpitDnqDQ\nXBhUQHgCsdmolfkNAhZpo1g=\n-----END PRIVATE KEY-----\n",
  "client_email": "mfc-x8aeqtr60z2i092b2xewpw878a@msgff-372514.iam.gserviceaccount.com",
  "client_id": "100736048698863475443",
  "auth_uri": "https://accounts.google.com/o/oauth2/auth",
  "token_uri": "https://oauth2.googleapis.com/token",
  "auth_provider_x509_cert_url": "https://www.googleapis.com/oauth2/v1/certs",
  "client_x509_cert_url": "https://www.googleapis.com/robot/v1/metadata/x509/mfc-x8aeqtr60z2i092b2xewpw878a%40msgff-372514.iam.gserviceaccount.com"
}
