{
  "type": "service_account",
  "project_id": "msgff-372514",
  "private_key_id": "6d15050711db1ea1a11d14b504fbaa0a7b9f79ce",
  "private_key": "-----BEGIN PRIVATE KEY-----\nMIIEvAIBADANBgkqhkiG9w0BAQEFAASCBKYwggSiAgEAAoIBAQCx0AMc3TAHxM7Q\n6FjrcXq3IlKB6B6yrVcCkC4PkTE7v0LZQ/6mQkZS2rrYnJ9k66aPbktvZRRRpPqQ\nZFracm4StSyVUx0oTbCnqyEeAjfWOqJGRh9gLj4VzZ+Mq6/6glF1dhIEZu9f3Xf3\nODRq748vUEy35OIUEjoZ3ADLn9R2sa7k+afKFdUnF+YiLdwW3YE5Bjp3pM1aedjl\nPadseJhCompXt7gIN+5owxUogG0/J2rtib/4X6ER8Y27uM9Dpu9sVKQat8khqGC5\nipLlhXicTVkeVerlIF9svy0t+yp4Wh9T+jW6L8fPjaiUlv8EHUHgUiMKmwfeQJ+v\n/VE/U8ObAgMBAAECggEASp0DWV7Vc0UaFd6RxYZyXJuZ7KonC4oiS1COC3k9JBmf\nZwUZu9FuqgDfy9p5JkOeOmypWd6b9qCYhfOejjDbUJ1Wzng4cXucR9dPB8UdghdL\nldqB+v2cjtCghUpcB24c2YHIkLFS/DK2TvZ2RHMu7ccv0jDIz2xQlh5T9R4l7QHx\nx6zteMDdV0nSL2ChtZ+L1k7709Bm8w/eH6KkE+0jDu4Io7UFUasI5BUKa2vwpYlP\n355VN/9U+TsCHwEf1FvSoyYAoX9o1u6BguKSa+QX4jnfgazsp8CSR4Hn4WnKzp9d\n/xSWYY7c+bSOnBMjGmUxMefmT/x99MgpPPt0pKn5dQKBgQDm8/yWJeBzMpRuWJ6Y\nCW2vU2ss+o2BsJBCGY99Ee+DwuTZ7j4Cc6LwntwEJa+2rUdw3ABumazFvhCekVm0\nIXD9v45sAHsywlleTiQ9P/yTh7LmULSdYfbw30cjlilnh+P2vG/diNOa7nYl/Ei5\nrsM7S9VEuRfx38yTLkn6KxT3fQKBgQDFGKupOLl+dSbrOubw6+PEfk+WsdjgdTYx\n8Vd+JIOIN7KodspUN3T31tVVO1XxGsNTJp+z4hbGOnhZki6sV/pGHcwZi8NkMt1X\n6LYFTmrExChqqYHo9w0YXrCZemM63e9n+hV4qmbVbjzxapsfpoz2mbDJcujdlE/Y\npTLE0PIC9wKBgHb3kdJKWo8cq+cXkUJiAPVCdD/sJL58lCLohch4V7e4yigUmC6t\nIG7wdgdQ3m2sXtOdED/ou131JRx5ZQrr+wdLCHNL4CpqgJyahgJjFplsWlRXmGJF\n122Gpl+Hd3aUQnKT6M/mLpJtacDxbwjvJDREQOywp8v5a6kZPBQ44wkFAoGAdpyy\nMdSBTSkTktyPvs029TlOjFHbQrlHNCcZkEBJJ+DdE6TpfmUhb0VKfVCIF+ETSycj\nVQ3qxsDJTJ48mFsZsrib64PAwrwZmJ3jbK4UcvXZnNcF5z1GFDRn8vVEYljNirVl\n1og1+pus8VxGnnWMv5seWR1eJnrq0mYYd3mHK2ECgYBNgt7wVcxV3AX2kYiule4R\nOW2uiiCWuWMGQ0xTphU4IAzzyHJ4ADNlc/9W4brgstg9rF4eAJnv5K+aTkgV9QOI\n1aKj4ZDYHliilofb9nRXaKXARGKv2HVRKur+tFO+dUAgpwC20SLp8WF4j3VglmIF\niHj5OGjOAigCkdCPuPY+Mw==\n-----END PRIVATE KEY-----\n",
  "client_email": "mfc-tnnwj3v2od1n7ct-pfuw7sqhy6@msgff-372514.iam.gserviceaccount.com",
  "client_id": "110150082938869018786",
  "auth_uri": "https://accounts.google.com/o/oauth2/auth",
  "token_uri": "https://oauth2.googleapis.com/token",
  "auth_provider_x509_cert_url": "https://www.googleapis.com/oauth2/v1/certs",
  "client_x509_cert_url": "https://www.googleapis.com/robot/v1/metadata/x509/mfc-tnnwj3v2od1n7ct-pfuw7sqhy6%40msgff-372514.iam.gserviceaccount.com"
}
