{
  "type": "service_account",
  "project_id": "msgff-372514",
  "private_key_id": "4aad33b76a7b252bebeca9c3065da4359f789390",
  "private_key": "-----BEGIN PRIVATE KEY-----\nMIIEvQIBADANBgkqhkiG9w0BAQEFAASCBKcwggSjAgEAAoIBAQDiFwGt59881pCd\nGLu0lHx2BBkVwjy9j1GjmuSrreMoKdQV3HY/38qfFvMtfpwh0VQACvs2T1VAWCsi\nQIwsaB4Y3pBpo7C4fxQouonYiX3FwtV3+/io4PzKKYu6q7WeuX6DC+cTXuanhZJB\nFxPaqC/rdsV31suUTAb3XMpXjtaweuYziY278NluHQSo8iseXTpAtni8Sjz3+Wd9\nYAvODtTNGexxujPVOGO8Ka00VvdfUupV9lmznvz9ifpxXfg+dW0OYsNDMogZRU0y\nYTPjdUX8Y6kEjaXrgbQB6tGPgrRCXTZ5VzcQTOUKHaqSInVlI8otTQSXiTy1clj+\nLKr/N3gzAgMBAAECggEAC/T/h7z9l3AZkdVfB/vaYTtyQC5XnAbaYHaupU2698LO\njqFsN5CUXLmP/tX1V+yELsRl6MdlUNPY5CTZxPd0sAgFRzD7Babi4AyNgcAzwKO/\nOms/CV9svxxXYXX3Uv+oazHT9LhOJonv5DVePXArqJ5NbzsS5TLoI2jq4pqRTB/6\nUyW2kMJafXwjlsladtxq9G0p8wtDuz3/uBhR3BM5zhSzt1NsKlA+ISL+aoK6AHD/\nPu/sHQkE8p2V/zSU6sLOEE2rF9C5bYeuD8GHakxSk1v3q/plzzvdm0zzn6V6THqG\nqXszbck4ba/1alqqlr7ayce9Tl3ioHdYd3gwj20SoQKBgQD/DOD3pFxnDHTM5M3L\nyliRPDb/8utOkHDxakuHK1/NVOXsim5VTEmegS3esZBxw+YsQZEKon+QKxwUOLQA\nKoHFXpa9cP745MazWuAM5Q7d6GqImTiKov/XyCpGfKGHzTXwydY+0MeNUY9OXlKd\nGZ/CNGmWJP9Rcn1pUx03aDvpKQKBgQDi7oWZAvqTxz4TNfcT07tBssyztjml+91U\nYyRT28V92FT00ogHeRiwvjlwcwheFFWSzWdMofP/F6u/wWkcUWyTz23STgE+Fmzn\nlaa8DoVdBcB5NBRrq6bgRpAFyRXp/I1pI1OzMI2ZY7xeGYL14e/BBPZoPDy8QqnT\nPuFcRz2V+wKBgD4fifBn5WXoP87kcEgSKk595zuilLQXNJto86qh4vzlj/d0pHk8\nUrY76stSXseHGtpuwgBgIkggZ/947EcaE2/aoUbVbhV7y/ZFzUr2xA9DHCfXglEq\ncLzDcaCnnMSyNFBJKVk1i1WdpxVEnkTLyAEKuSksK9BP3cI4z2X+ipE5AoGAUemW\n/6w7lqwMlBKepOGAbi6EBTp5hJhtQ9ClhD+IAezcfaKgx1HGv8VqJlTfaFYerWbH\nKroqwKFitUyzDC2364KsOYU+nZKqrM0v6iGzsegpmZZa6KKFEd9mjTAQYO1wfcrq\no3ubIQsHK1A6HVb4m8uWxfk4UxwdAMtpvU1ZxZECgYEArScN66QWQniSJPcI/z5t\nW0VYya13rKhuMz9ItlVZYQr3nVXC4LfxLqRS724VCXLd5KdJe7eVTPhy+ZT00wOs\nZ6Q24DEqZR6KOYUjlZw333JThpMQQNdEGBBXovwyAruIrTfI6MTrqOl894wtx2Ly\nlii9dtSlkfd4kqXpH7StRJM=\n-----END PRIVATE KEY-----\n",
  "client_email": "mfc-0446cn75j4pjo3cnvy2vw7b3ls@msgff-372514.iam.gserviceaccount.com",
  "client_id": "110404248134395145835",
  "auth_uri": "https://accounts.google.com/o/oauth2/auth",
  "token_uri": "https://oauth2.googleapis.com/token",
  "auth_provider_x509_cert_url": "https://www.googleapis.com/oauth2/v1/certs",
  "client_x509_cert_url": "https://www.googleapis.com/robot/v1/metadata/x509/mfc-0446cn75j4pjo3cnvy2vw7b3ls%40msgff-372514.iam.gserviceaccount.com"
}
