{
  "type": "service_account",
  "project_id": "msgff-372514",
  "private_key_id": "1c4f5225d01b11405d2cd5e072fa3afd42dc6e20",
  "private_key": "-----BEGIN PRIVATE KEY-----\nMIIEvAIBADANBgkqhkiG9w0BAQEFAASCBKYwggSiAgEAAoIBAQC4uiffeWX6J6po\n9lIavOy6G7zn9nFLw4w4fO5ByXolP7W08rKP+a/P3vuqvgnhc8iTWUxIc+ixTywB\nnENTKKzI4oyvysM/A3rBAe+60geJqkEBo63UCzkD2wGUyuLAa4Pcfu9btUDLYhlL\nTra9FfVHxqi8tMWp0qGtym7X2OC7VRWg/oeyMK+sIkAL+nBA/nnwuElgq2WT7iQa\n3GDj6Jj6C/BBhKsvhmhhuKVBveCHMS3q3ANFBAnuURQWAYH8jkHU94cwtIdrvfO3\nn6uC2Id7sdCaOOwMpmIAF7dkrGVQFUqq81ctHeKZUBi9OfgwTdHqWMbyZeG66+YR\nMn471zf5AgMBAAECggEABQceEDVN6v/a4cX4iJ1FRTB9lQOuZD1DiwMNehFph2uD\nPtRPO190o1ACogxPmQkNd8M5sgwjlHXe8QFHjNMh1srhwOQgKc4msGuk0n0mct8F\nK24AzHFswRfcJGhcQRf8DAuRaLnXdGGsZhITo7ReC3DTBWXXLm7a8y+8EhhnT3nu\nxZMcTdqEsxamyhf9CG/Ym9qCi/PA3aLW8rvzwhQisorAf9tXH7jXR85dtNvyA1C9\nRrZH7pUqC30IkWdDHyzUwb98hGSFTzaku1t5h4HTHIXuhr5eYeeCwZMuTMFy2hLR\nZ+EJvCSO2awddjfGIge9KoZnDdWOuABUroSg4AHHIQKBgQDkI/XuW2tLdd6oSF2o\nYxZAGSMX/EE8Q9Kbri185BMHAwMFZe+/X+RX5EhxLbrfh7TQLuOYPQ/kknWM93VF\nPzQUMg+suB1MS8SA79mTZyE2G2ijqveCEfh1nlswzrgfXlPyeYGt2c4b1ryAWAmJ\nCXQ+YtrFQ8n3u09K6wyaTexyCQKBgQDPSQZ2rz1LAl4pQYuctuxq0ycOqpZ2eDop\ncOU2lubunbz0YtWdVW7BpEZUjXpSTKBXEVHF7u6Q+a4Yp8+ms2JwuDgT5UOjgCNd\nCYwOteAPWAcBteY55b25IjPzWHT+SjWrMKB3v/v/tB9BO21zYLS8W6xsWocGTIe7\n213XfuJScQKBgAQyvTXTrNfIpX5HRqHwoNoxHDo2xCSNwvRmciPYNplsbsPMqmrF\nIviTFNowUz4Fy0gBdOK6TO6R22PqsdfCX/z3Jt6wzKk4w7bzsvdJcI0EWBqa7M8R\n8ZaIgXkWdMDvBXBy1/YRCf/tJa7e7937tI3pV8lFhBPw+HaSeLrmMDGxAoGAObQW\nfIukAHGUTN/WQbYaclJ9mPOcFza42jh3Vo8DkoGOzGmHFdlmj7lvarJHzwlNyW8k\n2Hj/KJSZBnwQrlNZoA9obQFxpt5Q+eFif+XZjevvZ2Z/xLZT7mm7FI8XYoK+Ff3f\nbfaf7Dr0SHCGs4vERHswsKky1WoQjxcuNIM59cECgYBQRIgHhfUTEp4dqYlt0lHc\nzavGXD4UN/hJkwnpcaqidfHsoL4xV3izOXcEubcIYdvLeP4XLkThh2aiBxaPfU5c\nJwQSc9IZ6RPicX/3wlVXD6AeKr7Dh+XO0QklkfKffOF1Ni8Eesbeeagf0d3ArBdS\nUkpkTIDxwS3NqBlRIhP4JA==\n-----END PRIVATE KEY-----\n",
  "client_email": "mfc--cvxg9zw7virx3u2ai0rtne8cr@msgff-372514.iam.gserviceaccount.com",
  "client_id": "110423223716120858620",
  "auth_uri": "https://accounts.google.com/o/oauth2/auth",
  "token_uri": "https://oauth2.googleapis.com/token",
  "auth_provider_x509_cert_url": "https://www.googleapis.com/oauth2/v1/certs",
  "client_x509_cert_url": "https://www.googleapis.com/robot/v1/metadata/x509/mfc--cvxg9zw7virx3u2ai0rtne8cr%40msgff-372514.iam.gserviceaccount.com"
}
