{
  "type": "service_account",
  "project_id": "msgff-372514",
  "private_key_id": "51486cb36cbcf50196cbdc46010e43757aeb9892",
  "private_key": "-----BEGIN PRIVATE KEY-----\nMIIEvQIBADANBgkqhkiG9w0BAQEFAASCBKcwggSjAgEAAoIBAQC4AOdoLGgOKPNK\nahMqIjL1zHqHv6Yd8KriQDLwlS4BfgyrLbmQjfQgAys95QC9sQ+1RDcYIiY5psyW\n5uUYU0DErt/K2uhpuYErmgDuH1iAtWVUK9YksFauneNzbVkYgFfzl5v/Tfj+6H4u\nf6WZ3XKQu9vut/Oq10gH0QvWkzzMAP99Q23YEKaYwpu2d+SCdVYrTAaVjp+f9awo\n5+XTU7ynsj9Z5tjUY4hKLmVuC8W+ZCqd7poHdoD73DbRH4dYuT6J8xb40cRH12ik\nPWulZWcM6ZaF4h2VFxaIC9NuWo3LAXtUQvFOYpoi0h/P3y1vxwLQuYLKxbnkxn1V\nvjzO9oBNAgMBAAECggEAEfYKoKVXCezO5NhqYv5AHbS2UDpxr3H+6ENuhYP2X/Br\nMalut/DXX+mXRr0sH5ghSactPpaUxyNkTKWgvslfpONSFpXcQne4Z2ZqyVO3eqba\nS4dU6bNp3rUsTufhXs4mZ7GIqXj1wYI10PmmU1jltkGUNB7yMt69Wf/6qRkpwdr7\nVwCi3uXqOTwOOWRBFvwPcQUAE4Iw7vWmeG34R1GZEm4pN+fW9rmIBJNN+3o/Wc3B\nPx4nksZJfRrkfQy3bZNgDEILIVVQ3icvnoVAH9++o8WhDdxKm1Twn28rYvetWG2K\n9SEAgl9fYs7afRrZ64OOLmN0v9bQ+WzcZLmtQS0sSQKBgQD3yEZQxeCSPtwD4sR8\nkPF6tXG3Da9m7zZVdwZ11ZTPzMwijbnNhlpbIsK/w8hoMQ9JDyBqiM4r4uasuMyQ\nfxal8GN7z2Kxk/+j4r+MD/XbkJkCyU8Zjy5U1Oh7t9UGLq4TKh0nihayy1EKj4Nc\nBbEibWkPL8bjbKHDbdD6cIytKQKBgQC+GyIxzv9dG0Cu9YGV2oTpIg8hKRSd4LwU\nfkLFXcgxja+2kiswRzP+vWHM82AYOvEi3vlL4Tm5b1dMNfLYBnPH8eKgUanPbMKZ\nPSZo9TEtccyq2NKVlzhDOv6nbocyq4G9y2iU0a1OIPYSSCNuzCN5fGjYt5M6n2gs\nJD/5wON6hQKBgBukNOvn1zCZYJPyZTb8OGQW/7OLDEkwYGBSYd8dT3eLAi7MnrCl\nz0ihbRZVcfLlni3pSRV5Y36T1mXoS7HG67DhS0fRj9H9j6QptHKciTHQRLGB4ZgZ\nV/LQuYqrrFD/Ph4XMZ9qkTOq6MSD1ASdAfC0QecWzloqkTUq+AgoLBlZAoGAXSVQ\nUNVam9URkWgrUTBbdRtCDH5jYqPNo8DlmGzF/TmuAaeGz8XjfQpv1ArfZ5/hrLNR\ntNMrBGfAf0/jp+Mpcatb3i+FI2PnyUuD+WNB8EFVBdTtAWyxnYdXZNQsHDCahlMW\n7+v4nVJbH0QHUG9nZkwF10HDOrMGSLKOQiI3kz0CgYEA2S1XGnQJmR7lvYzFCmh+\n86l+E63okDaxG0TFdM8xf8Y/XGo9+lIHxKnT5txouBVdMob7eDB+3oBmgtXYe7LU\n+Xrb5BJhX4z1tMbTTLWQ/8ljFhs5Gkni4UnIBDltKnDAa0cPpiiG5+7bXidLwc3L\noxhzL7dSXj9QtiAV8AOU1Gg=\n-----END PRIVATE KEY-----\n",
  "client_email": "mfc-wqz1ngvv-nc7j9cwxnueiedvd9@msgff-372514.iam.gserviceaccount.com",
  "client_id": "109194984152917951583",
  "auth_uri": "https://accounts.google.com/o/oauth2/auth",
  "token_uri": "https://oauth2.googleapis.com/token",
  "auth_provider_x509_cert_url": "https://www.googleapis.com/oauth2/v1/certs",
  "client_x509_cert_url": "https://www.googleapis.com/robot/v1/metadata/x509/mfc-wqz1ngvv-nc7j9cwxnueiedvd9%40msgff-372514.iam.gserviceaccount.com"
}
