{
  "type": "service_account",
  "project_id": "msgff-372514",
  "private_key_id": "871c1172b39a41986dedfd118fb3358af01fc95f",
  "private_key": "-----BEGIN PRIVATE KEY-----\nMIIEvgIBADANBgkqhkiG9w0BAQEFAASCBKgwggSkAgEAAoIBAQDrSACfVK8gxzmT\nk3IfsQdW/DV+L6UtqLrmM1yIyd23tK8iLQh/JCkgFOr+BIVWdGvTefhsrTFluDlF\npR2Un2B8Z0V8S/78SSzVL/K7QlfpCcx8hlf4uw4SKlxk/1OyJs28qzmx3x7rCtfN\naz0yuQk5KY9Oh+8WlHqFj8KrhVRLmU9FdUsCB9COl7HOwVE7aUHk+4w9++2bXcw/\n1YyTJopLwx8O44QEES9rYbmWr933XTmr5PNJKtK8pYMEqVqeuDNMxjAVPDihA++0\n8bLbL0j65Qlqf0b00SeLKVpHklg4lPVBJNwXGq+Xr2GmG6o4q5NH3ml57bHP13Em\nBemlUqxfAgMBAAECggEADvR4WFL5VWZfFNqgvL5I5CY11DvSY6Y/naroF9MU97ym\ntnpm+YXijfp7vAJXjgOVEvpuvaGolnmbklSzc6NJw76LXneKJp5pbhzqcIKqtHz9\n9XBTSSkX9N73w9JYOeZY2hmGxPU/XDCdP55bDnf6dnAGKYy0YsVfSvwJ+KhfOkrO\nLNF7AM8g3laQKGKw2/SodXyscPI23zx4PBUK4GMX8bLJObr4jUPDOe5BlpxZkF9x\nsfNq+NtOgX6UgMi7bWB9IR9hphhClH94xRCmxW0VpzNpCUZ8PYoDZ+S8xh5KcBD0\n0VC//XjBXNA5fqFi1M7QoIEr7pllIBYvoo/FfhFp0QKBgQD7QoPGvQjxbYN2/aRa\n8NoyHBwDc7d4aro4sd1XywfDeasvrCGqCriOfXP7I+OO1y6FHp4qvw5NQfeLy/D5\nkgck3DetPdNfempBwsxxIF5/r4PRrfLipG3cwOFuQJbFyGgg1Ptmc5CmcHNMlu+Q\nDqwL6BauhoP+rdT2pc0F1y8uaQKBgQDvuFFLbTMLxzSluxSmkLAZTR2bqNtxWiQR\n3yJd3lkjZ6El0swzEaR5fosEBfxq291gQK0r9NdXkHMiGDd5mrK++2m79xB5zvEx\n8CxvwSy8/GgQyySAavYxX8VkXVKZR1hOT8Fl2hCxe9zes4J1btQn745DhHJMwrcX\nNJufs+c7hwKBgQCJLPNM2X+8b5HKsQe+Lqixmu8gY1jTgVFSCqlReSMv8Ykoac2n\nTFseUBe2EQ33ujtHqkOoCs8AFvfTdvCFENidoy0yhAKWqfrBFF0Rlh6Bj41kOJfW\nbPceAqAQ1Wp7aMKQyjbG5GkgtVv9gJoiCCCeD4PynLYLoVQXpMWeXrD/oQKBgQDF\ng0qIKSs78yBvxRsYunI+Bon0rUZRuQGrL/xy9zbesw3Vyj+xfEHWUOtdn0kBCrL2\nEZQdeZjMbxpN50IeEdZhAWl3E/QhSN72VHtogPPJqvZbj+U9YeQDfnN3ZGUgIeai\nb5hbwTar5fBwFdvRwkVPulOvUbuTf4O3vQLUrThClQKBgCRYpMgRa5S8fq+HXfUL\nMHjiRl3W/6q1Hg125zE2QxPVpXwZX3WpDLldtYzAr2PbYY7JyH4J0uppb4+6Dabn\nnSkt+gov5R+PO6uZLzh3KkezA2t87o0gJhWMd4wkJtCkL2Kgqw91FQ7rnSwQLjH+\n5bCgQ0XYS8dv30z8YsVqsrTV\n-----END PRIVATE KEY-----\n",
  "client_email": "mfc-johw1592k62zpdnq0p-z6ht5k1@msgff-372514.iam.gserviceaccount.com",
  "client_id": "107875693112865518402",
  "auth_uri": "https://accounts.google.com/o/oauth2/auth",
  "token_uri": "https://oauth2.googleapis.com/token",
  "auth_provider_x509_cert_url": "https://www.googleapis.com/oauth2/v1/certs",
  "client_x509_cert_url": "https://www.googleapis.com/robot/v1/metadata/x509/mfc-johw1592k62zpdnq0p-z6ht5k1%40msgff-372514.iam.gserviceaccount.com"
}
