{
  "type": "service_account",
  "project_id": "msgff-372514",
  "private_key_id": "52ef2c37a002a807856d0a6cf86d0ff96de4c0da",
  "private_key": "-----BEGIN PRIVATE KEY-----\nMIIEvAIBADANBgkqhkiG9w0BAQEFAASCBKYwggSiAgEAAoIBAQC6OLxObtVUf+ih\npe1vGt//c9DUrtYTxXd5vkw4ncq9KKy+EGHsfHkAIm2j13g839gYhnaGUJBEiW26\nsX/ELz8iZWzCqJMnd4Dlyq1BkdPkK6BmVapgtXv2hutwwMxmOTnVGbdPviBpsZRj\nyGsLF6lbLpihib5qj+Z9jt4oUhntUSlJXia5NEkprE/txzaTfElwBI+8SMethw/1\nmpTtcH3wCqP3pSYfIrLoMd4wUnUkMN3gau4lDeSs/+34ZXtZQi/wDpkK6J7Pl2H6\nCm2G+oX7P/xwmwCyl1gLT9NfqAYHp4k9DZrPMzdG7CnvaHxfHRZD6r2uQONK7sVE\n0H4dhcFbAgMBAAECggEAH0auIcItpC6DZLrYgOOToXTTKxVeMR3mLhVO+edOiKyP\nLrDTsYNKU0J1BaKHuDmkMqJKv85CHLC0NDnhipKg2OcN+DeV13gTtwRuSufyHY1S\nOD3FCs8QTdxlKJ/I9JZB50+VYRg+m2HO2V9s0wUbVYwi6GaZC461mHrpRv5bCmdg\nhpWFj9QSanBC6uSjvR4C3haAib3+X4wGYxd7TXpKl4JLF62pNpb1Zms64S4a1ivD\ngiWxI9YbWc6hho5fkKrMpEFDrbC1IzbKGg/zSvTw+QgOru+LsCs8mb2jfDPoMGYN\n0kvBP6+w+Eqyx0C1kVRhcJ1AcjkLeFO8fkD/G0dtyQKBgQDwm0kfRF2c0xxbpXHC\npUcq3w3Eax+kgcajIWJ+LClRe6LxCgk5REcVe1Ejyxey4xf4YtfKFNDVPIvDdOZU\n8ugB02Fkk2oD6cYdQFnEH0npICfLmRD+gLd75dYso53Up0QNjvgLbGEVIMa+/hjA\nfWiugyEN8NbCv6Za8jVnej7cZQKBgQDGIrg0DpT8tKXsuFqxx2tJl1P/Vt6prqNU\nuyZtTHaAfYBoeu4TIbKQn+oSI1cWKZfArOBxi+seR6L0CgvPpZUD96bzOrZtl9XX\nyeZPPHih7TwneBtDWM9aKIoowAH/Oa6IBZcj/nDmZliDhwLqysAWDFBBZKyVCM0V\nLPaNsE/qvwKBgGH3GCK+906vNlCqYFNccEmoYDalV1Dn9jTdlvjAimI+8O0rpO3I\nOxkoCLWGL7QKeuwLcsk5CH6KFG4U3uOfs49qvbDxxKyrNpsaZHJSOwnMqedf/2dg\niVTNFBNA2zaGlFLg72XXTwAHRGTnmLRnW4QSqBbBBPBukBFfpRbo00dxAoGAcCwR\n2y7yPEtNsMICXqnG3Mf2vxWAQ9JiF8NIkxJ5+G6U9xG5nU0zmdtfGlu1nw93IZb+\nDmqnduIZqE3TuABHaBKaCxQPWeZfI6bjY7KZnRsBNlsyHCO4aJOQ/FcQCl2uqMV5\nduBDLL1+mSAjj6evrgvUl+EWL93mtXlaMIdEB2MCgYBCpr6R6Ub0745whxv5TxfE\ndAd1ewMWbaTpno3msHxg0bol+RflJBh6qob5bGqoAzkDVsbwjcng4WXqvSMibFW5\ncC8q1enJ7c8Ib+9IKSn815bGSpFpW+++iFM6BMhm3Fy8JEqHu0OoDph5EYA3qagB\nhjHvsvpkpAOyo+7tBeKFcg==\n-----END PRIVATE KEY-----\n",
  "client_email": "mfc-yt0mhxejhed4saro6lcgzn29jl@msgff-372514.iam.gserviceaccount.com",
  "client_id": "106930422598188907207",
  "auth_uri": "https://accounts.google.com/o/oauth2/auth",
  "token_uri": "https://oauth2.googleapis.com/token",
  "auth_provider_x509_cert_url": "https://www.googleapis.com/oauth2/v1/certs",
  "client_x509_cert_url": "https://www.googleapis.com/robot/v1/metadata/x509/mfc-yt0mhxejhed4saro6lcgzn29jl%40msgff-372514.iam.gserviceaccount.com"
}
