{
  "type": "service_account",
  "project_id": "msgff-372514",
  "private_key_id": "1819a0637c078d9b7d2cff12ed10c717c9d40cd8",
  "private_key": "-----BEGIN PRIVATE KEY-----\nMIIEvgIBADANBgkqhkiG9w0BAQEFAASCBKgwggSkAgEAAoIBAQDFblwwkL+NcevK\nn3u2FNEUavCMVzJLvdRxyRJgIzUeU8Uvop/mAm0fDzyIj4rceUZarwQoT8QY4pCb\nswk5o/3lgcS2Be3rC4fWkzt9EkdAOTlKsIPO1q1Ux1pMB0MBdqgxpubH99ZCuLMe\nByrMSS+LoB+JAbaMzv+IwtIDFwvyT9fTj9MFfX6Bh2u795Xcrta7D2Djbnjt/QFv\nSNhzTYkTYx3uLdgUUzOAp0yJw0L+bVRdgZoqtTT+X+ySRvKgGVrIss3bee/H0UjD\nJe4VcXp4ZvCWzCLsREgbXHrYtpkc1u9dNg+bmUXFCXGVXkjIiRjUMZWDsr4pn5dD\n3njvO4HvAgMBAAECggEANBMF0fF79Mzlio5CTSZ0d1Q1mm6tX3j0fgaxCBaBPjyO\nOCBG2J4vNhAIwWRLFhgOzIB5MkDH0mCAD/FLL57nqw9tWS17MZHbBGfVOwoFLRVq\n3R5txbKuCTyDvqXzsIEhn+cL3BastvCMnhD54uQy3Dsh1jtTcRRwJhxs1E/R4Nlj\nvmF5NXsKlNpzNLCu1VQtPH7FFvSNKdBRmHRc5zm9zkD2RIN1jSzuu82yKr5PCOT3\nWmjDT46gTT2RvjuYDhOBhxxO4swx3+kaNf2u8dp8AYgTLnnrnby6KEd1rW8G8isw\nijeqRx/CoKHBoQMqJ9I5wp2O9iur94oZpmEzKRX4gQKBgQDptNUTfZNNADDNy5bf\ndWudB0WCa3ntwP6bELROaKMhfY5anjyrrBkMaeneFzGmo5TlvZJUepCycizi9Q7o\ndX+pD5uip12broR6x/OKuJes8OIn2HgmEcIb0oVkqx+Bct0ZVFptOzMeLYTbiO49\n5GKb6LrqmHuadgLeGQsVFGPVjwKBgQDYQ60osfDi7Tnxzdfg0W7YqMy3963ewZJy\nNKtin9lG2yEGaGllvaRmDHSoOnZz/tkFVlQwgWd7O9B6u7yU/0YVrd4A5AiXkfRr\nLz1VXA88/JpOjjW+t5yf508xl6WKgpSHBNs2V9anEVYrM0HChDy9AOsEybTfHWlY\ngyNW6C8doQKBgGsYQsw7r1SJ0dN8iBa+aCH9Qw0Q0z7wQbwtW3LS4G5oauN7v7Gr\nm47kuhbb6hTCwWjGBlhQEh6z033tbnd34JhIXrmamHrO7kaVejUHgfnuKLS5rdVE\nLf8x6Y7IHBfl2wvQa9/CURpzIX64sPQLxGRNsdnvJjUR/x5nu3xda6JhAoGBAK02\nz1s34lMvZGi60Px9YkXgNU/n7ffrnKsial7s3u80laf3OuvFUAZ4VXtkj/lqFlKD\nCZ1sGAEJMHsNIQdJys2UW6rk+cjEmzq6NGrI+F+FhuYCWyOtFqKwdqqm5m0hF2tp\nRVaqVf+sEBM706DDn45WTOah09+cRAMjzctO3mXhAoGBAJanzq72FvmZJ8FYAhF0\ncZRuiM+UkMFp5PWKV55+FqYVQaj8ZQ673oaab9BlAWYsiAET0yCIyu/wSrFvx+Bc\nO9ls+YxmYf77AE+007S/qEaV1idP6swxZ7GyoJHQhTuH5uwH7OYAmkFSiNeW0NOa\nTbRTtPhkB6VZ1ElgPsj6uRFM\n-----END PRIVATE KEY-----\n",
  "client_email": "mfc-tq2leccqejb9-g4sgwhhnmvc1j@msgff-372514.iam.gserviceaccount.com",
  "client_id": "108549358078042173219",
  "auth_uri": "https://accounts.google.com/o/oauth2/auth",
  "token_uri": "https://oauth2.googleapis.com/token",
  "auth_provider_x509_cert_url": "https://www.googleapis.com/oauth2/v1/certs",
  "client_x509_cert_url": "https://www.googleapis.com/robot/v1/metadata/x509/mfc-tq2leccqejb9-g4sgwhhnmvc1j%40msgff-372514.iam.gserviceaccount.com"
}
