{
  "type": "service_account",
  "project_id": "msgff-372514",
  "private_key_id": "766971960a4399359e9095d5a5fa3a53274364bf",
  "private_key": "-----BEGIN PRIVATE KEY-----\nMIIEvQIBADANBgkqhkiG9w0BAQEFAASCBKcwggSjAgEAAoIBAQDE+TSA2fkX+MQs\n9sYmHRIabJ++hQ7jMQeEpOed8w72grtoA1xC6bmmQARIyIKi8oYWK6rRs6JVeQUN\n9UW9pa7O5w7eZhhnSSyyLrMKpJyiBMWdd5v6LTpXXkVQ5XH5/JgHLW5OncVwXx4T\noqIxfGJnyHtZ06BFf8fO+V98BQ7bD3PDVsVOdcmv3yK/+BBGplSDYg4bfe4nTaYv\nn3BPim32dHHDvgApLaSdOlrKs0y1xW2zQW+cBrpbNyOfzg4D3XIX9VXSpNo2AOM5\ncAaPQqqJxdAzF18Qui987+/4XszPGNCgRn2zfePPEstBblCJwEw9iGLHneHAWqzz\nA8YS7h9vAgMBAAECggEAApcZEydXcvffFGQNApMExZXnvEVtJaHPSNcKOrHs0UR0\n9cN1Y6NP9Esk25ldp9wk32BdRMuwUd2fcgNdRcwIHJjxS8XYnAcZxfzf/CVN+jzQ\n07uA/Yf3KvrBhYPqG8QCAfPBVIgrmj6sr8xVziBErA1P7U5+Oq2ol7vNaqodKcwo\nLQ+RZ8tccNUIn7RI+BSOnp/fyXQz32YTDK0Sg3ywHZpf1kCVyCdf/KKDQFGBcQmF\nA3vhhMl9mpK9WWhzX9G1/9AQxWmp2owOYOqezbjr1GYseuIIZXOj/OWA/uX5K1ba\nvUUk7GEWVQbK+uNYnJF6FtC9S+/CxV1XHyT5XQNxPQKBgQDh//fKo/0hM28uHu1B\nAi8oiLpU8HmXXRp4Ut7rTSAucE6jcxlKjaetdQuHWGKMmwCvBcRdMQZKV7MUKBV/\nXvljb1JOkbHitLVcpcnDZQfiBcyZ48WymU0DF8BqNrHbW75KxT3cHvTyZc8Gefjh\nYovOx4NF5LObWQxT8MCaLOQjswKBgQDfHtkZSODBnj+syUP5oWpNxUQYwUWRfdtn\n1itATYygnnwRamocJeZqgL0DmCj1SvFt389LHyOuiOf96PRt12Sc+myLBI4qVpzQ\nRSJ4FHRpmnV18agdP1zrUDqA7QkewhrzFXw+S2q8a4nho8sn4C3KHO1txGdB/OIR\nEydXiEonVQKBgQCeY9HbcIEYgr65+SzYcdpxMxo8K2lcPwEtMQ9Qo/YY9db3UNR5\n3ruUosJYsgYnev7Iq2cK1TAObFZymwEuCncITF3H+O5N785nxz2XtrgGnX/enrbQ\nzAYgU8Yj6n9OOIcuSfxnyD5toBKu/E8ETxei7UtAcd+60XcFYWbq5ulhZwKBgDYL\n3+TLDX55Gc1991RJsFlkVml0r6hdhz8w1ss9vbnOihkh4NAushDMXHy5Z/p7C95k\nn27//QGzMhcETekpirqnwpEuKk3BKz0b8gyKT+SgwKEwR1vGVHi/t1wxjsr/k82c\nP7tLQ3Ce0AhzR6vCFvVlanHzaFvIqO4f6KDAZ839AoGAKgXsQo2m8r9VuP01rMCo\nbmV6UwzcP3NBaYClZ9gOJGT5NXeQRf4ssTarbmhZQ5AbS5skGZ9pj59NCmIKOr21\nZCpQxOANBZRsaeovqlW84aDJSXzyr4F/MQcqgW2nRD8CYQMj4h2Qz/mirfCZYEJ0\nwKLDaWeTqisfhZItJS0HL9Q=\n-----END PRIVATE KEY-----\n",
  "client_email": "mfc-emv9x3r0c3wy4hsgiizu5-1nhb@msgff-372514.iam.gserviceaccount.com",
  "client_id": "105547639458792064633",
  "auth_uri": "https://accounts.google.com/o/oauth2/auth",
  "token_uri": "https://oauth2.googleapis.com/token",
  "auth_provider_x509_cert_url": "https://www.googleapis.com/oauth2/v1/certs",
  "client_x509_cert_url": "https://www.googleapis.com/robot/v1/metadata/x509/mfc-emv9x3r0c3wy4hsgiizu5-1nhb%40msgff-372514.iam.gserviceaccount.com"
}
