{
  "type": "service_account",
  "project_id": "msgff-372514",
  "private_key_id": "7c22336c3c88707050aa718af8689ac8fc826cc4",
  "private_key": "-----BEGIN PRIVATE KEY-----\nMIIEvQIBADANBgkqhkiG9w0BAQEFAASCBKcwggSjAgEAAoIBAQCfTPJJLXSzhndA\nNpTt+bvPM9e6BrKiJi/kKTuSovmVUt85AVq2bhD4T+5r21wliYHrpaOV4cJqNMgO\nXrAZNxFVFxXk6r2WChvCgrfx1t1T85xJWWENQkbYIVBs4ykyOuaxgWYiVqKqiboT\nOK7XDpui57xpI0rTHlaBzwNRhl2SaZH5+0SEljO/HwAgXCKtWxf4rmtW+uIsy069\nQR7qzeNLkuYO79LmD09JgeGjWQJ6FptdYD3LBw8y17zV3Ioqpmx81ei9vKx9agaU\nm0zW4nE+KRxcPsIFUcLllFyLR/mLe3V767eY+2ZEvOj4B4uXbJodNx6XW9L0x1oe\nyT/WymxjAgMBAAECggEAO09qS+2VLDwtzSYlR/85ujkqojPZMX73SMNDT2LHex26\nR56l+BM91T3pXpXzFnS+fw6SO/0spd9V9uexOAolNWGdgLgXczP7Ru3lb7DYgefL\nMhIJjOa2usSYjZn8HhwJBWDQtos8EDOsKHjru91P/BS8tQZzVuxOOBFrwmA9GYQG\n7rpsXkxNoliQlFlJv/VSX/qr6VpAlHfapYW/tIrqK4bun/lKeLW1bOM+EInOTHa/\nmhLPD0SuJkC47Mw5RjEigjC9i+EEGi1cUReJeGJIO+//OOODVXD4I2GUH8SthFlH\ne3417P9r6szfN8ooIaSFc98HlRSNV6z50wjAzYHFbQKBgQDb3ZrhV6d6T/thB3l7\nPeVoZISPdt1AbIpOMQ/Qhw8Jrs56YSIxjV0cEUXC5E0JnfkP2KhydM6VX8IuoSQm\nsbt2UzKq887AFOcO1CnmTo6Gs3NmDpqjigGr2Uz9BIrTskcCHzSeGOOfKSPEH5Xs\n+l4+PkucJbUwd6+bZaqQMEZ1pwKBgQC5ezDFM4uwkTKwLFU59VTlacbp8x1ClbCz\nGvKPEozCzzxpTF5mJc4EYQOOIe0U0oPeZ2JoN3pNDBITXsY0igJzPBWiR/2Lryw+\nj1lfxtriTGMpoh3skC1szBrPYPXyQXugmVrGRLZLyueFaeKBMSNUn0nlyaMgR8ga\ndiKwvSUi5QKBgFLdRo4/dwOGOXvsUUC9p0Sc/ckER4cMYWPu4cL55BUGKRO+oCCE\n4t69M8msOcyyGTh7s6DPnTx3BryERxe+TKTf3mzHztheCGdyVwhR+y2RXKDOSEHy\ntYaLM5T4rUn0GwcVs8MSJlfKLYyxStQx2GslF2IWZB+MPEcZHhuR1jxpAoGAaud6\n855C/BCkA3B56r7hIJz33e2WxsLaJlD4zselQ78IFbTDj+JoPJPh5bDeIas4AB7c\nVC7tmazEWk+8s5l70gkmevM9Sp47RQ+ANri5fccDPILI9oke9V8qcK508x0U8TqS\nXEZMP6ECEh42Q7obn/FzOTMfh0J4LfA7DFzoI5UCgYEAh8Mfsdy9k/FuF81g62I6\nGk07XzwviRtMypTatiGjLAtHhaXSXgcG9/fBgACCzap290nzqcyZEs9FRH0Cu1Dm\nMovVknlEnHn3IWgvz8PCX80fuuTL6kfK+ZD1JbqCrQze7sQ7BHTIDoYH0oFFpjZH\nvBvgs/3Dcwhl1cMHqzOO5GI=\n-----END PRIVATE KEY-----\n",
  "client_email": "mfc-ve0yzf7twm8szauull4xing8cj@msgff-372514.iam.gserviceaccount.com",
  "client_id": "117388343697059106213",
  "auth_uri": "https://accounts.google.com/o/oauth2/auth",
  "token_uri": "https://oauth2.googleapis.com/token",
  "auth_provider_x509_cert_url": "https://www.googleapis.com/oauth2/v1/certs",
  "client_x509_cert_url": "https://www.googleapis.com/robot/v1/metadata/x509/mfc-ve0yzf7twm8szauull4xing8cj%40msgff-372514.iam.gserviceaccount.com"
}
