{
  "type": "service_account",
  "project_id": "msgff-372514",
  "private_key_id": "27133184ca389ee59286d9c2bf5a45e5837dd5be",
  "private_key": "-----BEGIN PRIVATE KEY-----\nMIIEvQIBADANBgkqhkiG9w0BAQEFAASCBKcwggSjAgEAAoIBAQDJ9gW+oPGDAC06\nOyeXlmRvw4PFvbuNdLcINgJmy25oeb/Jzwhf0tn5V0zrmdWkzawz4Dhus8F24omQ\nb5NXzVMGiuUed2r3LEALtC7Yefmv/rHDrmZmxi33vdb2vhXQSvVnYv0JtxfRNkfl\nFMmkErQ10VWj/Gnn7MLedVFdohxOopEBiL6o/tR/ebfPec+BaB9EyuMwe6KIomVp\nis9k9QUTT1dWcM4X7VSwHXbWpDex+2WNxD7kaiY0vqrIcaXywy55rHlyXNdV41+M\nUVsz2bGR+FPO/gM+CVLcKPCygkW/TUSru6Wx9cTo6jfuPG7TZbCEXuKW2oNfB86W\n8tiWCrr3AgMBAAECggEABI0z4fD0oHQvkMFmigcMqmwomxtEj9KSkW/OLAznpxkf\nVmgBE0/IM9Ng22pzIyyzddPW0b/hW1GNsiChnHf3KA2XTlF4qqtnohvkdmKBWxMN\nZJCYpDZRMOUpZBQyn6gg0bysYTysH73ubt5CER2OzCu0l2aH6H8wgRz5wXd21drP\nxa+Xyq5EqrwTIK6dfRQ5YriwZjBGuPfrJ/n5/+1O9S2oy6FLvrkEvMmTMo0xhXV1\nT+NE7dHmfaZsYb+pedD7ipOTPnBc1iLRjZM2ZHtRxggyjmDs4lRa2eyiIuvLzS0q\nlsPPdugz2en3E+E1ahTTRWu9rQZ56DIE72sFwshOAQKBgQD8cgHAjmAkNoXaP902\ntTHySEftjb3B/Ha8IUtTEYb0YfnIpcF76d0j6VaEDo6XlC4y7PbcfecW0/e2wWGm\nN4dvOnSMpkLtkV0LVAt0i608TTe+n7CSNObpjaENper7XaiyIi7VJywR6Iom1ija\nu6RUIdriPlQxPiQ7naUTAcdD9wKBgQDMzgi6zoUmUX2CQt+kz2GZfy9lc3r9Ruct\nM0Cz+s7M1qpRSIBI/ZLMG9NBy6gSZbwUECYofqI0X8CI4iMGlNlpAgPJFwunH+0q\nCKZGYowWvvNwKrZuN+P7t6eYQBR6kgGD0RBT+I9UsV8HPc/B+TVtU/RMecbPJvfU\nloQqJByBAQKBgERIlj6+hDTnZpddVPnaUzNE5+fSwjQ5lOhYXSaQBCAQbF8grtBU\nttNi51r7EQjhNQnjXPbRO3PKTCPr9Pzf4kts1V/CDTJzcmaBCkQxD9/SxzRRv5Ic\nqyUbgSfO7FunvtzIMEDJwrrpWo0cuppHzTBQpAM0dtOHCofxoVgd0AeLAoGAfw0R\nvVGAqFTFV5nEw6kjEuYjsPwCwDzMDO5OpVhiEhDZd7NSYfVsq9JXK+n7Se5yzr91\n7Ikidvsvpbsjn2GXvdzSHF1/jR3xMrJK9D8OSM4MlvjoU1e4xt8XyQt3qNIKvotj\nZbQ8tn2SRhvCVsMSsc/zLb4d50R1WhxFwR7F0AECgYEAyvDPyyHPwXhG+BqbVHWa\nfsJLa53DhvWxkYNVaodzbOf1uxHcpwr/aAd2fBaYnHXJOoy3UlB17Qxbh/VW9hT4\nUJh4JTVgZVKsOi9UJjFoYf8Ayk2DqTiBdZAGqBnxDJeFAmXCM8hJ2QlX/m4Yog+l\nqSjHalTq7MmB/E1qvBUD8+o=\n-----END PRIVATE KEY-----\n",
  "client_email": "mfc-9xaz67d8v8pxufx57togg6ctuy@msgff-372514.iam.gserviceaccount.com",
  "client_id": "102805274321410283161",
  "auth_uri": "https://accounts.google.com/o/oauth2/auth",
  "token_uri": "https://oauth2.googleapis.com/token",
  "auth_provider_x509_cert_url": "https://www.googleapis.com/oauth2/v1/certs",
  "client_x509_cert_url": "https://www.googleapis.com/robot/v1/metadata/x509/mfc-9xaz67d8v8pxufx57togg6ctuy%40msgff-372514.iam.gserviceaccount.com"
}
