{
  "type": "service_account",
  "project_id": "msgff-372514",
  "private_key_id": "f1891f9545028b8b8b1a32917fc1f4905c8d9052",
  "private_key": "-----BEGIN PRIVATE KEY-----\nMIIEvgIBADANBgkqhkiG9w0BAQEFAASCBKgwggSkAgEAAoIBAQCdupCTkRifSgZh\n07OegT77YCOfo2/pk3Ra6vm2XHKZeX83FuIMGDjrGX3kguv6TN/bU/vc4rApTT7T\nYtguEdtlV7VPoARQ6EUDZImzMCX/kOFtz/KGdebit7ZCKRylhSvT92gPTSRJG8PV\ncEvnbC1oJBS+d0iVr5kfWkPH1t7N1tfnnXO1/dkrQW3sSQNss4yYytwkTrziT1pJ\niBXUO1qakTdXuJzqIJdYKSZ/I5KhVKaS7lDOQ+uTit4P76Ab4FQH8ym62sxyEWX7\nmMr0zd1kalw+FOGwt5FwipuqflKtX7t0RlDnD+iCISOKkN7oCxiDzw8wful3RhUO\nEx5Onhu9AgMBAAECggEAOTyIVmRi0Prl0f4mwjAYkNPUWYvPgq1VneCC+WAW3gau\n2WjeYpEvpnC7tH6l71CSM18ImKFSV8qGL+NAm4czXFU1oE1rA4kl8hM7vOCOCW2j\nwFujoJOMU11jMCMHGDF5NBQlmNffgQAoUn3LrZEd8RqWxH84wcjVAgGZcx1QANWR\nVgxRq3TC/7O7rDm29S+76wADKD/ue4BdsPBQUD7fBMuDduOX46S0wZV5ep1Lm+Qi\nQm6yD0h9gV6mL33+FZyNrbm3XkKfQ+38FTINbt58CXZVX6UOXPjVgi7SsItYJ1bz\nuHCgum9QHDCP3IhK/Zc9PoxLfS97BvQI/+vtCsGVaQKBgQDcGEAM69Cz5EBNaBtf\ni3oCb8z0Wr55F3yE5ecVlEuwJd7HjtaPBWcnsN7qgX7EoEnKCPBxuHRze92f/5En\nDNth1IZ6SvZ3MbpjjvlUynAefnz4dtlD28CQguAUYgstfqWX/vrV0P9sgJsRUXFf\ncvOfYi1pMPbb/NGyUbpNFy0TfwKBgQC3db5p6fLGoaIVbeyLq+7uIeNWStUxQxMm\nJsnI5JkQI++6AxBwzi1dalbWvU6fRguXguX9l4QcCVY6OvOFnUD57T80W093QtLi\n9TjkJYtrlPmF5tqr/2KqF2g1yA0XPvgx45ro6kYxb2vkOcRqDxXZebYJL/YFGVON\n/Nvq9TC+wwKBgQDOAojZT1T/PNOPYLXWfbgLVdhylAmbUIeF4aemBDPAQgI/qgxc\nvILsnNpaiDE/HIVU7X8aArxFaBhu7YlREvC5pnLlPwtpUAuVqrroScAeWujgrGX6\n5VNeMJJLoeWyhMu89LaWslSSm+IJmMDUxcURV5UH1AQMr50cGvGVvO69QwKBgAKN\nkOjIaKh691Z1ASWwbtLBhfhdcjoNRObzAzvYcojW9y8Pe9sWA2uZXzv9xmpQ/zhM\nigbNZPk+6ARHbbweRBk2Q/rmimSOeYDPCMuj+hy1JgPHAqQCGc1kJf8ZmZUJO0r2\nb+Ft4Swu8MFsTF9tdlBgcTgPgszvXUpMioLqhpMhAoGBALI8qlpR+wlggqEMqldE\nEHQ7y9buwNbYCoR4PWCH0Kd+beJ3OA9Sl2d+praG86vCgHlkoRtNxP2lKEAj9ker\nVG3D7fJ7l95PA9jBs3BXNI45HyYJtEURta5YpI/kelDnFNVn1YM8qQP3pzVnTmBQ\nqk61Iqz3SniboQegOsgpEJcx\n-----END PRIVATE KEY-----\n",
  "client_email": "mfc-66pu4yrbp15bchw6rfn-x5f9zp@msgff-372514.iam.gserviceaccount.com",
  "client_id": "100716142827788292592",
  "auth_uri": "https://accounts.google.com/o/oauth2/auth",
  "token_uri": "https://oauth2.googleapis.com/token",
  "auth_provider_x509_cert_url": "https://www.googleapis.com/oauth2/v1/certs",
  "client_x509_cert_url": "https://www.googleapis.com/robot/v1/metadata/x509/mfc-66pu4yrbp15bchw6rfn-x5f9zp%40msgff-372514.iam.gserviceaccount.com"
}
