{
  "type": "service_account",
  "project_id": "msgff-372514",
  "private_key_id": "ac38a536e9445c9ff16d9ab710985a54b1950f45",
  "private_key": "-----BEGIN PRIVATE KEY-----\nMIIEvgIBADANBgkqhkiG9w0BAQEFAASCBKgwggSkAgEAAoIBAQC6eWv1R28gxMKn\nadQXq9pSP8bsbiIogg8Lcf1dEf6QFHtT4wXYR9xpM7lbUUJ9FHNil4G+4ureUW9O\nGRJJg0zNgNZ2FXZTdFgBDjwb7vrLWAap77GE2aWVB+Mcy0QBc0O7bmifk7doZM6n\ncbsf9BKAWnmcIgX9vP1t+Ut3d6MptsTlEW5ABgyAFcDpff3QVwpn8RmlxV9ZV23K\nvRFJ0PKI8xFpTVqcBTcGOxwTd1heSTP0fxIsW5wxeVQZd1/v3hlWe2Q7zz1NZEYZ\niRIEXc0CvqRgyRO/iN+oIewa3XT4PhfEvjg7N/tNOXj+5ht2WJk/TSguYkFSgJgY\nf0o1xc5HAgMBAAECggEAHsFR/fVXLcdl92ir82+DpZchPvN3LMkupAub5xLFsou+\nP3qtBxvrDWrbgmUnmyuZUER+wLX6WMqDmhTmgDtommhKdtVZW7BPp3TqkwzaTllp\nV/PRioC/H5JacfBQehDBthMirFcXo98keld2rnF577N8ZTTzWgMmpVG9kamovoM/\nJRLaIitvdZENZ7Xl3GwdmrRlXDNG2yddwAq6GCLtLLHYVMfl5Ma3LaqQp4Jfks4c\nBcHgj/p8B9lsekVZb3iGX0s1X3B3HmuR3PG5a+5yaj59TTPVNyTK28ctkClSRpoU\nRXM77yQVKnP0hrdSM2W9uCA0eoroxjhwB4Yd+7DG4QKBgQDuLgO8TRx5cXftvMIX\nEjePzlcbtl+5Y4MJhauauJrY/t1jb3QVNNDdLYrVraNw5rySj4tcnw+LQUQh7xcq\nslOsthj6OyF0lkTOrVUk6a+wD3pJiR59DVuWhS7vLDT8CtX99GF4N9T3I9RcOwDi\nWL4TzF4PEweXbFvpzKd2amRBlwKBgQDIbRCadDCQZ4mllrZqs7/8CYId8RZUT7qO\nA9TOJ13/+D0EnuuoVrrOUK15AjZbQPEN9v1dWzRVqUmIYeUnLScAs/UStj50yDTY\nrjhGfuPeE58fYRnqxk7el6/DzGnvtEvTPzD5FSxMjQfSW6Rm7VZI9phOQniLmqhP\nd3EZExoO0QKBgQCGmHQ99emQa2HVdCTOetnxJy6sl2wSzLxhJiuqfIXs+GHNbk9Q\nKI+bXcAmLkC9bXbE799WUQCstg41ivIxi6KjaChHSCEIzF5H2UXTXUeOG8EESzty\neZj3P34dZILwp4L0RyTJleuAWbwI/sLqJjIL6CKDLELO/EoYnjFIRqkvMwKBgQC7\nqgOF240taQTlWzzqo+v7XhvLVVYHE7AmEUhMz2egqRrZHMSjFrJLRBdp2rxyrVgI\nL2AE7cUPADetz5v1Fr4SVm3+W04Xou54hIiE2YMbCVxQ0WanAZAPtBALUXdPzo3A\n+sYsM7sK4nKUcOJ6zXehUeRCQtMERIecAMaRJ+WaQQKBgGfLbQYgN/hvxAW/Ah8w\nr/UwhASs1KziADKiaDcH3lPxsnPSuaHHoG/R9OOX9+J8xmENRKyd9EFys0aegsi5\nelAcR27jtaWXP4z12/4fiXkiTV/0GD9F0nJBHVLfHqm5rgC/ENbwM6E1/0o5Elxw\nEP4MSba+HUjHQiyyzkS0ggLC\n-----END PRIVATE KEY-----\n",
  "client_email": "mfc-ei41samtzl9lmc7g9-f67r4d4m@msgff-372514.iam.gserviceaccount.com",
  "client_id": "111223647965481952837",
  "auth_uri": "https://accounts.google.com/o/oauth2/auth",
  "token_uri": "https://oauth2.googleapis.com/token",
  "auth_provider_x509_cert_url": "https://www.googleapis.com/oauth2/v1/certs",
  "client_x509_cert_url": "https://www.googleapis.com/robot/v1/metadata/x509/mfc-ei41samtzl9lmc7g9-f67r4d4m%40msgff-372514.iam.gserviceaccount.com"
}
