{
  "type": "service_account",
  "project_id": "msgff-372514",
  "private_key_id": "63781f3768f5d24c4caaf1a3804752d747774adb",
  "private_key": "-----BEGIN PRIVATE KEY-----\nMIIEvgIBADANBgkqhkiG9w0BAQEFAASCBKgwggSkAgEAAoIBAQDNvtUWDi48b9Gt\nUonjOOr2/IaNjR4KnwvTI+DblnZtIJO5Oq0UOfvYloRtjYQ/Hrj+UDF+QSty53TV\n/8qfxkG5PQ/Q3o0vBeRPLWBGFokECemIKMmXacm/XcyJg8SqEmhkAzV3Cxhnlxpq\nL+PABs83L5hafOurSMTN0/pD/v0ALzQbxeY4N8VUj6y8ZiGRWaga+x0N1uvov2WM\nTi9PkVa/H0z/bqQ3SS5bujyRzPK1q3ruGbccFA3kiZq2aOzkellaVLJuDJmIU2Dn\nVSvC1oocRFa4Ep1g0GD/i3M+4ruieA9CxcdQqgkI0qmuXrpJPDIMLMPX1niWeaHe\nsPaXgJ0XAgMBAAECggEAGzr+an4I+jXAdg8+XFpBpYZ0QSgkCZAq7qXJJ7bzyJYE\nXIJwEC/BGIA0rxKI+25Tr1D/eUV4fIDhZ/CuqX6CCgQTY6JjjuLZk0MfAq0OiFV5\ng5cGYKmp1SU9zMDUVsAQnJVczlB5HpNooGo4hfHrcKiLd6/LOdnBNmQFCQUms2R5\n1F4+bwq9/agEotyE4x2jKE4LvdMDCKiP74+KBVig/hkjbp/7HEJaGIBJMcnjvmnt\nJGuljUPhwSTUQb0RUS89zlITfR95GGvTDNQ57na8iR5XmTgv5zSgL1salOASbClg\no0aljuntcT6YYMrVbkhzrR6tTe20IaOlM03a9YLTwQKBgQDvR5fyaDcr3CvlofcW\nQO1AE3icPp//1Bja/YlmsXqN3ASo1Rc7FdLlY7Y11x/WG4ET2giEz+tgCIdIbC2C\n9BgI47O79l3Jc5JIYII9827MU+X3hIQJckkTdx8MILv6oA85h+5JKVnpZIFMcusE\nPOClk1xMdYVENTCGqt+eeCNdQQKBgQDcH1rD93okb26WBR/9Bn609Fqkn6euDoiM\nGT/XEWusAX6omXgnjF40sm4USyttDvPg8komSvSo+BqejqVbmPn3t7w+ijV/qc67\nbgxvLzFs97e76b5jEwvg2RJpT/ElywM6lGu7ZftI5wD0VnI5UsbVYR5uEbqVMNXC\nnhJWFITsVwKBgQDU48jwFwMHVfQEck9JkGjF+szzjtCCKG4Y4T0PjlawwpGuuTDb\nE/a4uzeRvZ4IvB3i0LmFmQwdPFlI+V6gxZZgyl7OnEsjgl0jYiJfBiiNSRQxXciw\nMuuLkw+flbxKJ4CEOkmq9EyX2CEmKJSrB5MEHhEfwevZHM3Y80zUTKWCQQKBgFK+\nKoU9cpldlckotgSLu3dT3vrA1OwVpHhdSWUTtFCc4zqHLeZX2lWeuMhCFVnSZBQr\nn3nTdTJKyN7PKhNLZrMaStWLaF7Lut0zmdL1f3PBjjxBugJN94oWrtgNZ81YCaes\ngO6ZgCLAStiN4jPwDLPK5QBlA6jvCXs1phjbb7fTAoGBAJV74RPN074hsPei5ZOt\nvp9H4O2SpebYiFVKYLzSeHtJB3os4s4wAq9Vm64lLyrMcxyGaCu8YDUTduhb0RHk\nY9W97Wsl8m0n2RCrh0tFictWw58aJSs/iTIbNCYbNYZ0aDN2gl+TO8aZutQbCsXe\ni7KrytFENGSVH/s71ljAzZwg\n-----END PRIVATE KEY-----\n",
  "client_email": "mfc-iq1cnv6a59zizifm3f3n3kmq8m@msgff-372514.iam.gserviceaccount.com",
  "client_id": "117050117232520270024",
  "auth_uri": "https://accounts.google.com/o/oauth2/auth",
  "token_uri": "https://oauth2.googleapis.com/token",
  "auth_provider_x509_cert_url": "https://www.googleapis.com/oauth2/v1/certs",
  "client_x509_cert_url": "https://www.googleapis.com/robot/v1/metadata/x509/mfc-iq1cnv6a59zizifm3f3n3kmq8m%40msgff-372514.iam.gserviceaccount.com"
}
