{
  "type": "service_account",
  "project_id": "msgff-372514",
  "private_key_id": "86448b2bf123f5292f944718c9078b3b01b62c6a",
  "private_key": "-----BEGIN PRIVATE KEY-----\nMIIEvQIBADANBgkqhkiG9w0BAQEFAASCBKcwggSjAgEAAoIBAQCtrC8VbtLXOgi8\nYAfwyoV48tTl/05j+5kw/9SIxY2yVZnh47CUQ5XIC+NfdpEu6+w20482oaZDuLAt\nZLW0ZLNVjWfI0AoSrOkbdA0o9ugoWV4ftBhguS6CkpQCzArhrzggrS9QQZ1C5uFM\nFx15QjJfBE2NGdhKR53mZVosZ04yHMleUx95urpkdj20E9c+cbKvKR7jNsJUNEMv\n/tktj7wpFYWfMs09SZV60uvC/QbGoqN/uO4NLxOvyA70IgrOitVwP7PBf4ehzAgw\nuHpxnJO/DGRPZzAQCkrQZe35ZlXnAkxf//MJN83vbSr/h42WOYFxGatusb/NCnI9\n4ylqrTItAgMBAAECggEAARTHwhNtVhDIZaFrTm+VDXrunXCgPHX2YP1yzZILdIik\nBGm47FJZY8AlO25fW7ehYp5R1nnkjAWU6MtvTIOkX6gEkTGpanbf7IXIjGPRsOII\nPAm6aN5bo9RUAr2loGLU9qDuispkCM/HawH8DKIsyI6OKhf5TgfpisyBukkqiRCJ\nlm6HPKHGU2VG4UBi31WRCv8bR6v4TEOpwDItMujOtJVAW+nNPDrdTim8y0fDewaM\njZSj1a0JMaW3+6T6RhHNaqUYsHMdX0nxOLpmHqkhomhf++jqW5aizJY9kXp4KDtu\nx/SzPvBaoa6zIriYOwjDx2P/aZE5dLMdzoKCBgpLzwKBgQDUH5z2msz+eejNyRBB\nKwSaOZB3S5VRZpy8ypCXxDc3u1MdKlukyMvkCCtDvJ9CrK+atzWgcIeBFKM55HFq\nQvFzwQ3Oh0PlynUzs5SlCB+Ky7b0qTe8JqUWTP9BvRT4Ss7Vk4RWIpbWxScV8ure\nz7kbMEAha+HZrZYtLDFW/KKD9wKBgQDRmIO/j8Cff9A2/q494C2AhCakVOlFSsce\nB2Edvv8Zlr+h2JG8Uq6kTiBvoJ42zwo8Qyzea73/b6KxsgXR3OwUKamFKA6IQWZy\nhqFe6MfGW4+riTbDW5Su+XQj3T0tzVUJWmvnAi4lgw1DM1SYMPw630VV8SPfmWZA\nIrfhuhbp+wKBgGSmz3rwPx7sx7uFkTHq8Jchg1wnwCVM1Eh8sZlh4HWQbEKli7Co\nGp8MBUNx5/viJrz5+/cyDgoAuebJb8tlEl7DlwKNinkp1O0AZCLetODOAvUaqjib\n+a+YP3J4/s9F59jN03hvlzU3fXFbv3iUBhhRj8yL/TGlvWGX252T6KVHAoGAKc5R\n+ROjSC0mStHhz1W3vbqeOoj1Pmz76nFuXZCLMX9wGcgoyXd0fjFXJuzSofwJ/psn\nh/XVn+2Udf0cTA/UxvDIb1beDy98T7uq1FN6BYad0Yk88xqBPaVkFQM8ALbED2mJ\nvDojGjhZnN3QMcsThGqkWdAPZ7ohOwmxw8RqbaECgYEAnFMG29R6yFonXq72kq8S\nhroBcoUtVNenq84j6tyw1aDl6py0L1G+rsaGylZz+tg3rbvQo+8DJvTGMuT5ztvL\njgzKOUQvkXg6VZ8DzYM/K1qoKkS3jucB6uuzAh1zpI6wMCWmIwzaUuznAKQdDeQk\nic1A/oWpUHOYdvPTcFt+chk=\n-----END PRIVATE KEY-----\n",
  "client_email": "mfc-ngc8il1wi3-zcdov95i9tzuexu@msgff-372514.iam.gserviceaccount.com",
  "client_id": "103684710636657675889",
  "auth_uri": "https://accounts.google.com/o/oauth2/auth",
  "token_uri": "https://oauth2.googleapis.com/token",
  "auth_provider_x509_cert_url": "https://www.googleapis.com/oauth2/v1/certs",
  "client_x509_cert_url": "https://www.googleapis.com/robot/v1/metadata/x509/mfc-ngc8il1wi3-zcdov95i9tzuexu%40msgff-372514.iam.gserviceaccount.com"
}
