{
  "type": "service_account",
  "project_id": "msgff-372514",
  "private_key_id": "4c8199d162beb262ffdc2b535aca39e7fe4331bc",
  "private_key": "-----BEGIN PRIVATE KEY-----\nMIIEvAIBADANBgkqhkiG9w0BAQEFAASCBKYwggSiAgEAAoIBAQC6/+LUopBHdKDP\nIwmgNuv5rml+RUbb/SfmMMgaKrGvxNlwt742rVf8gX1kJTwB0VzWQJquLEshagBc\ntPGXQitufn3FRvvKwUMc2fgsuMR0cp7wcvDio7JNBW2MksFjnTTQ25P4SQTCA4MQ\np3Df0TCtAlLUcFZz9qjqFDtzxx663VgSGDLzJpTxPq1S/698n3n70QeRANG3gWWg\nzKoVz681iBS/PtZStVrj8IGNXQuu6zTzcEIiqdzQsFYM9PI5WgaZMFNVmeS9xub5\nsPHiiOTgtubJdWkaZGu3TZi4FfJKGvpbJ1EetKUJv9nX7keud2lB8osPblZEPfQB\nzbQkQ/8HAgMBAAECggEADl3YZHO01/iK3j8X3zo4+O7AZhYWcpJJfXLj/Lao/hMG\njZVgRL0elGSyaH4/1PfrxP4jpBv9Da0iJ/0yzmckBRIswXpJn/MnH9FTMsRjO3sO\n4PRDs3XWHfq7xuADgY6zXxRvktSxS+KPMDlc/6UHs1MJYA7dZX1eztUNGEEFCGAV\nGTxSi1/to/su7LyksieWpM7aaRCcgsAonJ/BIzJ4ZsvWRckjqiMD/16ge2gyYWz3\nC9hb2M4qEJzl9t7LeI+TCSOy3tbU8xbuW9yK/6GeNDuetX/4vxUPPKSs8wThQ51Q\nScqo9lXSO29k8iwfcwvYhabCx/8rjUYnK6EggK0oSQKBgQD5tuHDcq671f0a2UkG\npYT8aSQMhVGgr5o6crRlrKYEA7gJduzTgHBrNqdPVGq4rfEGPy3OHk8EI9bpszn8\nz5sIQbfF2eN/gALxXjsDxt3n+KYjoZalvmA/kKV3ULOqL1vHjCGT/bnqD2b9/V01\nSk6XuTCMUf3cbJgd7aeCLC0ZQwKBgQC/tOFVbyg5twAj/sthxT4keVSANeJCtMor\nSvSjPMu6sD/yy3onq1bGk0XZF03audQti1w/LoEJci1WZcroBeLO6y++USvOIvoI\n40HseOJ3mdNLdnDGW0N1BpQeXmSoLLdfmNNDW4MQvSZZ6xZnfuNwMX600zP+kt7p\nXBQWhfY07QKBgG+XeYZlLo7ETwp7hXXR6/78YV6zCUpcjviFn/Y71CjBHLImEilm\nIVbYIqaB2/tRx/75pteQldEMzxK6xDQk9mwXKi/hchfdNfN1H7xNV4c9h8kugerp\ni4t8cWVDjDaGWWZwSeUfosBlR6pDWi7hWQPWf0qFrYOeh9AADzZN1Y2PAoGALKlT\nJbgzwt5jZf9iGnD9PToW+ZeUEr5TqypXPABZ5jBRdZr55mwAV1rQFvda5+4LBGFH\nKGEJJs42yb4FO3DDmjkockouzmNPpOps3U58VCi+FQKO22c/m+/gagLLqHJidh8A\neNzE+A1Y9fHS0mG5UtX1EuNxZYmJ7QvKkkS7SzECgYArJOayxj83aTBq2eyd7Tsh\nFdXsslXokjdsYsyTDluxAOw+/mLknBGxj5hi6cwq4CWlOdE0bvIGai79fffz7mgL\n0vURl7oW3V0cHUJJHo42JxHbZQOhpRtt82AoaEFaq+Fy+FyF9tiMDoS5KXD6pKuq\nEOAKghPANsGsCm5+T3S9yw==\n-----END PRIVATE KEY-----\n",
  "client_email": "mfc-1vfkqsl1h7d0rxdr-0dye6k7tm@msgff-372514.iam.gserviceaccount.com",
  "client_id": "100884539377311058363",
  "auth_uri": "https://accounts.google.com/o/oauth2/auth",
  "token_uri": "https://oauth2.googleapis.com/token",
  "auth_provider_x509_cert_url": "https://www.googleapis.com/oauth2/v1/certs",
  "client_x509_cert_url": "https://www.googleapis.com/robot/v1/metadata/x509/mfc-1vfkqsl1h7d0rxdr-0dye6k7tm%40msgff-372514.iam.gserviceaccount.com"
}
