{
  "type": "service_account",
  "project_id": "msgff-372514",
  "private_key_id": "726ccc6d9b2408264609fee6a5b056944df34ce8",
  "private_key": "-----BEGIN PRIVATE KEY-----\nMIIEvgIBADANBgkqhkiG9w0BAQEFAASCBKgwggSkAgEAAoIBAQC4O7k804uSQiv8\nC79kJ8UfQGBIGu0iNDu40w0t4JnMR0P5azE0HprNe9PTiSH3x1mPLK9V8JVAcL8X\n7G+BBVBp/qUiJas0IqUFz0roY2QcSrvjVj0kf/4AdxmOj4oMbZQEmHLJzQVX0lAg\nH4vjyNZjOnAiy/mx+YNIAT0WRJr4g8J8CvU1M0VfDdijrwR1dkmhr9TeqJ6MQuiG\nrF+R5YG2lIpaKbVgwz2cGvqyKqnCaUQdkWQSTNMJD75NbYpoikR4cZ0KFLHc6Mz7\nZR+n091rXgfrlvd2KA4/kas+6SNbjsLlaIUiE1Fp2UC1naoE4xya9dQeoaeZL1vJ\nEdz/xe1hAgMBAAECggEAAJbntyH0TNTi6K4o8TndgPvw0uyzIYn2egh0En7kF7Oy\nDpkq5XF82yiwRPl2lUiHZA+TxZSfVGaH84i4v4kWgnjtV0Iq+yTM7SP8gEtjlE4O\ncuvrQYxVcgeNEJ0XuuhLxbdgYvSaXSh+pl4fx7EbvUSd1HdJsHiNmZicV20hE6e1\no1ukpEUUlF9DSf0qpXLe5DJf2HUdVYu+tN8PrQSDVTj81e2/TaVWZ3SMTIOKjE9U\nB/UyaJBCi3mn3Ps3eDsxtFZHK+ARBGFiIAaE3sWRqrBPUFDmqvEZlpeS0F0YLvFI\nnc1x3rUqtc39XrDVyCAN2ct7YRO0bjM8H/BYqoxxeQKBgQD3q7FuNYuMwxx2TcDs\nM8tKmvcTuWHGOmJg+Tv6DmTLbSfOmYg7jPtIQiiWNAyqc3hNhs9krKOE2QijZBib\nsK6q7C8EfycbZVZr+Pr+1gU7UQ4X1J0vrA/I2VV29Oy21qdKVEsS1pJxcjeTF+zi\n1/SLzUpfzEYqxkScZNsD5k1NnwKBgQC+bd6xXVdsdXG0MzC/Or6thgWFh6ZTGYcx\nt5tNkGtvnP1I0HKE5ff6xPgjtniLmsi6m0TWXnWdxXnrjdv9Gmea3xxRK+HK4xR8\nNsgSeM6pTQ1yPKdAwAxaz6/gONF/EXtC1rjMc17WtHntxXI4YtlfBwS9E83oj7XC\n14ZPFdzk/wKBgQCRo4rgrefzzEAOaUaLHyHqKxojpR2TvX1gXO8h6hjnbra7zJjJ\nu+t/4DeRq+XOzbvuitml78bwNdfYjOHTm5/6rowvbr4GZB7fuzeNZzkIWm+ZH9OW\n1u0pRHP3UatpEOyqzsqet0LCJ1H601TfR/Jryzpy/uI8AP8ToFMSBflrLQKBgAw1\nqzOgEnznwtSU+6knMRabIzt+iRGG734mkZSVj+3mGO9UPiN7Qz0W5/oSNwRsdjZQ\nwkckY1IsWTbbL6G40a/CYmRp9d42VRfpw0Y77LQ6NoR+kxK5vZENA+/SdMw66LZO\nYibptsj5ZV/zavFmlR1cq9cbr/YbUMIfY4MqmbEtAoGBANj12qPEDYkCHOLuGWVi\ncCUaoFCEF4Q0XbLtAE0IXswefu3jB79AGKsLKiH5mKh/hJdbG/55A/qBHDosgFMf\nO/hqRun1NP5cmgTA5eHNisuGwCQQkFyN+lq0q748f2D8kFIlPMRs2bGNPzkozgD+\ndemOOuyLai17saLMIdQmoeNn\n-----END PRIVATE KEY-----\n",
  "client_email": "mfc-gvw6rmw-e07uq17sdvzhju2-lv@msgff-372514.iam.gserviceaccount.com",
  "client_id": "117836809879246227500",
  "auth_uri": "https://accounts.google.com/o/oauth2/auth",
  "token_uri": "https://oauth2.googleapis.com/token",
  "auth_provider_x509_cert_url": "https://www.googleapis.com/oauth2/v1/certs",
  "client_x509_cert_url": "https://www.googleapis.com/robot/v1/metadata/x509/mfc-gvw6rmw-e07uq17sdvzhju2-lv%40msgff-372514.iam.gserviceaccount.com"
}
