{
  "type": "service_account",
  "project_id": "msgff-372514",
  "private_key_id": "79861d9f5232634023ec93440d258b28dfdf8e84",
  "private_key": "-----BEGIN PRIVATE KEY-----\nMIIEvAIBADANBgkqhkiG9w0BAQEFAASCBKYwggSiAgEAAoIBAQCSumdZiOhajQ9B\nLpqm/rtCSDUJT+amo+TQrBHTxthL9T3/tqA40oTRLCg9gweUoYmoWBmyC3Aj6rDX\nAEToo67AjRseT7j/6WWkQPoQKvUYyIWRTD1g+EOleOvss0JqvBfkusddGDawaHfj\nG/ZyZNeaaMpkWQoM35rtc7RJeqOXKboVCCn1fItqkG8UM61ZFo76dxzIvVzROd3B\nCNazLJ22u0MOsePYb8IcyOSrXTsmWLE4Znx0mBdZ6lX444cuLa4i56AhXjqkoZ1O\n16aXEFnde4xEXr3EHxEzR7H01jt/K2U/yEDfkNHH+nL5abudQTsyJX7uBpVLH9T9\nO5JYFTwVAgMBAAECggEAAIubvAOCFESmlNVTlN1VSRt3AV247zgsVhVGSumRcJVI\nUuHfd1T3lkjeAYsiWCE1nNzCT7CjLDyNfOmyIQNZA+BWoSspExRM9xgWCXBD19xX\nA/kPf0JZsldPW4mVws3RCur4ENNhWJMDzlJrRiopmh/wgDn6qCUU+xM3yCExsWEK\nMuh/O4F+tSxDyswB6Nwng9QJjkU6J+s86Y2wHQ3GZQB34l5tFcQhkkFzYhv86DA4\nZMIGqGeBWM1Ro9UmgblOGeGju01BJOEOHlnnEkIM44XuDCSHty7wPzMaTE++3/vN\n6nyMfbT/yKs4P3tC1XLRFg/t23i2Hyj/8tmnSKFJsQKBgQDGvzZIic8dsOSgc5LN\nLj+rPUXilkDCx6bj7J28HtGwnVUZlkE0Or5dnORz2oE3niF05Sh2qbtdrGPW3j2p\nR1VJLKPr/C7TdnLCMKc77ePQbCJfWEnaxh+mpidgzDjMy8jwwXDf1Vt6TTspsfBu\nQSuvd5Li0Rf/F2Xff8l1a/fUmQKBgQC8/wPj7VePUdiFdHj3yvuPC8Saz5GR7+pH\nD2zm0QsVl8Sy07XXiJij3tq6hni7gTJuSosnlTgqNPBHF7cb1oyQf+0X46yaGTNf\nkKjbZcXC/3mmSbsEC5sZaomcVyUMlDwtpK+DeZG1hBhU80SM5/xGaoVlcAmZiyml\nQhuseDTU3QKBgCSuphY9WTzhqVD0A+Ra5OV2Ka/oi4tnziXDRlmyVoGCiHJwiRha\nv0gH7SJ08eSSCxrIMO+15B8l8kd2PWtA/zzCQH8NzJa7BfNRh4xIHAQb8Twnz3nR\nl4XqpNn414L1GeFV0r99YaTxHDpV3Up8PNPl/fZfIU6zwtm9fDFv/A4BAoGANv0L\nqLlZjH2HveyRdac9YfVOkqxp8kgXpe07Bj00OGgb9tvaQIehwawJf9O4NPX2MljF\n/BJScRVOA6FGyXa3FyPhW94GTh+e7uMr/gmybHXgcx1oqFioG9D/kNlaEjre93i/\nCEXKu0Ffwve0rjqhD+vWPBlI8b+nskl1u8yNspECgYBMY9iUbjosASdCgXiUBhtJ\nz08xCVwd8fpmUyvdH9yV8Op9qOfUlpqgzFpNZNPPW03YfDH9mFiYsRgRjR5u+xMX\n7m0zS3squduQgBJNptiT/kRNtc3xj+KHgaQss9STvEwKr7eGU54Ngy8dzpAUfDqI\nNs4JkkHnrLqRv1zFfPwCCw==\n-----END PRIVATE KEY-----\n",
  "client_email": "mfc-vmit8x0-oha6e87xvf-ufc5a26@msgff-372514.iam.gserviceaccount.com",
  "client_id": "105438171697940932893",
  "auth_uri": "https://accounts.google.com/o/oauth2/auth",
  "token_uri": "https://oauth2.googleapis.com/token",
  "auth_provider_x509_cert_url": "https://www.googleapis.com/oauth2/v1/certs",
  "client_x509_cert_url": "https://www.googleapis.com/robot/v1/metadata/x509/mfc-vmit8x0-oha6e87xvf-ufc5a26%40msgff-372514.iam.gserviceaccount.com"
}
