{
  "type": "service_account",
  "project_id": "msgff-372514",
  "private_key_id": "1915a3605c5d61a04b4fcf29492bb0e2f71c11b1",
  "private_key": "-----BEGIN PRIVATE KEY-----\nMIIEvQIBADANBgkqhkiG9w0BAQEFAASCBKcwggSjAgEAAoIBAQDxcr+P4QiY3hpx\nYeOHN2ow95whErpema1Wd92KByBCGjLVLUGNaXb5Ryls4FKQAjDktPPAv5BY9zwc\nu5XPWxUFZCg6o5O1/BM342S7X1wlqK47IRdY52Iatu6Ye0fOB6/M4wYjb9HJME5I\n7KEE6AfugfYo8KkfkQMrcjYR2SwZFBFQktm76mwHDVgCAkd6OYU+hmbL79E5HMIp\nGwvj+Ipd70s9JonmGjzyYPvIbwapycWYsIgaY0WeJMuH6mbtjC5mx1XIUihsONpp\nHhdcyqP9AnKiklUEeRb9QmTTpL4gedwvumwfvJLhBfzLdg7tZxsXFz9J/bCgf3Hx\ndTjsXJ5DAgMBAAECggEAGq/P2TZKk02RPKZQ1g7bmjf0C3pyG6dUD7JF9qNHqdFo\nJu8j8gkN0Qr62tbcfqBPXn1a/RtEosteMIrR9Hj2aix3fyu6ACuxcBmedlCu8wFM\nPgAwABqVrwA4f6VjUAlsy/JCfm415iKEX0O69GY1DOP+cj36DiF4E+LsHlg+Vd25\nUF3URB90+kB5RGgSasMIOgMvwqXzeQYXF+dhUflSx0mCN7qX7QaPNrvnI3TsIJsU\nf9WsXbpetAFkz2XC3xxEFUAoSCXmbnEVUnFipcTS9bSCBW+oNQP1zMYdwfUQtbvy\nCngZL9sEmk3IGA40TT5vwJDvL2uGkijiH/V9WVDBEQKBgQD/TI6eAa4MglAQhRpa\nqMYnjBAHFWaiOfumK95+vVf9jv7dahiH6IECuLC4bNWE86O/vXdJLgW9wtZuA1hn\nHsQHkGttYgNQ49AsU64NksR92wj1O7PPSKKppVyFfWz+6GfhYVidijV/1gPwrw1/\nwfVxSv/D1RlBU9kowc/xONGq6QKBgQDyHHSwtWdkQLQPduvaq6Gm0QecWkUoxAHU\nBd3aQL7AgLUGsLu42Qbb9b8ufmiY7H75FuKhED77C0K+m4if01YELEPYXhQtt86N\ntFGMH0McQPnRTcnQMo378Vo7dPuPkwn3F6zBGN82AfV2q6XK/5I8eZfEk6xHI6xL\nrWc+0GOsSwKBgQCqqmAQqqjSfe7ODFzAzGCjIVO5mIni2wYqYNs9OJBw1b31AC7j\n8/8CdbrVnxPh7AnEbQEoL5bw8yXrp1ranMuJDvdxyPrUgWaxq0MImdu3EszbO40J\nfdIXvI6sQlux0GVZWn0l27XF/qjlpfBNPrk4gl2WaYeXj1j1kRLUfBpVuQKBgAyX\nDjpiNI4yDyr+tCUa570VAaBP0WjdSHsOEwtWcpTwHHnMlvZ10rV9ggOY7zeElNW/\nKunVPnEvlLj0vZYSF1cANkb6HXKDLGqSBeuTdJnzhworUWNSPa/sTRTqcGp26v2+\nbW1dLb5RO8KACo8T2zbp28qNI1hPspX83nGVxJkhAoGADwuGUdpjD7Q77GANkAGS\nDhOm10pUUmqVdMjPd80IQDL6k4dZ09dC/kU42YXNEAu8E9D2Z44utjFt8X3qzOOq\nQ2Dq2mZwieg4Ow53JxfdFkD8ie1uuLpi/0OH+jhYrRvlrsmAB4oirr0CaGQzRFxn\nxJaFMao9eqiyPuI+K+KxrnQ=\n-----END PRIVATE KEY-----\n",
  "client_email": "mfc-rnno7q6louwu3laqtuu5xkyffo@msgff-372514.iam.gserviceaccount.com",
  "client_id": "106911303066546192857",
  "auth_uri": "https://accounts.google.com/o/oauth2/auth",
  "token_uri": "https://oauth2.googleapis.com/token",
  "auth_provider_x509_cert_url": "https://www.googleapis.com/oauth2/v1/certs",
  "client_x509_cert_url": "https://www.googleapis.com/robot/v1/metadata/x509/mfc-rnno7q6louwu3laqtuu5xkyffo%40msgff-372514.iam.gserviceaccount.com"
}
