{
  "type": "service_account",
  "project_id": "msgff-372514",
  "private_key_id": "50f23542d5f8745a37e3928fc506f8d4390ec251",
  "private_key": "-----BEGIN PRIVATE KEY-----\nMIIEvgIBADANBgkqhkiG9w0BAQEFAASCBKgwggSkAgEAAoIBAQDrfSiFqJwT35sk\nWxR73cGAaXxWMPNPcToersARzAyDhO9MB/dfIxPfCAqqw4wOFeXh5qvNWPak6re2\n11933CbUpRr3SAw+0wBFrb1erl/h0SGc7Rga0g6J9nFjpPhQMirFPV7HtFH2t+ei\nnQgtzsssus44OqjgMKxAlV2peftekSUHTt/lMUTUvQweoVuAdQfQL/B8q5jZFXvM\nh3SQyWwyNjQ6KkMBqhIoDhT8PvCOgVGu63OsLp6Yy5/PaTRxpKvfIlz+KnH0Qxw1\n7ek/xDGMzbqDSLy+6Ccl4s0PxLsEgPxoXELtngN+5uE3ISuoxggLwpghfWFCgTrb\npvpsuctHAgMBAAECggEAJQcM1ZixqJr6w9MscTOTsajPJlBTxF814ngwzDuXkMsu\nGKLnXca1YQGHMoWajTvFOz7a2b2OKVfyI3um+mub5si/6OJOcUcaiQTsvKlSJemN\nIvsm1KTIfh9Jgf+rvxRm+ZTmRSQl1Sjim6+cXHONKo8u+NQZv11NNb8mtzduc9Zf\nz7ffj+B+NH2xnZsKRS4hMPDVc+XbSo6QDsWjAr1IeHdW8+QBOAVEcd8Pk+sPLHqg\nG/8fuI634XJtzLeUYUMPM3PWeLlH7nwMmW4IwxmYsFoieAvhd5W3Hwdxt02PNn7F\n2saH3I8ZBSwbggYOoLhSJmpnEkfpoON7FvIxy9DxoQKBgQD6ZJfK4MIn8Q+sipo8\nYl1eQ4Dhj5zbCyEu3KQNKCcOlA4/RZbVRmAaFTwLEftzmIp8KUcoRA0BnIB0REGO\nNjpYUzr2CAUeH3+Y9+GWpsEsQr60ag2PF5JXkgPJ3asNE0U2/TxBWwxGBrbCiUxF\nrfThOd8cXZWZA8l1c4cKGKJRZwKBgQDwwyBM8tgSPqIQKTvBAPVkDfCYlP2i/ByO\nKE0flEAwu7YRRTVGs/xLhme5waehhjB818uC+9KefAGnhYoOpEP4Wk3yTpAihR9j\nIBrvBUizkPsRMMLNedf6NszpoWwEHs277nV4Tlkb87glUSqtLaRvEJxqxK4YdXGR\n/x63KTcrIQKBgC+UD7fQL3RxfN33VElnE4DG6OVzaYXBvqNt74pEd+9wOKjTK08J\nWVd7c3ZTC2mysZXYLho7nBETUOFG2wIP0dRYtFptubM4nwFNEMOUmh4z7JLRmBP5\nkagsKaYhBdCtObiyM9HjYBiqS+35MtIGtQJbAccdDUEPFCfKNP25Ipa/AoGBAN8+\n/5d6YpJgU2QK5+ZqHiB9sIe7N4jGny/N/N14WSEXHZbcBq+duybI5StgfzCOPi20\n53d4S+8660nL0J0NAh2qlrZE1O+9YsJGhdL2olgm6jchcLCY94SDBfTpAkC702cc\nkP5SH9yEXE71+U2FkgCOdYum/gud8wY+etu5svchAoGBAKBm74ATF+MpaQyjcUNP\nhEA3GTRApQgxJdj7YAuKwUAXmJoimYMfNqfw6kZ7AsyKTv2ZRzaOwXNX/9dBsQ19\nUUuOUCdDgKKQmulfmdRJ/8EhXi/lGbhkv3rRaPK+RfFg2KTHCKwPPqS/FyCHDIus\n5UAS9GRUJlCHog4jqTKGT4kj\n-----END PRIVATE KEY-----\n",
  "client_email": "mfc-iyuifpho6elebdsxpeadts3hmq@msgff-372514.iam.gserviceaccount.com",
  "client_id": "101482093137217414147",
  "auth_uri": "https://accounts.google.com/o/oauth2/auth",
  "token_uri": "https://oauth2.googleapis.com/token",
  "auth_provider_x509_cert_url": "https://www.googleapis.com/oauth2/v1/certs",
  "client_x509_cert_url": "https://www.googleapis.com/robot/v1/metadata/x509/mfc-iyuifpho6elebdsxpeadts3hmq%40msgff-372514.iam.gserviceaccount.com"
}
