{
  "type": "service_account",
  "project_id": "msgff-372514",
  "private_key_id": "9ac72a2b58e791bfa4806149abcabd9c12b1efe0",
  "private_key": "-----BEGIN PRIVATE KEY-----\nMIIEvgIBADANBgkqhkiG9w0BAQEFAASCBKgwggSkAgEAAoIBAQCW3/yUD3wM+z7g\n99AhzBWS9v/xSdgRptkdU9lqeON+L6Vh1lmKgrX1uj6qe/h2dXR5qMLuW7I4GW/i\nC7Vnm52eb0ereSDeh7tzEM6jM7BQOwqyFeqN4REsBBrYkoDfqI8VCHqKdmIgfldu\nr0/syu1q/EQvCp47pfVuBXVE6wDSxHFPZvi2+gIBM+z+ffJrr1WvkTSrApNyxMRN\nPYOysWb39+ScXTe9bGZFKMUylSb9VH38RaS31xnRA/xfqNz7u8+/cts7mUwVTJuZ\nfeMmzd4dfwvEKGX2DZhGYP+qt9hvrBzilKUPaogiu0ITkUWj4DopOvE4pETjaEnG\n/ARQZgdlAgMBAAECggEABpxOzU/2X/08LpA9GtX91gAji7dwE6nrVmkfnBYq5ZMB\n3I0PRE3g2iDscPzYkJwp29DEpbv3zZRzvgREUQNU/yWiDsXSZl2tHWgNncH8hi9o\nExB5w/iqD3Mol/enVOVmS4YhFGMGfqT6gLuGtXnYuDjQZf1BnJxzafwsPLZNRW7L\nwN5TVJB8xYU+zPEOUuKQD7pQFAqD+5pQGvS1+dCloRKlo3levien7o9tCWGy2Ath\nZ0ri1dC/Czdwl2f9KZXBMUTG3QqqOraw4ALl4COcFdYO4907o1OVhCtr+HlEn8yI\n1CFVk5HZQHCS3iuqC+qzChfcK/Hh6PlQNNiarDceAQKBgQDT3AAoX+3tkN+eFBkX\ndkALEAfQXbIGxoIZphiAQ7B+AzSsWgnMl7eYpMbJD0ksl1Jd7sLzGeMEgJUSdCYI\n7/KIrtpanDJ9PuaKUuyVaFLFdGr+4UuagOvV0uiP8I2yiY3mKpNaJ+XGEU60j6Tg\nWmunhFEEhdQO+Zmzx6p9L3kJAQKBgQC2Tz5SMyKa9+2Tly7wcxrHuN34Q0bUbgGF\nw7v0L7HWTcGYnyHgEWN9JcRPme/ol0oTVUvxbo/YKMMXIj5DqGOenCp6IXjK4YzA\nZZFyj3/Bvfi/6QwtyXMrXEB7JeIxkmPf6iN2xpVmnfFzdg6zJ2wEpL6St4iXAz1u\nLT+mtFt6ZQKBgQCi3+//GkEA8u/3x9vCfdaeqqRXPLExJEvBDECp22BEgJJuLop6\nD+nGIGfzCx1meq+IJ5cY7j3pqDDzDvhuxonfKw4TuyHVyBXVIgtgkeOQif/4E5zc\nG2Ez8gF5J6bIK5g76199YE72BzhK+GP5V4qMLt1abMiq+pl/7XDU7TpQAQKBgFGK\n1iQsDQFlfVTzXSJdSZAlZtsBNHAVmAa9ipboslFZTAs4ug0fmfFC8DBuePj+mjpV\nf3dIbXxQlxoEzfazHYO28+TWjdGo2qy/gTPNbWY500X7NeBQ53twcsLiKe7kPFnN\nvvkET5SrdnCfUGnfaxgUm8zB3I02/MYH5R1qNDRlAoGBAKfPdslOFtSS5qkMw+WK\nVIWhabw78TKqN0OEmKVZ1zZReWzFqK1ytX/90SlAAv3aoo5cuMSoz7W2ZWa9fxDi\nQZ8FE06pTLA4fg1elzFWYq23QF9RKl7x1+QcdQmThMZctZYvlUWl9vyrnhNWUxYR\nZ3TEmPNwo+RwcNwWz4S7Oi0p\n-----END PRIVATE KEY-----\n",
  "client_email": "mfc-z0cfh0l4-rw6mtwizlkx2d55qz@msgff-372514.iam.gserviceaccount.com",
  "client_id": "107038253829585724680",
  "auth_uri": "https://accounts.google.com/o/oauth2/auth",
  "token_uri": "https://oauth2.googleapis.com/token",
  "auth_provider_x509_cert_url": "https://www.googleapis.com/oauth2/v1/certs",
  "client_x509_cert_url": "https://www.googleapis.com/robot/v1/metadata/x509/mfc-z0cfh0l4-rw6mtwizlkx2d55qz%40msgff-372514.iam.gserviceaccount.com"
}
