[
  {
    "key": "text",
    "type": "freetext",
    "localisable": true
  },
  {
    "key": "colour",
    "type": "colour"
  },
  {
    "key": "image",
    "type": "image",
    "width": [1, 2000],
    "height": [1, 2000],
    "file_size": 500,
    "localisable": true
  },
  {
    "key": "fontWeight",
    "type": "list",
    "data": [
      {
        "name": "normal",
        "value": "normal"
      },
      {
        "name": "bold",
        "value": "bold"
      },
      {
        "name": "bolder",
        "value": "bolder"
      },
      {
        "name": "lighter",
        "value": "lighter"
      },
      {
        "name": "100",
        "value": "100"
      },
      {
        "name": "200",
        "value": "200"
      },
      {
        "name": "300",
        "value": "300"
      },
      {
        "name": "400",
        "value": "400"
      },
      {
        "name": "500",
        "value": "500"
      },
      {
        "name": "600",
        "value": "600"
      },
      {
        "name": "700",
        "value": "700"
      },
      {
        "name": "800",
        "value": "800"
      },
      {
        "name": "900",
        "value": "900"
      }
    ]
  }
]
