[
  {
    "name": "Standard Poll",
    "content_type": "poll-element",
    "derived_from": "poll",
    "duration": {
      "mode": "fixed",
      "default": 60
    },
    "icon": "fal fa-question-circle",
    "colour": "#1F5DFF",
    "label": "{{question.text}}",
    "label_question": "{{question.text}}",
    "label_option": "{{option.text}}",
    "reveal_results": {
      "modes": ["vote", "always", "close", "manual", "never"],
      "default": "always"
    },
    "certification": {
      "default": true
    },
    "question": [
      {
        "label": "Title",
        "key": "text",
        "field": "text",
        "mandatory": "question"
      }
    ],
    "option": [
      {
        "label": "Answer text",
        "key": "text",
        "field": "text",
        "mandatory": "option"
      }
    ]
  }
]
