[gd_scene load_steps=5 format=3 uid="uid://b85qgp2t7hn0p"]

[ext_resource type="Texture2D" uid="uid://b7g3sfx4usqjj" path="res://assets/images/courtroom/span.png" id="2_kjahk"]
[ext_resource type="Texture2D" uid="uid://duuwrp700qf60" path="res://assets/images/courtroom/defense_desk.png" id="3_aqfrb"]
[ext_resource type="Texture2D" uid="uid://d3cl5jrtnho3i" path="res://assets/images/courtroom/witness_stand_foreground.png" id="4_jna1o"]
[ext_resource type="Texture2D" uid="uid://vrvjwiec0wfa" path="res://assets/images/courtroom/prosecution_desk.png" id="5_koe8w"]

[node name="CourtSlide" type="Node2D"]
z_index = 50
z_as_relative = false

[node name="BG" type="Parallax2D" parent="."]
limit_begin = Vector2(-1e+07, 0)
limit_end = Vector2(1e+07, 0)

[node name="BG" type="Sprite2D" parent="BG"]
texture = ExtResource("2_kjahk")
centered = false

[node name="Chars" type="Parallax2D" parent="."]
z_index = 10
scroll_scale = Vector2(0.5, 0.5)
limit_begin = Vector2(-1e+07, 0)
limit_end = Vector2(1e+07, 0)

[node name="FG" type="Parallax2D" parent="."]
z_index = 20
scroll_scale = Vector2(0.5, 0.5)
limit_begin = Vector2(-1e+07, 0)
limit_end = Vector2(1e+07, 0)

[node name="Defense" type="Sprite2D" parent="FG"]
position = Vector2(0, 840)
texture = ExtResource("3_aqfrb")
centered = false

[node name="Witness" type="Sprite2D" parent="FG"]
position = Vector2(1920, 810)
texture = ExtResource("4_jna1o")
centered = false

[node name="Prosecution" type="Sprite2D" parent="FG"]
position = Vector2(3840, 840)
texture = ExtResource("5_koe8w")
centered = false
