[gd_resource type="StyleBoxTexture" load_steps=2 format=3 uid="uid://csfq33v111q0n"]

[ext_resource type="Texture2D" uid="uid://cytxmscl05r0f" path="res://assets/gui/button/pressed.png" id="1_ip7tm"]

[resource]
content_margin_left = 32.0
content_margin_top = 18.0
content_margin_right = 32.0
content_margin_bottom = 10.0
texture = ExtResource("1_ip7tm")
texture_margin_left = 12.0
texture_margin_top = 10.0
texture_margin_right = 12.0
texture_margin_bottom = 10.0
axis_stretch_horizontal = 1
axis_stretch_vertical = 1
