[gd_scene load_steps=2 format=3 uid="uid://bxro6ea42obnm"]

[ext_resource type="Texture2D" uid="uid://d3r37y2emjqgg" path="res://assets/images/backgrounds/office_entrance_night.png" id="1_un6jq"]

[node name="OfficeNight" type="Node2D"]

[node name="BG" type="Sprite2D" parent="."]
position = Vector2(960, 540)
texture = ExtResource("1_un6jq")
