[gd_scene load_steps=4 format=3 uid="uid://cem70idq5yo7k"]

[ext_resource type="Script" uid="uid://35rv4j8bl55" path="res://scenes/menus/HUD.gd" id="1_4maxk"]
[ext_resource type="PackedScene" uid="uid://c4ajqp284vwbm" path="res://scenes/menus/dialogue_box/dialogue_box.tscn" id="1_x7q6n"]
[ext_resource type="PackedScene" uid="uid://dsjep8mrcrppa" path="res://scenes/menus/quick_menu/quick_menu.tscn" id="2_x385g"]

[node name="HUD" type="CanvasLayer"]
script = ExtResource("1_4maxk")

[node name="DialogueBox" parent="." instance=ExtResource("1_x7q6n")]

[node name="QuickMenu" parent="." instance=ExtResource("2_x385g")]
anchors_preset = -1
anchor_left = 0.983
anchor_top = 0.97
anchor_right = 0.983
anchor_bottom = 0.97
offset_left = -233.36
offset_top = -31.6
offset_right = 0.639893
offset_bottom = 0.400024
grow_vertical = 2
