[gd_resource type="Theme" load_steps=3 format=3 uid="uid://visdjn6wbatl"]

[ext_resource type="FontFile" uid="uid://08xahqp3tita" path="res://assets/fonts/AceAttorney.ttf" id="1_05pqo"]
[ext_resource type="StyleBox" uid="uid://cefwdlg6i0mg" path="res://assets/resources/stylebox_button_normal.tres" id="2_sfvyr"]

[resource]
Button/font_sizes/font_size = 24
Button/fonts/font = ExtResource("1_05pqo")
Button/styles/normal = ExtResource("2_sfvyr")
Label/font_sizes/font_size = 30
Label/fonts/font = ExtResource("1_05pqo")
RichTextLabel/constants/line_separation = 10
RichTextLabel/font_sizes/normal_font_size = 30
RichTextLabel/fonts/normal_font = ExtResource("1_05pqo")
