{
	"char1" : {
		"char_name"  : "Toto",
		"what_tone"  : 0,
		"what_color" : "WHITE",
		"what_speed" : 40,
	},
	"char2" : {
		"char_name"  : "Titi von Titus",
		"what_tone"  : 1,
		"what_color" : "WHITE",
		"what_speed" : 40,
	},
	
	"edg" : {
		"char_name"  : "Edgeworth",
		"what_tone"  : 0,
		"what_color" : "WHITE",
		"what_speed" : 40,
	},
	
	"wri" : {
		"char_name"  : "Wright",
		"what_tone"  : 0,
		"what_color" : "WHITE",
		"what_speed" : 40,
	},
}
