[gd_scene load_steps=2 format=3 uid="uid://busblrwpmbrc1"]

[ext_resource type="PackedScene" uid="uid://btar8ipfu75cy" path="res://scenes/characters/court/Edgeworth/EdgCourtSmug.tscn" id="1_t6twb"]

[node name="EdgCourtShrug" type="Node2D"]

[node name="EdgCourtSmug" parent="." instance=ExtResource("1_t6twb")]
SkipStartup = false
