[gd_scene load_steps=5 format=3 uid="uid://cup5chod3r1sk"]

[ext_resource type="Texture2D" uid="uid://dbuygfqywf4fx" path="res://assets/images/net/floor_idle.png" id="1_som6q"]
[ext_resource type="Texture2D" uid="uid://x3x0388666ql" path="res://assets/images/net/floor_hover.png" id="2_cgpaq"]
[ext_resource type="Script" path="res://menus/NET_display/floor_button.gd" id="3_i21oi"]
[ext_resource type="Texture2D" uid="uid://bv6odl8p87c1w" path="res://assets/images/net/floor_pos_corner.png" id="4_pln5c"]

[node name="FloorButton" type="TextureButton"]
custom_minimum_size = Vector2(84, 84)
anchors_preset = -1
anchor_right = 0.075
anchor_bottom = 0.137
offset_bottom = 0.0399933
texture_normal = ExtResource("1_som6q")
texture_pressed = ExtResource("2_cgpaq")
texture_hover = ExtResource("2_cgpaq")
ignore_texture_size = true
stretch_mode = 4
script = ExtResource("3_i21oi")
metadata/_edit_use_anchors_ = true

[node name="TextureRect1" type="TextureRect" parent="."]
visible = false
layout_mode = 1
anchors_preset = -1
anchor_right = 0.097
anchor_bottom = 0.095
offset_right = 0.0319996
offset_bottom = -0.0600014
texture = ExtResource("4_pln5c")
stretch_mode = 4
metadata/_edit_use_anchors_ = true

[node name="TextureRect2" type="TextureRect" parent="."]
visible = false
layout_mode = 1
anchors_preset = -1
anchor_left = 0.903
anchor_right = 1.0
anchor_bottom = 0.095
offset_left = -0.0320129
offset_bottom = -0.0600014
grow_horizontal = 0
texture = ExtResource("4_pln5c")
stretch_mode = 4
flip_h = true

[node name="TextureRect3" type="TextureRect" parent="."]
visible = false
layout_mode = 1
anchors_preset = -1
anchor_top = 0.905
anchor_right = 0.097
anchor_bottom = 1.0
offset_top = 0.0599976
offset_right = 0.0319996
grow_vertical = 0
texture = ExtResource("4_pln5c")
stretch_mode = 4
flip_v = true

[node name="TextureRect4" type="TextureRect" parent="."]
visible = false
layout_mode = 1
anchors_preset = -1
anchor_left = 0.903
anchor_top = 0.905
anchor_right = 1.0
anchor_bottom = 1.0
offset_left = -0.0320129
offset_top = 0.0599976
grow_horizontal = 0
grow_vertical = 0
texture = ExtResource("4_pln5c")
stretch_mode = 4
flip_h = true
flip_v = true
