[gd_resource type="StyleBoxTexture" load_steps=2 format=3 uid="uid://dsqeqx8d8nsvr"]

[ext_resource type="Texture2D" uid="uid://bkdpwiwb45cjx" path="res://assets/gui/button/choice_selected_background.png" id="1_0unt1"]

[resource]
content_margin_left = 12.0
content_margin_top = 4.0
content_margin_right = 12.0
content_margin_bottom = 4.0
texture = ExtResource("1_0unt1")
texture_margin_left = 10.0
texture_margin_top = 10.0
texture_margin_right = 10.0
texture_margin_bottom = 10.0
