[gd_resource type="StyleBoxFlat" format=3 uid="uid://pnxc53e5ftko"]

[resource]
content_margin_left = 10.0
content_margin_top = 4.0
content_margin_right = 10.0
content_margin_bottom = 4.0
bg_color = Color(0.305882, 0.133333, 0.129412, 1)
border_width_left = 2
border_width_top = 2
border_width_right = 2
border_width_bottom = 2
border_color = Color(1, 0.254902, 0.239216, 1)
