[gd_scene load_steps=3 format=3 uid="uid://d267ilpe163s1"]

[ext_resource type="Texture2D" uid="uid://duuwrp700qf60" path="res://assets/images/courtroom/defense_desk.png" id="1_0pkuh"]
[ext_resource type="Texture2D" uid="uid://c5u4giqyimnqh" path="res://assets/images/courtroom/defense.png" id="1_p1kh5"]

[node name="CourtDeskDefense" type="Node2D"]

[node name="BG" type="Sprite2D" parent="."]
z_as_relative = false
texture = ExtResource("1_p1kh5")
centered = false

[node name="Desk" type="Sprite2D" parent="."]
z_index = 20
z_as_relative = false
position = Vector2(0, 840)
texture = ExtResource("1_0pkuh")
centered = false
