[gd_scene load_steps=4 format=3 uid="uid://co8amjcmk43k1"]

[ext_resource type="Script" uid="uid://527wc7nyrqab" path="res://scenes/menus/main_menu/submenu.gd" id="1_733vw"]
[ext_resource type="Theme" uid="uid://rp58fcll4m04" path="res://resources/main_theme.tres" id="1_q65h2"]
[ext_resource type="PackedScene" uid="uid://cpacem2g2wh0r" path="res://scenes/menus/main_menu/load_save/save_slot_button.tscn" id="3_42riy"]

[node name="LoadSave" type="Control"]
layout_mode = 3
anchors_preset = 15
anchor_right = 1.0
anchor_bottom = 1.0
grow_horizontal = 2
grow_vertical = 2
script = ExtResource("1_733vw")
metadata/_custom_type_script = "uid://527wc7nyrqab"

[node name="MarginContainer" type="MarginContainer" parent="."]
layout_mode = 1
anchors_preset = 15
anchor_right = 1.0
anchor_bottom = 1.0
grow_horizontal = 2
grow_vertical = 2
theme_override_constants/margin_left = 36
theme_override_constants/margin_top = 36
theme_override_constants/margin_right = 36
theme_override_constants/margin_bottom = 36

[node name="VBoxContainer" type="VBoxContainer" parent="MarginContainer"]
layout_mode = 2
size_flags_horizontal = 4

[node name="Label" type="Label" parent="MarginContainer/VBoxContainer"]
layout_mode = 2
theme = ExtResource("1_q65h2")
text = "Save/Load Game"
horizontal_alignment = 1

[node name="Slots" type="VBoxContainer" parent="MarginContainer/VBoxContainer"]
layout_mode = 2

[node name="SaveSlotButton" parent="MarginContainer/VBoxContainer/Slots" instance=ExtResource("3_42riy")]
layout_mode = 2
