[gd_scene load_steps=3 format=3 uid="uid://cxwkjnh4xg5rt"]

[ext_resource type="PackedScene" uid="uid://dqxtg7ll7md7y" path="res://scenes/characters/court/Edgeworth/EdgCourtIdle.tscn" id="1_jotwu"]
[ext_resource type="Texture2D" uid="uid://dbe21xcqcuuji" path="res://assets/images/characters/court/edgeworth/idle/paper.png" id="2_y1vg5"]

[node name="EdgCourtPaper" type="Node2D"]

[node name="EdgCourtIdle" parent="." instance=ExtResource("1_jotwu")]

[node name="Sprite2D" type="Sprite2D" parent="."]
position = Vector2(702.5, 263)
texture = ExtResource("2_y1vg5")
centered = false
