[gd_resource type="StyleBoxTexture" load_steps=2 format=3 uid="uid://bxsrvl4wfmfl1"]

[ext_resource type="Texture2D" uid="uid://bptn78ldqtxgl" path="res://assets/gui/button/disabled.png" id="1_mahtd"]

[resource]
content_margin_left = 32.0
content_margin_top = 18.0
content_margin_right = 32.0
content_margin_bottom = 10.0
texture = ExtResource("1_mahtd")
texture_margin_left = 12.0
texture_margin_top = 10.0
texture_margin_right = 12.0
texture_margin_bottom = 10.0
axis_stretch_horizontal = 1
axis_stretch_vertical = 1
