[gd_scene load_steps=2 format=3 uid="uid://dr0kwav47k5ra"]

[ext_resource type="Script" uid="uid://527wc7nyrqab" path="res://scenes/menus/main_menu/submenu.gd" id="1_y806s"]

[node name="MusicBox" type="Control"]
layout_mode = 3
anchors_preset = 15
anchor_right = 1.0
anchor_bottom = 1.0
grow_horizontal = 2
grow_vertical = 2
script = ExtResource("1_y806s")
metadata/_custom_type_script = "uid://527wc7nyrqab"
