<?xml version="1.0"?>
<robot xmlns:xacro="http://www.ros.org/wiki/xacro">
    <xacro:macro name="cylinder_inertia" params="mass r l">
      <inertia  ixx="${mass*(3*r*r+l*l)/12}" ixy = "0" ixz = "0"
                iyy="${mass*(3*r*r+l*l)/12}" iyz = "0"
                izz="${mass*(r*r)/2}" />
    </xacro:macro>

    <xacro:macro name="box_inertia" params="mass x y z">
        <inertia  ixx="${mass*(y*y+z*z)/12}" ixy = "0" ixz = "0"
                  iyy="${mass*(x*x+z*z)/12}" iyz = "0"
                  izz="${mass*(x*x+y*y)/12}" />
    </xacro:macro>

    <xacro:macro name="pose_param" params="pos">
        <pose xyz="${pos['x']} ${pos['y']} ${pos['z']}" rpy="${pos['r']} ${pos['p']} ${pos['yy']}" />
    </xacro:macro>

    <xacro:macro name="origin_param" params="pos">
        <origin xyz="${pos['x']} ${pos['y']} ${pos['z']}" rpy="${pos['r']} ${pos['p']} ${pos['yy']}" />
    </xacro:macro>

    <xacro:macro name="link_box_param" params="param name color">
        <link name="${name}_link">
            <pose_param pos="${param['pose']}"/>
            <inertial>
                <mass value="${param['mass']}"/>
                <origin rpy="0 0 0" xyz="0 0 0"/>
                <box_inertia mass="${param['mass']}" x="${param['x']}" y="${param['y']}" z="${param['z']}"/>
            </inertial>
            <collision>
                <geometry>
                    <box size="${param['x']} ${param['y']} ${param['z']}"/>
                </geometry>
            </collision>
            <visual>
                <origin rpy="0 0 0" xyz="0 0 0"/>
                <geometry>
                    <box size="${param['x']} ${param['y']} ${param['z']}"/>
                </geometry>
                <material name="${color}"/>
            </visual>
        </link>
    </xacro:macro>

    <xacro:macro name="link_cylinder_param" params="param name color">
        <link name="${name}_link">
            <pose_param pos="${param['pose']}"/>
            <inertial>
                <mass value="${param['mass']}"/>
                <origin rpy="0 0 0" xyz="0 0 0"/>
                <cylinder_inertia mass="${param['mass']}" r="${param['radius']}" l="${param['length']}"/>
            </inertial>
            <collision>
                <geometry>
                    <cylinder radius="${param['radius']}" length="${param['length']}"/>
                </geometry>
                <surface>
                    <friction> 10 10 10 10 </friction>
                </surface>
            </collision>
            <visual>
                <origin rpy="0 0 0" xyz="0 0 0"/>
                <geometry>
                    <cylinder radius="${param['radius']}" length="${param['length']}"/>
                </geometry>
                <material name="${color}"/>
            </visual>
        </link>
    </xacro:macro>
</robot>