{
    "preset": "ts-jest",
    "globals": {
        "ts-jest": {
            "tsconfig": "tsconfig.spec.json"
        }
    },
    "bail": true,
    "collectCoverage": true,
    "setupFilesAfterEnv": [
        "<rootDir>/test/setup.ts"
    ]
}
