sv xpm  \
"D:/Programs/Xilinx/Vivado/2021.2/data/ip/xpm/xpm_memory/hdl/xpm_memory.sv" \

verilog blk_mem_gen_v8_4_5  \
"../../../ipstatic/simulation/blk_mem_gen_v8_4.v" \

verilog xil_defaultlib  \
"../../../../Group12 With BRAM.gen/sources_1/ip/max_blk/sim/max_blk.v" \

verilog xil_defaultlib "glbl.v"

nosort
