00000000000000001000000000000000
00000000000000001000000011001001
00000000000000001000000110010010
00000000000000001000001001011011
00000000000000001000001100100100
00000000000000001000001111101101
00000000000000001000010010110110
00000000000000001000010101111110
00000000000000001000011001000111
00000000000000001000011100010000
00000000000000001000011111011001
00000000000000001000100010100001
00000000000000001000100101101010
00000000000000001000101000110010
00000000000000001000101011111011
00000000000000001000101111000011
00000000000000001000110010001011
00000000000000001000110101010011
00000000000000001000111000011011
00000000000000001000111011100011
00000000000000001000111110101011
00000000000000001001000001110010
00000000000000001001000100111001
00000000000000001001001000000001
00000000000000001001001011000111
00000000000000001001001110001110
00000000000000001001010001010101
00000000000000001001010100011011
00000000000000001001010111100001
00000000000000001001011010100111
00000000000000001001011101101101
00000000000000001001100000110011
00000000000000001001100011111000
00000000000000001001100110111101
00000000000000001001101010000010
00000000000000001001101101000111
00000000000000001001110000001011
00000000000000001001110011001111
00000000000000001001110110010011
00000000000000001001111001010110
00000000000000001001111100011001
00000000000000001001111111011100
00000000000000001010000010011111
00000000000000001010000101100001
00000000000000001010001000100011
00000000000000001010001011100101
00000000000000001010001110100110
00000000000000001010010001100111
00000000000000001010010100100111
00000000000000001010010111101000
00000000000000001010011010100111
00000000000000001010011101100111
00000000000000001010100000100110
00000000000000001010100011100101
00000000000000001010100110100011
00000000000000001010101001100001
00000000000000001010101100011111
00000000000000001010101111011100
00000000000000001010110010011000
00000000000000001010110101010101
00000000000000001010111000010000
00000000000000001010111011001100
00000000000000001010111110000111
00000000000000001011000001000001
00000000000000001011000011111011
00000000000000001011000110110101
00000000000000001011001001101110
00000000000000001011001100100110
00000000000000001011001111011110
00000000000000001011010010010110
00000000000000001011010101001101
00000000000000001011011000000011
00000000000000001011011010111001
00000000000000001011011101101111
00000000000000001011100000100100
00000000000000001011100011011000
00000000000000001011100110001100
00000000000000001011101000111111
00000000000000001011101011110010
00000000000000001011101110100100
00000000000000001011110001010110
00000000000000001011110100000111
00000000000000001011110110110111
00000000000000001011111001100111
00000000000000001011111100010111
00000000000000001011111111000101
00000000000000001100000001110011
00000000000000001100000100100001
00000000000000001100000111001101
00000000000000001100001001111001
00000000000000001100001100100101
00000000000000001100001111010000
00000000000000001100010001111010
00000000000000001100010100100100
00000000000000001100010111001100
00000000000000001100011001110101
00000000000000001100011100011100
00000000000000001100011111000011
00000000000000001100100001101001
00000000000000001100100100001111
00000000000000001100100110110011
00000000000000001100101001010111
00000000000000001100101011111011
00000000000000001100101110011101
00000000000000001100110000111111
00000000000000001100110011100000
00000000000000001100110110000001
00000000000000001100111000100000
00000000000000001100111010111111
00000000000000001100111101011101
00000000000000001100111111111011
00000000000000001101000010010111
00000000000000001101000100110011
00000000000000001101000111001110
00000000000000001101001001101000
00000000000000001101001100000010
00000000000000001101001110011010
00000000000000001101010000110010
00000000000000001101010011001001
00000000000000001101010101011111
00000000000000001101010111110101
00000000000000001101011010001001
00000000000000001101011100011101
00000000000000001101011110110000
00000000000000001101100001000010
00000000000000001101100011010011
00000000000000001101100101100100
00000000000000001101100111110011
00000000000000001101101010000010
00000000000000001101101100001111
00000000000000001101101110011100
00000000000000001101110000101000
00000000000000001101110010110011
00000000000000001101110100111101
00000000000000001101110111000111
00000000000000001101111001001111
00000000000000001101111011010111
00000000000000001101111101011101
00000000000000001101111111100011
00000000000000001110000001101000
00000000000000001110000011101011
00000000000000001110000101101110
00000000000000001110000111110000
00000000000000001110001001110001
00000000000000001110001011110001
00000000000000001110001101110000
00000000000000001110001111101110
00000000000000001110010001101011
00000000000000001110010011101000
00000000000000001110010101100011
00000000000000001110010111011101
00000000000000001110011001010110
00000000000000001110011011001111
00000000000000001110011101000110
00000000000000001110011110111100
00000000000000001110100000110001
00000000000000001110100010100110
00000000000000001110100100011001
00000000000000001110100110001011
00000000000000001110100111111100
00000000000000001110101001101101
00000000000000001110101011011100
00000000000000001110101101001010
00000000000000001110101110110111
00000000000000001110110000100011
00000000000000001110110010001110
00000000000000001110110011111000
00000000000000001110110101100001
00000000000000001110110111001001
00000000000000001110111000110000
00000000000000001110111010010110
00000000000000001110111011111010
00000000000000001110111101011110
00000000000000001110111111000001
00000000000000001111000000100010
00000000000000001111000010000011
00000000000000001111000011100010
00000000000000001111000101000000
00000000000000001111000110011101
00000000000000001111000111111001
00000000000000001111001001010100
00000000000000001111001010101110
00000000000000001111001100000111
00000000000000001111001101011110
00000000000000001111001110110101
00000000000000001111010000001010
00000000000000001111010001011111
00000000000000001111010010110010
00000000000000001111010100000100
00000000000000001111010101010101
00000000000000001111010110100101
00000000000000001111010111110011
00000000000000001111011001000001
00000000000000001111011010001101
00000000000000001111011011011000
00000000000000001111011100100010
00000000000000001111011101101011
00000000000000001111011110110011
00000000000000001111011111111010
00000000000000001111100000111111
00000000000000001111100010000100
00000000000000001111100011000111
00000000000000001111100100001001
00000000000000001111100101001010
00000000000000001111100110001001
00000000000000001111100111001000
00000000000000001111101000000101
00000000000000001111101001000001
00000000000000001111101001111100
00000000000000001111101010110110
00000000000000001111101011101110
00000000000000001111101100100110
00000000000000001111101101011100
00000000000000001111101110010001
00000000000000001111101111000101
00000000000000001111101111111000
00000000000000001111110000101001
00000000000000001111110001011001
00000000000000001111110010001000
00000000000000001111110010110110
00000000000000001111110011100011
00000000000000001111110100001110
00000000000000001111110100111001
00000000000000001111110101100010
00000000000000001111110110001001
00000000000000001111110110110000
00000000000000001111110111010101
00000000000000001111110111111010
00000000000000001111111000011101
00000000000000001111111000111110
00000000000000001111111001011111
00000000000000001111111001111110
00000000000000001111111010011100
00000000000000001111111010111001
00000000000000001111111011010101
00000000000000001111111011101111
00000000000000001111111100001001
00000000000000001111111100100001
00000000000000001111111100110111
00000000000000001111111101001101
00000000000000001111111101100001
00000000000000001111111101110100
00000000000000001111111110000110
00000000000000001111111110010111
00000000000000001111111110100110
00000000000000001111111110110100
00000000000000001111111111000001
00000000000000001111111111001101
00000000000000001111111111011000
00000000000000001111111111100001
00000000000000001111111111101001
00000000000000001111111111110000
00000000000000001111111111110101
00000000000000001111111111111001
00000000000000001111111111111101
00000000000000001111111111111110
00000000000000001111111111111111
00000000000000001111111111111110
00000000000000001111111111111101
00000000000000001111111111111001
00000000000000001111111111110101
00000000000000001111111111110000
00000000000000001111111111101001
00000000000000001111111111100001
00000000000000001111111111011000
00000000000000001111111111001101
00000000000000001111111111000001
00000000000000001111111110110100
00000000000000001111111110100110
00000000000000001111111110010111
00000000000000001111111110000110
00000000000000001111111101110100
00000000000000001111111101100001
00000000000000001111111101001101
00000000000000001111111100110111
00000000000000001111111100100001
00000000000000001111111100001001
00000000000000001111111011101111
00000000000000001111111011010101
00000000000000001111111010111001
00000000000000001111111010011100
00000000000000001111111001111110
00000000000000001111111001011111
00000000000000001111111000111110
00000000000000001111111000011101
00000000000000001111110111111010
00000000000000001111110111010101
00000000000000001111110110110000
00000000000000001111110110001001
00000000000000001111110101100010
00000000000000001111110100111001
00000000000000001111110100001110
00000000000000001111110011100011
00000000000000001111110010110110
00000000000000001111110010001000
00000000000000001111110001011001
00000000000000001111110000101001
00000000000000001111101111111000
00000000000000001111101111000101
00000000000000001111101110010001
00000000000000001111101101011100
00000000000000001111101100100110
00000000000000001111101011101110
00000000000000001111101010110110
00000000000000001111101001111100
00000000000000001111101001000001
00000000000000001111101000000101
00000000000000001111100111001000
00000000000000001111100110001001
00000000000000001111100101001010
00000000000000001111100100001001
00000000000000001111100011000111
00000000000000001111100010000100
00000000000000001111100000111111
00000000000000001111011111111010
00000000000000001111011110110011
00000000000000001111011101101011
00000000000000001111011100100010
00000000000000001111011011011000
00000000000000001111011010001101
00000000000000001111011001000001
00000000000000001111010111110011
00000000000000001111010110100101
00000000000000001111010101010101
00000000000000001111010100000100
00000000000000001111010010110010
00000000000000001111010001011111
00000000000000001111010000001010
00000000000000001111001110110101
00000000000000001111001101011110
00000000000000001111001100000111
00000000000000001111001010101110
00000000000000001111001001010100
00000000000000001111000111111001
00000000000000001111000110011101
00000000000000001111000101000000
00000000000000001111000011100010
00000000000000001111000010000011
00000000000000001111000000100010
00000000000000001110111111000001
00000000000000001110111101011110
00000000000000001110111011111010
00000000000000001110111010010110
00000000000000001110111000110000
00000000000000001110110111001001
00000000000000001110110101100001
00000000000000001110110011111000
00000000000000001110110010001110
00000000000000001110110000100011
00000000000000001110101110110111
00000000000000001110101101001010
00000000000000001110101011011100
00000000000000001110101001101101
00000000000000001110100111111100
00000000000000001110100110001011
00000000000000001110100100011001
00000000000000001110100010100110
00000000000000001110100000110001
00000000000000001110011110111100
00000000000000001110011101000110
00000000000000001110011011001111
00000000000000001110011001010110
00000000000000001110010111011101
00000000000000001110010101100011
00000000000000001110010011101000
00000000000000001110010001101011
00000000000000001110001111101110
00000000000000001110001101110000
00000000000000001110001011110001
00000000000000001110001001110001
00000000000000001110000111110000
00000000000000001110000101101110
00000000000000001110000011101011
00000000000000001110000001101000
00000000000000001101111111100011
00000000000000001101111101011101
00000000000000001101111011010111
00000000000000001101111001001111
00000000000000001101110111000111
00000000000000001101110100111101
00000000000000001101110010110011
00000000000000001101110000101000
00000000000000001101101110011100
00000000000000001101101100001111
00000000000000001101101010000010
00000000000000001101100111110011
00000000000000001101100101100100
00000000000000001101100011010011
00000000000000001101100001000010
00000000000000001101011110110000
00000000000000001101011100011101
00000000000000001101011010001001
00000000000000001101010111110101
00000000000000001101010101011111
00000000000000001101010011001001
00000000000000001101010000110010
00000000000000001101001110011010
00000000000000001101001100000010
00000000000000001101001001101000
00000000000000001101000111001110
00000000000000001101000100110011
00000000000000001101000010010111
00000000000000001100111111111011
00000000000000001100111101011101
00000000000000001100111010111111
00000000000000001100111000100000
00000000000000001100110110000001
00000000000000001100110011100000
00000000000000001100110000111111
00000000000000001100101110011101
00000000000000001100101011111011
00000000000000001100101001010111
00000000000000001100100110110011
00000000000000001100100100001111
00000000000000001100100001101001
00000000000000001100011111000011
00000000000000001100011100011100
00000000000000001100011001110101
00000000000000001100010111001100
00000000000000001100010100100100
00000000000000001100010001111010
00000000000000001100001111010000
00000000000000001100001100100101
00000000000000001100001001111001
00000000000000001100000111001101
00000000000000001100000100100001
00000000000000001100000001110011
00000000000000001011111111000101
00000000000000001011111100010111
00000000000000001011111001100111
00000000000000001011110110110111
00000000000000001011110100000111
00000000000000001011110001010110
00000000000000001011101110100100
00000000000000001011101011110010
00000000000000001011101000111111
00000000000000001011100110001100
00000000000000001011100011011000
00000000000000001011100000100100
00000000000000001011011101101111
00000000000000001011011010111001
00000000000000001011011000000011
00000000000000001011010101001101
00000000000000001011010010010110
00000000000000001011001111011110
00000000000000001011001100100110
00000000000000001011001001101110
00000000000000001011000110110101
00000000000000001011000011111011
00000000000000001011000001000001
00000000000000001010111110000111
00000000000000001010111011001100
00000000000000001010111000010000
00000000000000001010110101010101
00000000000000001010110010011000
00000000000000001010101111011100
00000000000000001010101100011111
00000000000000001010101001100001
00000000000000001010100110100011
00000000000000001010100011100101
00000000000000001010100000100110
00000000000000001010011101100111
00000000000000001010011010100111
00000000000000001010010111101000
00000000000000001010010100100111
00000000000000001010010001100111
00000000000000001010001110100110
00000000000000001010001011100101
00000000000000001010001000100011
00000000000000001010000101100001
00000000000000001010000010011111
00000000000000001001111111011100
00000000000000001001111100011001
00000000000000001001111001010110
00000000000000001001110110010011
00000000000000001001110011001111
00000000000000001001110000001011
00000000000000001001101101000111
00000000000000001001101010000010
00000000000000001001100110111101
00000000000000001001100011111000
00000000000000001001100000110011
00000000000000001001011101101101
00000000000000001001011010100111
00000000000000001001010111100001
00000000000000001001010100011011
00000000000000001001010001010101
00000000000000001001001110001110
00000000000000001001001011000111
00000000000000001001001000000001
00000000000000001001000100111001
00000000000000001001000001110010
00000000000000001000111110101011
00000000000000001000111011100011
00000000000000001000111000011011
00000000000000001000110101010011
00000000000000001000110010001011
00000000000000001000101111000011
00000000000000001000101011111011
00000000000000001000101000110010
00000000000000001000100101101010
00000000000000001000100010100001
00000000000000001000011111011001
00000000000000001000011100010000
00000000000000001000011001000111
00000000000000001000010101111110
00000000000000001000010010110110
00000000000000001000001111101101
00000000000000001000001100100100
00000000000000001000001001011011
00000000000000001000000110010010
00000000000000001000000011001001
00000000000000001000000000000000
00000000000000000111111100110110
00000000000000000111111001101101
00000000000000000111110110100100
00000000000000000111110011011011
00000000000000000111110000010010
00000000000000000111101101001001
00000000000000000111101010000001
00000000000000000111100110111000
00000000000000000111100011101111
00000000000000000111100000100110
00000000000000000111011101011110
00000000000000000111011010010101
00000000000000000111010111001101
00000000000000000111010100000100
00000000000000000111010000111100
00000000000000000111001101110100
00000000000000000111001010101100
00000000000000000111000111100100
00000000000000000111000100011100
00000000000000000111000001010100
00000000000000000110111110001101
00000000000000000110111011000110
00000000000000000110110111111110
00000000000000000110110100111000
00000000000000000110110001110001
00000000000000000110101110101010
00000000000000000110101011100100
00000000000000000110101000011110
00000000000000000110100101011000
00000000000000000110100010010010
00000000000000000110011111001100
00000000000000000110011100000111
00000000000000000110011001000010
00000000000000000110010101111101
00000000000000000110010010111000
00000000000000000110001111110100
00000000000000000110001100110000
00000000000000000110001001101100
00000000000000000110000110101001
00000000000000000110000011100110
00000000000000000110000000100011
00000000000000000101111101100000
00000000000000000101111010011110
00000000000000000101110111011100
00000000000000000101110100011010
00000000000000000101110001011001
00000000000000000101101110011000
00000000000000000101101011011000
00000000000000000101101000010111
00000000000000000101100101011000
00000000000000000101100010011000
00000000000000000101011111011001
00000000000000000101011100011010
00000000000000000101011001011100
00000000000000000101010110011110
00000000000000000101010011100000
00000000000000000101010000100011
00000000000000000101001101100111
00000000000000000101001010101010
00000000000000000101000111101111
00000000000000000101000100110011
00000000000000000101000001111000
00000000000000000100111110111110
00000000000000000100111100000100
00000000000000000100111001001010
00000000000000000100110110010001
00000000000000000100110011011001
00000000000000000100110000100001
00000000000000000100101101101001
00000000000000000100101010110010
00000000000000000100100111111100
00000000000000000100100101000110
00000000000000000100100010010000
00000000000000000100011111011011
00000000000000000100011100100111
00000000000000000100011001110011
00000000000000000100010111000000
00000000000000000100010100001101
00000000000000000100010001011011
00000000000000000100001110101001
00000000000000000100001011111000
00000000000000000100001001001000
00000000000000000100000110011000
00000000000000000100000011101000
00000000000000000100000000111010
00000000000000000011111110001100
00000000000000000011111011011110
00000000000000000011111000110010
00000000000000000011110110000110
00000000000000000011110011011010
00000000000000000011110000101111
00000000000000000011101110000101
00000000000000000011101011011011
00000000000000000011101000110011
00000000000000000011100110001010
00000000000000000011100011100011
00000000000000000011100000111100
00000000000000000011011110010110
00000000000000000011011011110000
00000000000000000011011001001100
00000000000000000011010110101000
00000000000000000011010100000100
00000000000000000011010001100010
00000000000000000011001111000000
00000000000000000011001100011111
00000000000000000011001001111110
00000000000000000011000111011111
00000000000000000011000101000000
00000000000000000011000010100010
00000000000000000011000000000100
00000000000000000010111101101000
00000000000000000010111011001100
00000000000000000010111000110001
00000000000000000010110110010111
00000000000000000010110011111101
00000000000000000010110001100101
00000000000000000010101111001101
00000000000000000010101100110110
00000000000000000010101010100000
00000000000000000010101000001010
00000000000000000010100101110110
00000000000000000010100011100010
00000000000000000010100001001111
00000000000000000010011110111101
00000000000000000010011100101100
00000000000000000010011010011011
00000000000000000010011000001100
00000000000000000010010101111101
00000000000000000010010011110000
00000000000000000010010001100011
00000000000000000010001111010111
00000000000000000010001101001100
00000000000000000010001011000010
00000000000000000010001000111000
00000000000000000010000110110000
00000000000000000010000100101000
00000000000000000010000010100010
00000000000000000010000000011100
00000000000000000001111110010111
00000000000000000001111100010100
00000000000000000001111010010001
00000000000000000001111000001111
00000000000000000001110110001110
00000000000000000001110100001110
00000000000000000001110010001111
00000000000000000001110000010001
00000000000000000001101110010100
00000000000000000001101100010111
00000000000000000001101010011100
00000000000000000001101000100010
00000000000000000001100110101001
00000000000000000001100100110000
00000000000000000001100010111001
00000000000000000001100001000011
00000000000000000001011111001110
00000000000000000001011101011001
00000000000000000001011011100110
00000000000000000001011001110100
00000000000000000001011000000011
00000000000000000001010110010010
00000000000000000001010100100011
00000000000000000001010010110101
00000000000000000001010001001000
00000000000000000001001111011100
00000000000000000001001101110001
00000000000000000001001100000111
00000000000000000001001010011110
00000000000000000001001000110110
00000000000000000001000111001111
00000000000000000001000101101001
00000000000000000001000100000101
00000000000000000001000010100001
00000000000000000001000000111110
00000000000000000000111111011101
00000000000000000000111101111100
00000000000000000000111100011101
00000000000000000000111010111111
00000000000000000000111001100010
00000000000000000000111000000110
00000000000000000000110110101011
00000000000000000000110101010001
00000000000000000000110011111000
00000000000000000000110010100001
00000000000000000000110001001010
00000000000000000000101111110101
00000000000000000000101110100000
00000000000000000000101101001101
00000000000000000000101011111011
00000000000000000000101010101010
00000000000000000000101001011010
00000000000000000000101000001100
00000000000000000000100110111110
00000000000000000000100101110010
00000000000000000000100100100111
00000000000000000000100011011101
00000000000000000000100010010100
00000000000000000000100001001100
00000000000000000000100000000101
00000000000000000000011111000000
00000000000000000000011101111011
00000000000000000000011100111000
00000000000000000000011011110110
00000000000000000000011010110101
00000000000000000000011001110110
00000000000000000000011000110111
00000000000000000000010111111010
00000000000000000000010110111110
00000000000000000000010110000011
00000000000000000000010101001001
00000000000000000000010100010001
00000000000000000000010011011001
00000000000000000000010010100011
00000000000000000000010001101110
00000000000000000000010000111010
00000000000000000000010000000111
00000000000000000000001111010110
00000000000000000000001110100110
00000000000000000000001101110111
00000000000000000000001101001001
00000000000000000000001100011100
00000000000000000000001011110001
00000000000000000000001011000110
00000000000000000000001010011101
00000000000000000000001001110110
00000000000000000000001001001111
00000000000000000000001000101010
00000000000000000000001000000101
00000000000000000000000111100010
00000000000000000000000111000001
00000000000000000000000110100000
00000000000000000000000110000001
00000000000000000000000101100011
00000000000000000000000101000110
00000000000000000000000100101010
00000000000000000000000100010000
00000000000000000000000011110110
00000000000000000000000011011110
00000000000000000000000011001000
00000000000000000000000010110010
00000000000000000000000010011110
00000000000000000000000010001011
00000000000000000000000001111001
00000000000000000000000001101000
00000000000000000000000001011001
00000000000000000000000001001011
00000000000000000000000000111110
00000000000000000000000000110010
00000000000000000000000000100111
00000000000000000000000000011110
00000000000000000000000000010110
00000000000000000000000000001111
00000000000000000000000000001010
00000000000000000000000000000110
00000000000000000000000000000010
00000000000000000000000000000001
00000000000000000000000000000000
00000000000000000000000000000001
00000000000000000000000000000010
00000000000000000000000000000110
00000000000000000000000000001010
00000000000000000000000000001111
00000000000000000000000000010110
00000000000000000000000000011110
00000000000000000000000000100111
00000000000000000000000000110010
00000000000000000000000000111110
00000000000000000000000001001011
00000000000000000000000001011001
00000000000000000000000001101000
00000000000000000000000001111001
00000000000000000000000010001011
00000000000000000000000010011110
00000000000000000000000010110010
00000000000000000000000011001000
00000000000000000000000011011110
00000000000000000000000011110110
00000000000000000000000100010000
00000000000000000000000100101010
00000000000000000000000101000110
00000000000000000000000101100011
00000000000000000000000110000001
00000000000000000000000110100000
00000000000000000000000111000001
00000000000000000000000111100010
00000000000000000000001000000101
00000000000000000000001000101010
00000000000000000000001001001111
00000000000000000000001001110110
00000000000000000000001010011101
00000000000000000000001011000110
00000000000000000000001011110001
00000000000000000000001100011100
00000000000000000000001101001001
00000000000000000000001101110111
00000000000000000000001110100110
00000000000000000000001111010110
00000000000000000000010000000111
00000000000000000000010000111010
00000000000000000000010001101110
00000000000000000000010010100011
00000000000000000000010011011001
00000000000000000000010100010001
00000000000000000000010101001001
00000000000000000000010110000011
00000000000000000000010110111110
00000000000000000000010111111010
00000000000000000000011000110111
00000000000000000000011001110110
00000000000000000000011010110101
00000000000000000000011011110110
00000000000000000000011100111000
00000000000000000000011101111011
00000000000000000000011111000000
00000000000000000000100000000101
00000000000000000000100001001100
00000000000000000000100010010100
00000000000000000000100011011101
00000000000000000000100100100111
00000000000000000000100101110010
00000000000000000000100110111110
00000000000000000000101000001100
00000000000000000000101001011010
00000000000000000000101010101010
00000000000000000000101011111011
00000000000000000000101101001101
00000000000000000000101110100000
00000000000000000000101111110101
00000000000000000000110001001010
00000000000000000000110010100001
00000000000000000000110011111000
00000000000000000000110101010001
00000000000000000000110110101011
00000000000000000000111000000110
00000000000000000000111001100010
00000000000000000000111010111111
00000000000000000000111100011101
00000000000000000000111101111100
00000000000000000000111111011101
00000000000000000001000000111110
00000000000000000001000010100001
00000000000000000001000100000101
00000000000000000001000101101001
00000000000000000001000111001111
00000000000000000001001000110110
00000000000000000001001010011110
00000000000000000001001100000111
00000000000000000001001101110001
00000000000000000001001111011100
00000000000000000001010001001000
00000000000000000001010010110101
00000000000000000001010100100011
00000000000000000001010110010010
00000000000000000001011000000011
00000000000000000001011001110100
00000000000000000001011011100110
00000000000000000001011101011001
00000000000000000001011111001110
00000000000000000001100001000011
00000000000000000001100010111001
00000000000000000001100100110000
00000000000000000001100110101001
00000000000000000001101000100010
00000000000000000001101010011100
00000000000000000001101100010111
00000000000000000001101110010100
00000000000000000001110000010001
00000000000000000001110010001111
00000000000000000001110100001110
00000000000000000001110110001110
00000000000000000001111000001111
00000000000000000001111010010001
00000000000000000001111100010100
00000000000000000001111110010111
00000000000000000010000000011100
00000000000000000010000010100010
00000000000000000010000100101000
00000000000000000010000110110000
00000000000000000010001000111000
00000000000000000010001011000010
00000000000000000010001101001100
00000000000000000010001111010111
00000000000000000010010001100011
00000000000000000010010011110000
00000000000000000010010101111101
00000000000000000010011000001100
00000000000000000010011010011011
00000000000000000010011100101100
00000000000000000010011110111101
00000000000000000010100001001111
00000000000000000010100011100010
00000000000000000010100101110110
00000000000000000010101000001010
00000000000000000010101010100000
00000000000000000010101100110110
00000000000000000010101111001101
00000000000000000010110001100101
00000000000000000010110011111101
00000000000000000010110110010111
00000000000000000010111000110001
00000000000000000010111011001100
00000000000000000010111101101000
00000000000000000011000000000100
00000000000000000011000010100010
00000000000000000011000101000000
00000000000000000011000111011111
00000000000000000011001001111110
00000000000000000011001100011111
00000000000000000011001111000000
00000000000000000011010001100010
00000000000000000011010100000100
00000000000000000011010110101000
00000000000000000011011001001100
00000000000000000011011011110000
00000000000000000011011110010110
00000000000000000011100000111100
00000000000000000011100011100011
00000000000000000011100110001010
00000000000000000011101000110011
00000000000000000011101011011011
00000000000000000011101110000101
00000000000000000011110000101111
00000000000000000011110011011010
00000000000000000011110110000110
00000000000000000011111000110010
00000000000000000011111011011110
00000000000000000011111110001100
00000000000000000100000000111010
00000000000000000100000011101000
00000000000000000100000110011000
00000000000000000100001001001000
00000000000000000100001011111000
00000000000000000100001110101001
00000000000000000100010001011011
00000000000000000100010100001101
00000000000000000100010111000000
00000000000000000100011001110011
00000000000000000100011100100111
00000000000000000100011111011011
00000000000000000100100010010000
00000000000000000100100101000110
00000000000000000100100111111100
00000000000000000100101010110010
00000000000000000100101101101001
00000000000000000100110000100001
00000000000000000100110011011001
00000000000000000100110110010001
00000000000000000100111001001010
00000000000000000100111100000100
00000000000000000100111110111110
00000000000000000101000001111000
00000000000000000101000100110011
00000000000000000101000111101111
00000000000000000101001010101010
00000000000000000101001101100111
00000000000000000101010000100011
00000000000000000101010011100000
00000000000000000101010110011110
00000000000000000101011001011100
00000000000000000101011100011010
00000000000000000101011111011001
00000000000000000101100010011000
00000000000000000101100101011000
00000000000000000101101000010111
00000000000000000101101011011000
00000000000000000101101110011000
00000000000000000101110001011001
00000000000000000101110100011010
00000000000000000101110111011100
00000000000000000101111010011110
00000000000000000101111101100000
00000000000000000110000000100011
00000000000000000110000011100110
00000000000000000110000110101001
00000000000000000110001001101100
00000000000000000110001100110000
00000000000000000110001111110100
00000000000000000110010010111000
00000000000000000110010101111101
00000000000000000110011001000010
00000000000000000110011100000111
00000000000000000110011111001100
00000000000000000110100010010010
00000000000000000110100101011000
00000000000000000110101000011110
00000000000000000110101011100100
00000000000000000110101110101010
00000000000000000110110001110001
00000000000000000110110100111000
00000000000000000110110111111110
00000000000000000110111011000110
00000000000000000110111110001101
00000000000000000111000001010100
00000000000000000111000100011100
00000000000000000111000111100100
00000000000000000111001010101100
00000000000000000111001101110100
00000000000000000111010000111100
00000000000000000111010100000100
00000000000000000111010111001101
00000000000000000111011010010101
00000000000000000111011101011110
00000000000000000111100000100110
00000000000000000111100011101111
00000000000000000111100110111000
00000000000000000111101010000001
00000000000000000111101101001001
00000000000000000111110000010010
00000000000000000111110011011011
00000000000000000111110110100100
00000000000000000111111001101101
00000000000000000111111100110110
