{
    "name": "Monoid.Unity.Animation.Tests",
    "references": [
        "Monoid.Unity.Animation",
        "Monoid.Unity.Animation.Editor"
    ],
    "optionalUnityReferences": [
        "TestAssemblies"
    ],
    "includePlatforms": [
        "Editor"
    ],
    "excludePlatforms": [],
    "allowUnsafeCode": false,
    "overrideReferences": false,
    "precompiledReferences": [],
    "autoReferenced": true,
    "defineConstraints": []
}