{
    "a": {
        "tres": {
            "value": "ohaloa"
        },
        "dos": {
            "value": "ohaloa"
        },
        "promo": true
    },
    "b": {
        "tres": {
            "value": "ohaloa"
        },
        "dos": {
            "value": "ohaloa"
        }
    },
    "c": {
        "tres": {
            "value": "ohaloa"
        },
        "dos": {
            "value": "ohaloa"
        }
    },
    "d": {
        "tres": {
            "value": "ohaloa"
        },
        "dos": {
            "value": "ohaloa"
        }
    }
}