(footprint "nixies-us-IN-18"
	(version 20240108)
	(generator "pcbnew")
	(generator_version "8.0")
	(layer "F.Cu")
	(descr "MAY BE USED WITH SOCKET: PL31-P")
	(tags "MAY BE USED WITH SOCKET: PL31-P")
	(property "Reference" ">NAME"
		(at 17.61998 -0.79248 90)
		(unlocked yes)
		(layer "F.SilkS")
		(uuid "b6cb5186-765a-4c66-81fb-95ace8c8ea85")
		(effects
			(font
				(size 1.27 1.27)
				(thickness 0.1016)
			)
		)
	)
	(property "Value" ""
		(at 0 0 0)
		(unlocked yes)
		(layer "F.Fab")
		(uuid "49e9b2e6-4883-4301-830f-939eada1bcc7")
		(effects
			(font
				(size 1.27 1.27)
			)
		)
	)
	(property "Footprint" ""
		(at 0 0 0)
		(unlocked yes)
		(layer "F.Fab")
		(hide yes)
		(uuid "41653056-a269-4ff4-9857-893b4c5edabf")
		(effects
			(font
				(size 1.27 1.27)
			)
		)
	)
	(property "Datasheet" ""
		(at 0 0 0)
		(unlocked yes)
		(layer "F.Fab")
		(hide yes)
		(uuid "42644154-8844-4a9d-bcce-59767f41f39f")
		(effects
			(font
				(size 1.27 1.27)
			)
		)
	)
	(property "Description" ""
		(at 0 0 0)
		(unlocked yes)
		(layer "F.Fab")
		(hide yes)
		(uuid "f627a751-e4c7-4804-bfdc-d6364dbb4fb8")
		(effects
			(font
				(size 1.27 1.27)
			)
		)
	)
	(attr exclude_from_pos_files exclude_from_bom)
	(fp_arc
		(start -12.7 0)
		(mid 0.07874 -12.62126)
		(end 12.7 0.15748)
		(stroke
			(width 0.254)
			(type solid)
		)
		(layer "F.SilkS")
		(uuid "835a7648-e650-44ff-a010-aaf9c4175693")
	)
	(fp_circle
		(center 0 0)
		(end 0 -15.81658)
		(stroke
			(width 0.254)
			(type solid)
		)
		(fill none)
		(layer "F.SilkS")
		(uuid "e8a169e5-6ecd-4efc-9a69-7921a82067d3")
	)
	(fp_circle
		(center 0 0)
		(end 0 -15.75308)
		(stroke
			(width 0.254)
			(type solid)
		)
		(fill none)
		(layer "F.SilkS")
		(uuid "3438d12c-4232-4bfb-8cbe-17c011215d95")
	)
	(fp_circle
		(center 0 0)
		(end 0 -1.27)
		(stroke
			(width 2.54)
			(type solid)
		)
		(fill none)
		(layer "B.Mask")
		(uuid "479a59ce-01a3-4696-9afc-d963e3639751")
	)
	(fp_circle
		(center 0 0)
		(end 0 -2.54)
		(stroke
			(width 0.0254)
			(type solid)
		)
		(fill none)
		(layer "F.Mask")
		(uuid "b13956fb-1a7a-4dd6-8895-ab284ae44268")
	)
	(fp_circle
		(center 0 0)
		(end 0 -1.27)
		(stroke
			(width 2.54)
			(type solid)
		)
		(fill none)
		(layer "F.Mask")
		(uuid "17bd7461-5ee1-4895-9ab2-e3b7a3fee65c")
	)
	(fp_circle
		(center 0 0)
		(end 0 -2.54)
		(stroke
			(width 0.0254)
			(type solid)
		)
		(fill none)
		(layer "Dwgs.User")
		(uuid "216bfe44-abf5-4dfd-ad44-8281b397c450")
	)
	(pad "" np_thru_hole circle
		(at 0 0)
		(size 4.99872 4.99872)
		(drill 4.99872)
		(layers "*.Cu" "*.Mask")
		(uuid "8bf4978d-1542-495c-b6c7-cebedf792cf8")
	)
	(pad "0" thru_hole circle
		(at 6.28142 6.35508)
		(size 3.19786 3.19786)
		(drill 2.2987)
		(layers "*.Cu" "*.Mask")
		(remove_unused_layers no)
		(uuid "0ea0e3e5-4752-43f8-aaba-ba17af547cc5")
	)
	(pad "1" thru_hole circle
		(at -0.64262 8.97128)
		(size 3.19786 3.19786)
		(drill 2.2987)
		(layers "*.Cu" "*.Mask")
		(remove_unused_layers no)
		(uuid "c69084f4-c6e3-40aa-a707-ed699d64e281")
	)
	(pad "2" thru_hole circle
		(at -4.32816 7.9375)
		(size 3.19786 3.19786)
		(drill 2.2987)
		(layers "*.Cu" "*.Mask")
		(remove_unused_layers no)
		(uuid "8e6fea2f-0ab4-4ffb-8ce0-5a6e4ee5a78c")
	)
	(pad "3" thru_hole circle
		(at -8.75792 -1.86182)
		(size 3.19786 3.19786)
		(drill 2.2987)
		(layers "*.Cu" "*.Mask")
		(remove_unused_layers no)
		(uuid "7de06f37-e353-4715-90a5-6733815fb405")
	)
	(pad "4" thru_hole circle
		(at 6.34746 -6.38048)
		(size 3.19786 3.19786)
		(drill 2.2987)
		(layers "*.Cu" "*.Mask")
		(remove_unused_layers no)
		(uuid "7c3da980-183f-4a65-9628-08142754870b")
	)
	(pad "5" thru_hole circle
		(at 3.08864 -8.44804)
		(size 3.19786 3.19786)
		(drill 2.2987)
		(layers "*.Cu" "*.Mask")
		(remove_unused_layers no)
		(uuid "8b2d9974-1112-46de-b7bc-169b29dd57da")
	)
	(pad "6" thru_hole circle
		(at -4.29006 -7.90448)
		(size 3.19786 3.19786)
		(drill 2.2987)
		(layers "*.Cu" "*.Mask")
		(remove_unused_layers no)
		(uuid "2394dc5f-1159-4182-9963-2247cb2d9b82")
	)
	(pad "7" thru_hole circle
		(at -7.2136 -5.3848)
		(size 3.19786 3.19786)
		(drill 2.2987)
		(layers "*.Cu" "*.Mask")
		(remove_unused_layers no)
		(uuid "f3cdecc6-0c4e-4dbc-92a7-d8813dd8febc")
	)
	(pad "8" thru_hole circle
		(at -7.2263 5.34162)
		(size 3.19786 3.19786)
		(drill 2.2987)
		(layers "*.Cu" "*.Mask")
		(remove_unused_layers no)
		(uuid "2401058f-d245-405b-afc5-b8c327dc8cbf")
	)
	(pad "9" thru_hole circle
		(at 8.45566 3.1877)
		(size 3.19786 3.19786)
		(drill 2.2987)
		(layers "*.Cu" "*.Mask")
		(remove_unused_layers no)
		(uuid "f08305fa-41eb-419c-8277-123974f0cf07")
	)
	(pad "A" thru_hole circle
		(at -0.65786 -8.97382)
		(size 3.19786 3.19786)
		(drill 2.2987)
		(layers "*.Cu" "*.Mask")
		(remove_unused_layers no)
		(uuid "db23f2e2-5d56-4ac0-ac29-ab24a03325ce")
	)
	(pad "A2" thru_hole circle
		(at 3.12166 8.39216)
		(size 3.19786 3.19786)
		(drill 2.2987)
		(layers "*.Cu" "*.Mask")
		(remove_unused_layers no)
		(uuid "d2c6d645-1222-459f-a57f-ed3ff4f1a453")
	)
	(pad "N/C" thru_hole circle
		(at 8.39216 -3.12166)
		(size 3.19786 3.19786)
		(drill 2.2987)
		(layers "*.Cu" "*.Mask")
		(remove_unused_layers no)
		(uuid "fd532e23-aa27-48ed-83f2-943b3c8f769f")
	)
	(pad "N/C2" thru_hole circle
		(at -8.78078 1.94818)
		(size 3.19786 3.19786)
		(drill 2.2987)
		(layers "*.Cu" "*.Mask")
		(remove_unused_layers no)
		(uuid "e6c34f11-c962-4cde-bba4-0d36815f64ff")
	)
)