(footprint "nixies-us-IN-3"
	(version 20240108)
	(generator "pcbnew")
	(generator_version "8.0")
	(layer "F.Cu")
	(property "Reference" ">NAME"
		(at -0.3175 4.1275 0)
		(unlocked yes)
		(layer "F.SilkS")
		(uuid "a8286eb0-16e3-4da5-9645-e6b4e56a8287")
		(effects
			(font
				(size 1.27 1.27)
				(thickness 0.1016)
			)
		)
	)
	(property "Value" ""
		(at 0 0 0)
		(unlocked yes)
		(layer "F.Fab")
		(uuid "c5bdb53d-65ad-4a92-bd8c-2d5d8d3294e6")
		(effects
			(font
				(size 1.27 1.27)
			)
		)
	)
	(property "Footprint" ""
		(at 0 0 0)
		(unlocked yes)
		(layer "F.Fab")
		(hide yes)
		(uuid "438fb0ad-b388-403e-80e8-55747ed5088e")
		(effects
			(font
				(size 1.27 1.27)
			)
		)
	)
	(property "Datasheet" ""
		(at 0 0 0)
		(unlocked yes)
		(layer "F.Fab")
		(hide yes)
		(uuid "a5887cb8-2d01-4fbb-8a30-d18db9a798eb")
		(effects
			(font
				(size 1.27 1.27)
			)
		)
	)
	(property "Description" ""
		(at 0 0 0)
		(unlocked yes)
		(layer "F.Fab")
		(hide yes)
		(uuid "de3ab401-41cb-46a8-ac1f-a1c29e112a02")
		(effects
			(font
				(size 1.27 1.27)
			)
		)
	)
	(attr exclude_from_pos_files exclude_from_bom)
	(fp_arc
		(start -3.81 0)
		(mid -0.001068 -3.732073)
		(end 3.809955 -0.002135)
		(stroke
			(width 0.254)
			(type solid)
		)
		(layer "F.SilkS")
		(uuid "d0e0c6f7-3552-4019-ae51-9f8197922c65")
	)
	(fp_circle
		(center 0 0)
		(end 0 -2.8956)
		(stroke
			(width 0.254)
			(type solid)
		)
		(fill none)
		(layer "F.SilkS")
		(uuid "c79b791d-83c7-46bc-b70f-72cadc3c7d68")
	)
	(pad "A" thru_hole circle
		(at -1.5875 0)
		(size 1.10744 1.10744)
		(drill 0.59944)
		(layers "*.Cu" "*.Mask")
		(remove_unused_layers no)
		(uuid "73c6c8b2-5aae-4a5f-b7ea-479920b77b5d")
	)
	(pad "K" thru_hole circle
		(at 1.5875 0)
		(size 1.10744 1.10744)
		(drill 0.59944)
		(layers "*.Cu" "*.Mask")
		(remove_unused_layers no)
		(uuid "863f9852-b1ee-42fd-874d-bd5c2c7b47b7")
	)
)