"fecha_transaccion","periodo","id_transaccion","agencia","banco","codigo_procesada","forma_documento","id_usuario","monto","nro_documento","rif","tipo_transaccion"
"2024-02-22","2024-02-22",1,"1","1","1","1","1","1","1","1","1"
"2024-02-22","2024-02-22",2,"1","1","1","1","1","1","1","1","1"
"2024-02-22","2024-02-22",3,"1","1","1","1","1","1","1","1","1"
"2024-02-22","2024-02-22",4,"1","1","1","1","1","1","1","1","1"
"2024-02-22","2024-02-22",5,"1","1","1","1","1","1","1","1","1"
