<?xml version="1.0" standalone="no"?>
<!DOCTYPE svg PUBLIC "-//W3C//DTD SVG 20010904//EN"
 "http://www.w3.org/TR/2001/REC-SVG-20010904/DTD/svg10.dtd">
<svg version="1.0" xmlns="http://www.w3.org/2000/svg"
 width="225.000000pt" height="225.000000pt" viewBox="0 0 225.000000 225.000000"
 preserveAspectRatio="xMidYMid meet">
<metadata>
Created by potrace 1.15, written by Peter Selinger 2001-2017
</metadata>
<g transform="translate(0.000000,225.000000) scale(0.100000,-0.100000)"
fill="#000000" stroke="none">
<path d="M345 1905 l-25 -24 0 -756 0 -756 25 -24 24 -25 406 0 405 0 0 310 0
310 -105 0 -105 0 0 125 0 125 104 0 104 0 4 138 c3 122 6 143 29 192 56 119
131 162 292 168 59 2 123 1 142 -2 l35 -7 0 -109 0 -110 -85 0 c-143 0 -165
-25 -165 -187 l0 -83 120 0 120 0 -1 -32 c0 -18 -6 -73 -12 -123 l-12 -90
-107 -3 -108 -3 0 -309 0 -310 225 0 226 0 24 25 25 24 0 756 0 756 -25 24
-24 25 -756 0 -756 0 -24 -25z"/>
</g>
</svg>
