1 0.354398 0.469556 0.030922 0.059444
1 0.659496 0.649361 0.027586 0.047556
1 0.832941 0.693201 0.040117 0.049042
1 0.891871 0.780125 0.037617 0.047556
0 0.228180 0.553438 0.293391 0.272097
0 0.777355 0.585389 0.283367 0.184417
0 0.903992 0.699139 0.190578 0.218444
0 0.751863 0.860271 0.327664 0.279458
