0 0.795746 0.896778 0.226523 0.200611
0 0.829598 0.680486 0.123711 0.160639
0 0.781117 0.585465 0.270828 0.243708
0 0.396613 0.578035 0.108664 0.297208
1 0.659914 0.517847 0.023406 0.052000
1 0.717590 0.875236 0.028414 0.056472
