0 0.792387 0.895264 0.223211 0.209472
0 0.769832 0.579444 0.290055 0.264667
0 0.228180 0.655229 0.183063 0.181431
0 0.038652 0.783028 0.077305 0.246833
1 0.048883 0.721431 0.026750 0.060917
1 0.152113 0.662736 0.022570 0.056472
1 0.698324 0.872931 0.033523 0.052167
1 0.638598 0.517847 0.029258 0.049028
