0 0.246570 0.534118 0.201453 0.298847
0 0.770668 0.586208 0.303430 0.254111
0 0.347711 0.856632 0.281687 0.286736
1 0.314277 0.443472 0.037617 0.058111
1 0.636090 0.527507 0.030930 0.047542
1 0.213512 0.757764 0.018477 0.041750
