1 0.618953 0.883410 0.028422 0.057958
1 0.669527 0.701375 0.019227 0.032694
1 0.295051 0.833625 0.037617 0.050528
1 0.163816 0.558708 0.017555 0.047556
0 0.256180 0.627819 0.210641 0.230333
0 0.776520 0.598764 0.278352 0.243861
0 0.743922 0.903438 0.291719 0.193125
0 0.187598 0.875875 0.260883 0.248250
