1 0.703801 0.945819 0.032602 0.046056
1 0.021715 0.749667 0.029258 0.057944
1 0.668691 0.669424 0.027586 0.034181
1 0.142918 0.592146 0.020898 0.037153
0 0.025695 0.783028 0.051391 0.246833
0 0.221074 0.630785 0.178883 0.197653
0 0.776520 0.592076 0.288383 0.194819
0 0.793238 0.898979 0.226523 0.202042
