0 0.086957 0.646917 0.168383 0.301833
0 0.772406 0.557681 0.238437 0.296583
0 0.949199 0.709917 0.098914 0.202111
1 0.159336 0.539306 0.017719 0.044611
1 0.691945 0.457285 0.021406 0.043319
1 0.944773 0.753868 0.028047 0.035431
