1 0.780895 0.741403 0.035430 0.063000
1 0.264531 0.558340 0.050937 0.061681
1 0.640641 0.496653 0.017719 0.048556
0 0.308453 0.550458 0.172734 0.242778
0 0.776098 0.574076 0.294539 0.271653
0 0.873836 0.811611 0.252328 0.274278
