C:\Users\marcb\eclipse-workspace\TPtestServicesREST\TPtestServicesREST\src\test\java\fr\umfds\TPtestServicesREST\BrainstomTest.java
C:\Users\marcb\eclipse-workspace\TPtestServicesREST\TPtestServicesREST\src\test\java\fr\umfds\TPtestServicesREST\ITintegrationTest.java
C:\Users\marcb\eclipse-workspace\TPtestServicesREST\TPtestServicesREST\src\test\java\fr\umfds\TPtestServicesREST\AppTest.java
