C:\Users\marcb\eclipse-workspace\TPtestServicesREST\TPtestServicesREST\src\main\java\fr\umfds\TPtestServicesREST\BrainstormDB.java
C:\Users\marcb\eclipse-workspace\TPtestServicesREST\TPtestServicesREST\src\main\java\fr\umfds\TPtestServicesREST\Idea.java
C:\Users\marcb\eclipse-workspace\TPtestServicesREST\TPtestServicesREST\src\main\java\fr\umfds\TPtestServicesREST\App.java
C:\Users\marcb\eclipse-workspace\TPtestServicesREST\TPtestServicesREST\src\main\java\fr\umfds\TPtestServicesREST\BrainstormingAppLauncher.java
C:\Users\marcb\eclipse-workspace\TPtestServicesREST\TPtestServicesREST\src\main\java\fr\umfds\TPtestServicesREST\BrainstormResource.java
C:\Users\marcb\eclipse-workspace\TPtestServicesREST\TPtestServicesREST\src\main\java\fr\umfds\TPtestServicesREST\Brainstorm.java
