<svg width="42" height="42" viewBox="0 0 42 42" fill="none" xmlns="http://www.w3.org/2000/svg">
<mask id="path-1-outside-1" maskUnits="userSpaceOnUse" x="10" y="10" width="22" height="22" fill="black">
<rect fill="white" x="10" y="10" width="22" height="22"/>
<path fill-rule="evenodd" clip-rule="evenodd" d="M28.013 30.2031C28.0044 30.1399 27.8169 28.8889 27.0122 27.9714C26.8515 27.7881 26.6661 27.6181 26.4525 27.4736C26.1898 27.2958 25.9084 27.1835 25.6271 27.1008C25.9516 26.8475 26.2519 26.5599 26.536 26.2526C27.4429 26.4364 28.4539 26.3889 29.2455 25.9093C30.5679 25.1082 30.974 23.2875 30.9889 23.2128C31.0466 22.9141 30.8744 22.6188 30.5895 22.5272C30.5346 22.5101 29.5055 22.2561 28.461 22.4517C28.5486 22.0018 28.5959 21.544 28.6044 21.0801C29.1712 20.8384 30.2157 20.3032 30.6923 19.3135C31.371 17.9056 30.7193 16.2251 30.6912 16.1539C30.5797 15.8727 30.2786 15.7216 29.9897 15.8027C29.9256 15.8208 28.5027 16.225 27.7273 17.3059C27.4986 16.8658 27.2254 16.4518 26.9185 16.0634C27.1657 15.4965 27.5234 14.4074 27.1941 13.3404C26.7329 11.8437 25.1245 11.0852 25.0564 11.0537C24.7817 10.9271 24.4624 11.0315 24.3108 11.2929C24.2725 11.3588 23.3787 12.9191 23.8404 14.4157C24.2438 15.7224 25.5212 16.466 25.8836 16.6544C27.0756 18.0704 27.5212 19.8793 27.4433 20.827C27.442 20.8429 27.4421 20.8728 27.4423 20.9157C27.4437 21.2669 27.4486 22.4877 26.7033 23.9929C25.5497 26.1882 23.3564 27.5063 21 27.5063C18.663 27.5063 16.4891 26.2137 15.3276 24.0521C14.5504 22.5222 14.5559 21.2676 14.5575 20.9105C14.5577 20.8674 14.5578 20.8373 14.5565 20.8215C14.4704 19.7821 14.9941 17.9615 16.1491 16.6134C16.5699 16.3901 17.75 15.6702 18.1436 14.4215C18.6139 12.9278 17.7305 11.3623 17.6927 11.2963C17.5422 11.0338 17.2229 10.9282 16.9482 11.0524C16.8802 11.0834 15.2671 11.8308 14.7962 13.3252C14.4552 14.4077 14.8245 15.5209 15.0685 16.0807C14.7668 16.4641 14.498 16.8724 14.2725 17.3065C13.5052 16.2357 12.1029 15.829 12.0142 15.8033L12.0121 15.8026C11.7225 15.7209 11.4227 15.8721 11.31 16.1539C11.2819 16.2245 10.629 17.9044 11.3065 19.3129C11.7832 20.3047 12.8297 20.8405 13.3959 21.0821C13.4045 21.549 13.4521 22.0099 13.5409 22.4628C12.4981 22.2613 11.4678 22.5092 11.4139 22.5272C11.1284 22.6171 10.9544 22.9111 11.0105 23.2104C11.0248 23.2851 11.4213 25.107 12.7397 25.9169C13.5375 26.4074 14.5669 26.456 15.4804 26.2693C15.7533 26.563 16.0409 26.8384 16.3509 27.0824C16.0671 27.1688 15.7836 27.2859 15.52 27.4695C15.3122 27.6138 15.1317 27.7822 14.9751 27.9635C14.1736 28.8913 13.9993 30.1537 13.9911 30.2172C13.9517 30.5188 14.1411 30.8024 14.4312 30.8759C14.7617 30.9629 15.1571 31.0078 15.5686 30.9965C16.2399 30.9781 16.9539 30.8102 17.4982 30.4319C18.283 29.8872 18.6761 28.9992 18.8656 28.3798C19.5523 28.5844 20.268 28.7012 21 28.7012C21.7215 28.7012 22.4272 28.587 23.1055 28.3879C23.2977 29.0061 23.7021 29.9142 24.5088 30.4604C25.0502 30.827 25.7651 30.9902 26.4493 30.9996C26.8508 31.005 27.2417 30.9576 27.5809 30.8671C27.8699 30.7907 28.0559 30.5042 28.013 30.2031ZM16.4294 19.8685C16.279 19.7209 16.2253 19.501 16.2904 19.3008C16.3555 19.1004 16.5282 18.9539 16.7361 18.9224L19.33 18.5322L20.5029 16.1858C20.6918 15.8092 21.3083 15.8092 21.4972 16.1858L22.6701 18.5322L25.264 18.9224C25.4719 18.9539 25.6445 19.1005 25.7096 19.3008C25.7748 19.501 25.721 19.7209 25.5707 19.8685L23.7019 21.7085L24.1318 24.2953C24.1665 24.5032 24.0808 24.7121 23.9103 24.8359C23.7441 24.9573 23.5186 24.9787 23.3274 24.8799L21 23.6717L18.6726 24.8799C18.4849 24.9759 18.2591 24.9601 18.0897 24.8359C17.9193 24.7121 17.8335 24.5031 17.8683 24.2953L18.2981 21.7085L16.4294 19.8685Z"/>
</mask>
<path fill-rule="evenodd" clip-rule="evenodd" d="M28.013 30.2031C28.0044 30.1399 27.8169 28.8889 27.0122 27.9714C26.8515 27.7881 26.6661 27.6181 26.4525 27.4736C26.1898 27.2958 25.9084 27.1835 25.6271 27.1008C25.9516 26.8475 26.2519 26.5599 26.536 26.2526C27.4429 26.4364 28.4539 26.3889 29.2455 25.9093C30.5679 25.1082 30.974 23.2875 30.9889 23.2128C31.0466 22.9141 30.8744 22.6188 30.5895 22.5272C30.5346 22.5101 29.5055 22.2561 28.461 22.4517C28.5486 22.0018 28.5959 21.544 28.6044 21.0801C29.1712 20.8384 30.2157 20.3032 30.6923 19.3135C31.371 17.9056 30.7193 16.2251 30.6912 16.1539C30.5797 15.8727 30.2786 15.7216 29.9897 15.8027C29.9256 15.8208 28.5027 16.225 27.7273 17.3059C27.4986 16.8658 27.2254 16.4518 26.9185 16.0634C27.1657 15.4965 27.5234 14.4074 27.1941 13.3404C26.7329 11.8437 25.1245 11.0852 25.0564 11.0537C24.7817 10.9271 24.4624 11.0315 24.3108 11.2929C24.2725 11.3588 23.3787 12.9191 23.8404 14.4157C24.2438 15.7224 25.5212 16.466 25.8836 16.6544C27.0756 18.0704 27.5212 19.8793 27.4433 20.827C27.442 20.8429 27.4421 20.8728 27.4423 20.9157C27.4437 21.2669 27.4486 22.4877 26.7033 23.9929C25.5497 26.1882 23.3564 27.5063 21 27.5063C18.663 27.5063 16.4891 26.2137 15.3276 24.0521C14.5504 22.5222 14.5559 21.2676 14.5575 20.9105C14.5577 20.8674 14.5578 20.8373 14.5565 20.8215C14.4704 19.7821 14.9941 17.9615 16.1491 16.6134C16.5699 16.3901 17.75 15.6702 18.1436 14.4215C18.6139 12.9278 17.7305 11.3623 17.6927 11.2963C17.5422 11.0338 17.2229 10.9282 16.9482 11.0524C16.8802 11.0834 15.2671 11.8308 14.7962 13.3252C14.4552 14.4077 14.8245 15.5209 15.0685 16.0807C14.7668 16.4641 14.498 16.8724 14.2725 17.3065C13.5052 16.2357 12.1029 15.829 12.0142 15.8033L12.0121 15.8026C11.7225 15.7209 11.4227 15.8721 11.31 16.1539C11.2819 16.2245 10.629 17.9044 11.3065 19.3129C11.7832 20.3047 12.8297 20.8405 13.3959 21.0821C13.4045 21.549 13.4521 22.0099 13.5409 22.4628C12.4981 22.2613 11.4678 22.5092 11.4139 22.5272C11.1284 22.6171 10.9544 22.9111 11.0105 23.2104C11.0248 23.2851 11.4213 25.107 12.7397 25.9169C13.5375 26.4074 14.5669 26.456 15.4804 26.2693C15.7533 26.563 16.0409 26.8384 16.3509 27.0824C16.0671 27.1688 15.7836 27.2859 15.52 27.4695C15.3122 27.6138 15.1317 27.7822 14.9751 27.9635C14.1736 28.8913 13.9993 30.1537 13.9911 30.2172C13.9517 30.5188 14.1411 30.8024 14.4312 30.8759C14.7617 30.9629 15.1571 31.0078 15.5686 30.9965C16.2399 30.9781 16.9539 30.8102 17.4982 30.4319C18.283 29.8872 18.6761 28.9992 18.8656 28.3798C19.5523 28.5844 20.268 28.7012 21 28.7012C21.7215 28.7012 22.4272 28.587 23.1055 28.3879C23.2977 29.0061 23.7021 29.9142 24.5088 30.4604C25.0502 30.827 25.7651 30.9902 26.4493 30.9996C26.8508 31.005 27.2417 30.9576 27.5809 30.8671C27.8699 30.7907 28.0559 30.5042 28.013 30.2031ZM16.4294 19.8685C16.279 19.7209 16.2253 19.501 16.2904 19.3008C16.3555 19.1004 16.5282 18.9539 16.7361 18.9224L19.33 18.5322L20.5029 16.1858C20.6918 15.8092 21.3083 15.8092 21.4972 16.1858L22.6701 18.5322L25.264 18.9224C25.4719 18.9539 25.6445 19.1005 25.7096 19.3008C25.7748 19.501 25.721 19.7209 25.5707 19.8685L23.7019 21.7085L24.1318 24.2953C24.1665 24.5032 24.0808 24.7121 23.9103 24.8359C23.7441 24.9573 23.5186 24.9787 23.3274 24.8799L21 23.6717L18.6726 24.8799C18.4849 24.9759 18.2591 24.9601 18.0897 24.8359C17.9193 24.7121 17.8335 24.5031 17.8683 24.2953L18.2981 21.7085L16.4294 19.8685Z" fill="currentColor"/>
<path d="M27.0122 27.9714L27.1626 27.8395L27.1626 27.8395L27.0122 27.9714ZM28.013 30.2031L27.8148 30.2299L27.815 30.2313L28.013 30.2031ZM26.4525 27.4736L26.3404 27.6392L26.3405 27.6393L26.4525 27.4736ZM25.6271 27.1008L25.504 26.9431L25.1969 27.1828L25.5707 27.2927L25.6271 27.1008ZM26.536 26.2526L26.5757 26.0566L26.4655 26.0343L26.3892 26.1168L26.536 26.2526ZM29.2455 25.9093L29.1418 25.7382L29.1418 25.7382L29.2455 25.9093ZM30.9889 23.2128L31.185 23.2519L31.1852 23.2508L30.9889 23.2128ZM30.5895 22.5272L30.6507 22.3368L30.6491 22.3363L30.5895 22.5272ZM28.461 22.4517L28.2647 22.4135L28.2084 22.7026L28.4978 22.6483L28.461 22.4517ZM28.6044 21.0801L28.5259 20.8961L28.4068 20.9469L28.4044 21.0764L28.6044 21.0801ZM30.6923 19.3135L30.5122 19.2267L30.5122 19.2267L30.6923 19.3135ZM30.6912 16.1539L30.8773 16.0806L30.8771 16.0802L30.6912 16.1539ZM29.9897 15.8027L29.9356 15.6101L29.9352 15.6102L29.9897 15.8027ZM27.7273 17.3059L27.5499 17.3981L27.7 17.6871L27.8899 17.4225L27.7273 17.3059ZM26.9185 16.0634L26.7352 15.9835L26.6872 16.0934L26.7616 16.1874L26.9185 16.0634ZM27.1941 13.3404L27.003 13.3993L27.003 13.3993L27.1941 13.3404ZM25.0564 11.0537L25.1404 10.8722L25.1401 10.8721L25.0564 11.0537ZM24.3108 11.2929L24.4837 11.3934L24.4838 11.3933L24.3108 11.2929ZM23.8404 14.4157L23.6493 14.4747L23.6493 14.4747L23.8404 14.4157ZM25.8836 16.6544L26.0366 16.5256L26.0111 16.4953L25.9759 16.477L25.8836 16.6544ZM27.4433 20.827L27.244 20.8106V20.8106L27.4433 20.827ZM27.4423 20.9157L27.2423 20.9165V20.9165L27.4423 20.9157ZM26.7033 23.9929L26.8804 24.086L26.8826 24.0817L26.7033 23.9929ZM15.3276 24.0521L15.1492 24.1427L15.1514 24.1468L15.3276 24.0521ZM14.5575 20.9105L14.7575 20.9114V20.9114L14.5575 20.9105ZM14.5565 20.8215L14.3572 20.838L14.3572 20.838L14.5565 20.8215ZM16.1491 16.6134L16.0554 16.4367L16.0219 16.4545L15.9973 16.4833L16.1491 16.6134ZM18.1436 14.4215L18.3343 14.4816L18.3343 14.4816L18.1436 14.4215ZM17.6927 11.2963L17.8662 11.1969L17.8662 11.1969L17.6927 11.2963ZM16.9482 11.0524L16.8658 10.8702L16.8655 10.8704L16.9482 11.0524ZM14.7962 13.3252L14.6054 13.265L14.6054 13.2651L14.7962 13.3252ZM15.0685 16.0807L15.2257 16.2043L15.2996 16.1104L15.2518 16.0008L15.0685 16.0807ZM14.2725 17.3065L14.1099 17.4229L14.2997 17.6878L14.4499 17.3987L14.2725 17.3065ZM12.0142 15.8033L11.9585 15.9953L11.9585 15.9954L12.0142 15.8033ZM12.0121 15.8026L12.0678 15.6106L12.0664 15.6102L12.0121 15.8026ZM11.31 16.1539L11.1243 16.0796L11.1241 16.0801L11.31 16.1539ZM11.3065 19.3129L11.4868 19.2263L11.4868 19.2262L11.3065 19.3129ZM13.3959 21.0821L13.5959 21.0784L13.5935 20.9489L13.4744 20.8981L13.3959 21.0821ZM13.5409 22.4628L13.5029 22.6592L13.7942 22.7155L13.7372 22.4244L13.5409 22.4628ZM11.4139 22.5272L11.474 22.718L11.4772 22.7169L11.4139 22.5272ZM11.0105 23.2104L10.8139 23.2473L10.8141 23.248L11.0105 23.2104ZM12.7397 25.9169L12.8444 25.7465L12.8444 25.7464L12.7397 25.9169ZM15.4804 26.2693L15.6269 26.1332L15.5504 26.0509L15.4403 26.0734L15.4804 26.2693ZM16.3509 27.0824L16.4092 27.2738L16.7756 27.1622L16.4747 26.9253L16.3509 27.0824ZM15.52 27.4695L15.6341 27.6338L15.6344 27.6336L15.52 27.4695ZM14.9751 27.9635L15.1265 28.0942L15.1265 28.0942L14.9751 27.9635ZM13.9911 30.2172L14.1894 30.2431L14.1895 30.2426L13.9911 30.2172ZM14.4312 30.8759L14.4821 30.6825L14.4803 30.6821L14.4312 30.8759ZM15.5686 30.9965L15.574 31.1964H15.574L15.5686 30.9965ZM17.4982 30.4319L17.3841 30.2676L17.384 30.2677L17.4982 30.4319ZM18.8656 28.3798L18.9227 28.1881L18.7324 28.1314L18.6743 28.3213L18.8656 28.3798ZM23.1055 28.3879L23.2965 28.3285L23.238 28.1405L23.0491 28.196L23.1055 28.3879ZM24.5088 30.4604L24.3967 30.626L24.3967 30.6261L24.5088 30.4604ZM26.4493 30.9996L26.4466 31.1996H26.4466L26.4493 30.9996ZM27.5809 30.8671L27.5298 30.6737L27.5294 30.6738L27.5809 30.8671ZM16.2904 19.3008L16.4806 19.3626L16.4806 19.3626L16.2904 19.3008ZM16.4294 19.8685L16.5697 19.726L16.5695 19.7258L16.4294 19.8685ZM16.7361 18.9224L16.7063 18.7247L16.7061 18.7247L16.7361 18.9224ZM19.33 18.5322L19.3597 18.73L19.4624 18.7145L19.5089 18.6216L19.33 18.5322ZM20.5029 16.1858L20.3241 16.0962L20.324 16.0964L20.5029 16.1858ZM21.4972 16.1858L21.6761 16.0964L21.676 16.0962L21.4972 16.1858ZM22.6701 18.5322L22.4912 18.6216L22.5377 18.7145L22.6404 18.73L22.6701 18.5322ZM25.264 18.9224L25.294 18.7247L25.2938 18.7247L25.264 18.9224ZM25.7096 19.3008L25.8998 19.2389H25.8998L25.7096 19.3008ZM25.5707 19.8685L25.4306 19.7258L25.4304 19.726L25.5707 19.8685ZM23.7019 21.7085L23.5616 21.5659L23.4876 21.6388L23.5046 21.7412L23.7019 21.7085ZM24.1318 24.2953L23.9345 24.3281L23.9345 24.3282L24.1318 24.2953ZM23.9103 24.8359L23.7928 24.674L23.7923 24.6744L23.9103 24.8359ZM23.3274 24.8799L23.2353 25.0574L23.2356 25.0575L23.3274 24.8799ZM21 23.6717L21.0922 23.4942L21 23.4463L20.9079 23.4942L21 23.6717ZM18.6726 24.8799L18.7637 25.0579L18.7648 25.0574L18.6726 24.8799ZM18.0897 24.8359L18.2081 24.6746L18.2072 24.674L18.0897 24.8359ZM17.8683 24.2953L18.0655 24.3282L18.0656 24.3281L17.8683 24.2953ZM18.2981 21.7085L18.4954 21.7412L18.5125 21.6388L18.4385 21.5659L18.2981 21.7085ZM26.8619 28.1032C27.6255 28.974 27.8072 30.1741 27.8148 30.2299L28.2112 30.1763C28.2016 30.1056 28.0083 28.8038 27.1626 27.8395L26.8619 28.1032ZM26.3405 27.6393C26.5382 27.773 26.7109 27.9312 26.8619 28.1032L27.1626 27.8395C26.992 27.645 26.794 27.4632 26.5646 27.308L26.3405 27.6393ZM25.5707 27.2927C25.8399 27.3718 26.1004 27.4768 26.3404 27.6392L26.5647 27.308C26.2793 27.1148 25.9769 26.9951 25.6835 26.9089L25.5707 27.2927ZM26.3892 26.1168C26.1104 26.4183 25.8179 26.6981 25.504 26.9431L25.7501 27.2584C26.0852 26.9969 26.3934 26.7014 26.6829 26.3884L26.3892 26.1168ZM29.1418 25.7382C28.4084 26.1826 27.454 26.2345 26.5757 26.0566L26.4963 26.4486C27.4318 26.6382 28.4995 26.5951 29.3491 26.0803L29.1418 25.7382ZM30.7927 23.1737C30.7876 23.1994 30.6867 23.6566 30.4269 24.2027C30.166 24.7509 29.7554 25.3666 29.1418 25.7382L29.3491 26.0803C30.058 25.6509 30.5116 24.9556 30.7881 24.3746C31.0656 23.7913 31.1752 23.3009 31.185 23.2519L30.7927 23.1737ZM30.5282 22.7176C30.7146 22.7775 30.8315 22.9731 30.7925 23.1748L31.1852 23.2508C31.2618 22.855 31.0342 22.4601 30.6507 22.3368L30.5282 22.7176ZM28.4978 22.6483C28.9947 22.5552 29.4923 22.5686 29.8756 22.6086C30.0665 22.6285 30.2272 22.6548 30.3429 22.6771C30.4007 22.6882 30.447 22.6982 30.48 22.7059C30.5154 22.7141 30.5309 22.7184 30.5298 22.7181L30.6491 22.3363C30.576 22.3135 29.5119 22.0514 28.4242 22.2552L28.4978 22.6483ZM28.4044 21.0764C28.3961 21.5292 28.35 21.9753 28.2647 22.4135L28.6573 22.49C28.7472 22.0282 28.7956 21.5589 28.8043 21.0838L28.4044 21.0764ZM30.5122 19.2267C30.0697 20.1455 29.0876 20.6566 28.5259 20.8961L28.6828 21.2641C29.2548 21.0202 30.3617 20.4609 30.8725 19.4003L30.5122 19.2267ZM30.5051 16.2272C30.516 16.2547 30.6799 16.6761 30.7586 17.2592C30.8375 17.8445 30.8277 18.5721 30.5122 19.2267L30.8725 19.4004C31.2356 18.647 31.2393 17.8304 31.155 17.2057C31.0704 16.5788 30.8945 16.1243 30.8773 16.0806L30.5051 16.2272ZM30.0437 15.9952C30.2324 15.9423 30.4309 16.0401 30.5053 16.2277L30.8771 16.0802C30.7284 15.7054 30.3248 15.5009 29.9356 15.6101L30.0437 15.9952ZM27.8899 17.4225C28.252 16.9176 28.7711 16.5642 29.2172 16.3334C29.6613 16.1035 30.0189 16.0023 30.0442 15.9951L29.9352 15.6102C29.8963 15.6213 29.5105 15.7312 29.0333 15.9781C28.558 16.2241 27.978 16.6133 27.5648 17.1893L27.8899 17.4225ZM26.7616 16.1874C27.0614 16.5668 27.3276 16.9703 27.5499 17.3981L27.9048 17.2137C27.6697 16.7613 27.3894 16.3367 27.0754 15.9394L26.7616 16.1874ZM27.003 13.3993C27.3104 14.3955 26.9773 15.428 26.7352 15.9835L27.1018 16.1434C27.354 15.565 27.7363 14.4193 27.3853 13.2814L27.003 13.3993ZM24.9724 11.2352C24.9979 11.247 25.4009 11.4364 25.8517 11.8028C26.3039 12.1704 26.7886 12.7035 27.003 13.3993L27.3853 13.2815C27.1385 12.4806 26.5883 11.8861 26.104 11.4924C25.6182 11.0975 25.1829 10.8919 25.1404 10.8722L24.9724 11.2352ZM24.4838 11.3933C24.5847 11.2194 24.7935 11.1527 24.9726 11.2353L25.1401 10.8721C24.7699 10.7014 24.3402 10.8436 24.1378 11.1926L24.4838 11.3933ZM24.0315 14.3568C23.8168 13.6607 23.9152 12.9399 24.0801 12.3737C24.2444 11.8096 24.469 11.4186 24.4837 11.3934L24.1379 11.1924C24.1142 11.2331 23.8728 11.6552 23.6961 12.2619C23.5199 12.8665 23.4023 13.6742 23.6493 14.4747L24.0315 14.3568ZM25.9759 16.477C25.8036 16.3874 25.4094 16.1634 25.011 15.8056C24.612 15.4473 24.2189 14.9638 24.0315 14.3567L23.6493 14.4747C23.8653 15.1743 24.3126 15.716 24.7437 16.1032C25.1755 16.491 25.6012 16.733 25.7914 16.8319L25.9759 16.477ZM27.6427 20.8433C27.7252 19.8389 27.2599 17.9788 26.0366 16.5256L25.7306 16.7832C26.8914 18.1621 27.3172 19.9196 27.244 20.8106L27.6427 20.8433ZM27.6423 20.9149C27.6422 20.893 27.6422 20.8761 27.6423 20.8627C27.6424 20.848 27.6427 20.8431 27.6427 20.8433L27.244 20.8106C27.2418 20.8375 27.2422 20.8793 27.2423 20.9165L27.6423 20.9149ZM26.8826 24.0817C27.6478 22.536 27.6438 21.2791 27.6423 20.9149L27.2423 20.9165C27.2437 21.2547 27.2493 22.4394 26.5241 23.9042L26.8826 24.0817ZM21 27.7063C23.4325 27.7063 25.693 26.3455 26.8804 24.086L26.5263 23.8999C25.4064 26.0309 23.2804 27.3063 21 27.3063V27.7063ZM15.1514 24.1468C16.3471 26.3718 18.5878 27.7063 21 27.7063V27.3063C18.7383 27.3063 16.6312 26.0556 15.5038 23.9574L15.1514 24.1468ZM14.3575 20.9096C14.3558 21.2798 14.3511 22.5715 15.1493 24.1427L15.5059 23.9615C14.7497 22.4729 14.756 21.2554 14.7575 20.9114L14.3575 20.9096ZM14.3572 20.838C14.3571 20.8376 14.3574 20.8424 14.3575 20.8572C14.3576 20.8707 14.3576 20.8876 14.3575 20.9096L14.7575 20.9114C14.7576 20.8741 14.758 20.832 14.7558 20.8049L14.3572 20.838ZM15.9973 16.4833C15.4012 17.1789 14.9701 17.9937 14.6986 18.767C14.4281 19.5377 14.3111 20.2818 14.3572 20.838L14.7558 20.8049C14.7158 20.3218 14.8175 19.636 15.0761 18.8995C15.3337 18.1656 15.742 17.396 16.301 16.7435L15.9973 16.4833ZM17.9528 14.3614C17.5848 15.5292 16.4695 16.2169 16.0554 16.4367L16.2429 16.7901C16.6703 16.5632 17.9153 15.8112 18.3343 14.4816L17.9528 14.3614ZM17.5192 11.3958C17.5336 11.4209 17.7556 11.8132 17.9163 12.3782C18.0776 12.9453 18.1716 13.6666 17.9528 14.3614L18.3343 14.4816C18.5859 13.6826 18.4733 12.8743 18.3011 12.2688C18.1282 11.6611 17.8896 11.2377 17.8662 11.1969L17.5192 11.3958ZM17.0307 11.2347C17.2099 11.1536 17.4191 11.2212 17.5192 11.3958L17.8662 11.1969C17.6653 10.8464 17.2359 10.7028 16.8658 10.8702L17.0307 11.2347ZM14.9869 13.3853C15.2059 12.6905 15.694 12.1606 16.1484 11.796C16.6014 11.4327 17.0055 11.2461 17.031 11.2345L16.8655 10.8704C16.8229 10.8897 16.3864 11.0923 15.8981 11.484C15.4113 11.8745 14.8574 12.4654 14.6054 13.265L14.9869 13.3853ZM15.2518 16.0008C15.0126 15.4519 14.6685 14.3961 14.9869 13.3852L14.6054 13.2651C14.2418 14.4194 14.6364 15.59 14.8851 16.1606L15.2518 16.0008ZM14.4499 17.3987C14.6691 16.9768 14.931 16.5789 15.2257 16.2043L14.9113 15.957C14.6027 16.3493 14.3268 16.768 14.095 17.2142L14.4499 17.3987ZM11.9585 15.9954C11.9966 16.0064 12.3553 16.1102 12.7963 16.3403C13.2393 16.5714 13.7516 16.9229 14.1099 17.4229L14.435 17.19C14.0261 16.6193 13.4536 16.232 12.9814 15.9857C12.5073 15.7383 12.1205 15.6258 12.0699 15.6112L11.9585 15.9954ZM11.9563 15.9947L11.9585 15.9953L12.07 15.6112L12.0678 15.6106L11.9563 15.9947ZM11.4957 16.2282C11.5713 16.0389 11.7691 15.9419 11.9578 15.9951L12.0664 15.6102C11.6759 15.5 11.274 15.7052 11.1243 16.0796L11.4957 16.2282ZM11.4868 19.2262C11.1718 18.5713 11.1625 17.8437 11.2418 17.2586C11.3209 16.6756 11.4852 16.2545 11.4958 16.2277L11.1241 16.0801C11.1067 16.1239 10.9305 16.5781 10.8455 17.2048C10.7608 17.8294 10.7638 18.646 11.1263 19.3996L11.4868 19.2262ZM13.4744 20.8981C12.9132 20.6587 11.9293 20.147 11.4868 19.2263L11.1263 19.3995C11.6371 20.4624 12.7462 21.0223 13.3174 21.266L13.4744 20.8981ZM13.7372 22.4244C13.6507 21.9833 13.6043 21.5341 13.5959 21.0784L13.1959 21.0857C13.2047 21.5639 13.2535 22.0364 13.3446 22.5013L13.7372 22.4244ZM11.4772 22.7169C11.4763 22.7172 11.5387 22.7004 11.6593 22.6778C11.7748 22.6561 11.9354 22.6306 12.1263 22.6117C12.5094 22.5738 13.0069 22.5633 13.5029 22.6592L13.5788 22.2665C13.0321 22.1608 12.4931 22.1735 12.0869 22.2137C11.6847 22.2534 11.3973 22.3219 11.3506 22.3375L11.4772 22.7169ZM11.2071 23.1736C11.1692 22.9714 11.2873 22.7767 11.4739 22.718L11.3539 22.3364C10.9695 22.4574 10.7396 22.8508 10.8139 23.2473L11.2071 23.1736ZM12.8444 25.7464C12.2326 25.3706 11.8251 24.7526 11.5671 24.203C11.439 23.9301 11.3501 23.6791 11.2925 23.492C11.2637 23.3986 11.2428 23.3215 11.2287 23.266C11.2217 23.2383 11.2165 23.216 11.2128 23.1999C11.211 23.1919 11.2096 23.1854 11.2086 23.1807C11.2081 23.1783 11.2077 23.1764 11.2074 23.175C11.2072 23.1743 11.2071 23.1738 11.207 23.1734C11.207 23.173 11.2069 23.1728 11.2069 23.1728L10.8141 23.248C10.8236 23.2976 10.9306 23.7884 11.205 24.3729C11.4785 24.9554 11.9284 25.6532 12.635 26.0873L12.8444 25.7464ZM15.4403 26.0734C14.5556 26.2542 13.5836 26.201 12.8444 25.7465L12.6349 26.0872C13.4913 26.6138 14.5782 26.6579 15.5204 26.4653L15.4403 26.0734ZM16.4747 26.9253C16.1747 26.6892 15.8947 26.4213 15.6269 26.1332L15.3339 26.4055C15.6119 26.7046 15.9071 26.9876 16.2272 27.2396L16.4747 26.9253ZM15.6344 27.6336C15.8752 27.4658 16.1378 27.3564 16.4092 27.2738L16.2927 26.8911C15.9965 26.9813 15.6919 27.106 15.4057 27.3054L15.6344 27.6336ZM15.1265 28.0942C15.2734 27.9241 15.4416 27.7674 15.6341 27.6338L15.406 27.3052C15.1827 27.4602 14.99 27.6403 14.8238 27.8327L15.1265 28.0942ZM14.1895 30.2426C14.1968 30.1853 14.366 28.9745 15.1265 28.0942L14.8238 27.8327C13.9812 28.8081 13.8017 30.1221 13.7928 30.1918L14.1895 30.2426ZM14.4803 30.6821C14.291 30.6341 14.1628 30.4469 14.1894 30.2431L13.7928 30.1912C13.7406 30.5908 13.9911 30.9707 14.382 31.0698L14.4803 30.6821ZM15.5631 30.7966C15.1686 30.8074 14.7923 30.7641 14.4821 30.6825L14.3803 31.0694C14.7311 31.1616 15.1456 31.2082 15.574 31.1964L15.5631 30.7966ZM17.384 30.2677C16.8817 30.6169 16.2097 30.7789 15.5631 30.7966L15.574 31.1964C16.2702 31.1774 17.0262 31.0036 17.6123 30.5961L17.384 30.2677ZM18.6743 28.3213C18.4895 28.9254 18.1138 29.7611 17.3841 30.2676L17.6122 30.5962C18.4522 30.0132 18.8627 29.0729 19.0568 28.4383L18.6743 28.3213ZM21 28.5012C20.2894 28.5012 19.593 28.3878 18.9227 28.1881L18.8085 28.5715C19.5117 28.781 20.2467 28.9012 21 28.9012V28.5012ZM23.0491 28.196C22.387 28.3904 21.7003 28.5012 21 28.5012V28.9012C21.7427 28.9012 22.4674 28.7837 23.1618 28.5798L23.0491 28.196ZM24.6209 30.2948C23.8707 29.7868 23.484 28.9319 23.2965 28.3285L22.9145 28.4473C23.1113 29.0803 23.5335 30.0416 24.3967 30.626L24.6209 30.2948ZM26.4521 30.7996C25.7931 30.7906 25.1203 30.6329 24.6209 30.2948L24.3967 30.6261C24.9802 31.0211 25.737 31.1898 26.4466 31.1996L26.4521 30.7996ZM27.5294 30.6738C27.2094 30.7592 26.8368 30.8048 26.4521 30.7996L26.4466 31.1996C26.8648 31.2052 27.2741 31.1559 27.6325 31.0603L27.5294 30.6738ZM27.815 30.2313C27.844 30.4351 27.7177 30.624 27.5298 30.6737L27.6321 31.0604C28.0221 30.9573 28.2678 30.5732 28.211 30.1748L27.815 30.2313ZM16.1002 19.2389C16.0116 19.5113 16.0847 19.8104 16.2893 20.0112L16.5695 19.7258C16.4733 19.6313 16.4389 19.4908 16.4806 19.3626L16.1002 19.2389ZM16.7061 18.7247C16.4232 18.7675 16.1887 18.9668 16.1002 19.2389L16.4806 19.3626C16.5224 19.2341 16.6331 19.1403 16.766 19.1202L16.7061 18.7247ZM19.3002 18.3344L16.7063 18.7247L16.7658 19.1202L19.3597 18.73L19.3002 18.3344ZM20.324 16.0964L19.1511 18.4428L19.5089 18.6216L20.6818 16.2753L20.324 16.0964ZM21.676 16.0962C21.5398 15.8246 21.2579 15.7033 21 15.7033C20.7422 15.7033 20.4603 15.8246 20.3241 16.0962L20.6816 16.2755C20.7344 16.1704 20.8552 16.1033 21 16.1033C21.1449 16.1033 21.2657 16.1704 21.3184 16.2755L21.676 16.0962ZM22.849 18.4428L21.6761 16.0964L21.3183 16.2753L22.4912 18.6216L22.849 18.4428ZM25.2938 18.7247L22.6999 18.3344L22.6404 18.73L25.2343 19.1202L25.2938 18.7247ZM25.8998 19.2389C25.8113 18.9668 25.5768 18.7676 25.294 18.7247L25.2341 19.1202C25.3669 19.1403 25.4776 19.2341 25.5194 19.3626L25.8998 19.2389ZM25.7108 20.0112C25.9153 19.8104 25.9884 19.5113 25.8998 19.2389L25.5194 19.3626C25.5611 19.4908 25.5267 19.6313 25.4306 19.7258L25.7108 20.0112ZM23.8422 21.851L25.711 20.011L25.4304 19.726L23.5616 21.5659L23.8422 21.851ZM24.3291 24.2625L23.8992 21.6757L23.5046 21.7412L23.9345 24.3281L24.3291 24.2625ZM24.0278 24.9977C24.2596 24.8295 24.3763 24.5451 24.3291 24.2623L23.9345 24.3282C23.9567 24.4612 23.902 24.5948 23.7928 24.674L24.0278 24.9977ZM23.2356 25.0575C23.4952 25.1917 23.8018 25.1629 24.0283 24.9974L23.7923 24.6744C23.6864 24.7518 23.5421 24.7657 23.4192 24.7022L23.2356 25.0575ZM20.9079 23.8492L23.2353 25.0574L23.4196 24.7023L21.0922 23.4942L20.9079 23.8492ZM18.7648 25.0574L21.0922 23.8492L20.9079 23.4942L18.5805 24.7023L18.7648 25.0574ZM17.9714 24.9971C18.2033 25.1673 18.5104 25.1875 18.7637 25.0579L18.5816 24.7018C18.4593 24.7643 18.3148 24.7529 18.2081 24.6746L17.9714 24.9971ZM17.671 24.2623C17.6237 24.5451 17.7405 24.8295 17.9722 24.9977L18.2072 24.674C18.098 24.5948 18.0433 24.4612 18.0655 24.3282L17.671 24.2623ZM18.1009 21.6757L17.671 24.2625L18.0656 24.3281L18.4954 21.7412L18.1009 21.6757ZM16.2891 20.011L18.1578 21.851L18.4385 21.5659L16.5697 19.726L16.2891 20.011Z" fill="currentColor" mask="url(#path-1-outside-1)"/>
</svg>
