{
  "en": ["i","my","myself","we","our","ours","ourselves","you",
    "your","yours","yourself","yourselves","he","him","his","himself","she","her","hers","herself","it",
    "its","itself","they","them","their","theirs","themselves","which","whom","this","that","these",
    "those","am","is","are","was","were","be","been","being","have","has","had","having","do","does",
    "did","doing","a","an","the","and","but","if","or","because","as","until","while","of","at","by",
    "for","with","about","against","between","into","through","during","before","after","above","below",
    "to","from","in","out","off","over","under","again","further","then","once","here","there","all",
    "any","both","each","few","more","most","other","some","such","only","own","same",
    "so","than","very","s","can","will","just","don","should","now",
    "ve","d","much","many","may","might","must","need", "would", "could"]
}