{"data":
    [
        {
            "coordinates":
            {
                "latitude":33,
                "longitude":65
            },
            "name":"Afghanistan",
            "code":"AF",
            "population":29121286,
            "updated_at":"2021-01-12T06:27:12.352Z",
            "today":
            {
                "deaths":13,
                "confirmed":62
            },
            "latest_data":
            {
                "deaths":2301,
                "confirmed":53584,
                "recovered":44137,
                "critical":7146,
                "calculated":
                {
                    "death_rate":4.294192296207823,
                    "recovery_rate":82.36973723499553,
                    "recovered_vs_death_ratio":null,
                    "cases_per_million_population":93
                }
            }
        }
    ]
}