%YAML 1.1
%TAG !u! tag:unity3d.com,2011:
--- !u!114 &11400000
MonoBehaviour:
  m_ObjectHideFlags: 0
  m_CorrespondingSourceObject: {fileID: 0}
  m_PrefabInstance: {fileID: 0}
  m_PrefabAsset: {fileID: 0}
  m_GameObject: {fileID: 0}
  m_Enabled: 1
  m_EditorHideFlags: 0
  m_Script: {fileID: 11500000, guid: 9fa5d40a25deaa64b96d565a9e91663e, type: 3}
  m_Name: Stage 12
  m_EditorClassIdentifier: 
  boardRows: 16
  col: 11
  gameRows: 22
  initBalls: 42
  IsFix: 0
  stageBoard:
  - stageObstacles:
    - resistance: 0
      type: 3
    - resistance: 0
      type: 3
    - resistance: 0
      type: 3
    - resistance: 0
      type: 3
    - resistance: 28
      type: 0
    - resistance: 51
      type: 0
    - resistance: 71
      type: 0
    - resistance: 0
      type: 3
    - resistance: 0
      type: 3
    - resistance: 0
      type: 3
    - resistance: 0
      type: 3
  - stageObstacles:
    - resistance: 0
      type: 3
    - resistance: 0
      type: 3
    - resistance: 0
      type: 3
    - resistance: 0
      type: 3
    - resistance: 26
      type: 0
    - resistance: 45
      type: 1
    - resistance: 28
      type: 0
    - resistance: 0
      type: 3
    - resistance: 49
      type: 0
    - resistance: 30
      type: 0
    - resistance: 57
      type: 0
  - stageObstacles:
    - resistance: 0
      type: 3
    - resistance: 57
      type: 0
    - resistance: 0
      type: 3
    - resistance: 0
      type: 3
    - resistance: 2
      type: 4
    - resistance: 25
      type: 0
    - resistance: 2
      type: 4
    - resistance: 0
      type: 3
    - resistance: 25
      type: 0
    - resistance: 45
      type: 1
    - resistance: 35
      type: 0
  - stageObstacles:
    - resistance: 17
      type: 0
    - resistance: 45
      type: 1
    - resistance: 33
      type: 0
    - resistance: 0
      type: 3
    - resistance: 2
      type: 4
    - resistance: 35
      type: 0
    - resistance: 2
      type: 4
    - resistance: 0
      type: 3
    - resistance: 35
      type: 0
    - resistance: 26
      type: 0
    - resistance: 41
      type: 0
  - stageObstacles:
    - resistance: 18
      type: 0
    - resistance: 11
      type: 0
    - resistance: 25
      type: 0
    - resistance: 0
      type: 3
    - resistance: 2
      type: 4
    - resistance: 35
      type: 0
    - resistance: 2
      type: 4
    - resistance: 0
      type: 3
    - resistance: 3
      type: 0
    - resistance: 30
      type: 0
    - resistance: 25
      type: 0
  - stageObstacles:
    - resistance: 0
      type: 3
    - resistance: 35
      type: 0
    - resistance: 0
      type: 3
    - resistance: 0
      type: 3
    - resistance: 2
      type: 4
    - resistance: 2
      type: 4
    - resistance: 2
      type: 4
    - resistance: 0
      type: 3
    - resistance: 0
      type: 3
    - resistance: 43
      type: 0
    - resistance: 0
      type: 3
  - stageObstacles:
    - resistance: 0
      type: 3
    - resistance: 35
      type: 0
    - resistance: 0
      type: 3
    - resistance: 0
      type: 3
    - resistance: 0
      type: 3
    - resistance: 45
      type: 0
    - resistance: 0
      type: 3
    - resistance: 0
      type: 3
    - resistance: 0
      type: 3
    - resistance: 35
      type: 0
    - resistance: 0
      type: 3
  - stageObstacles:
    - resistance: 0
      type: 3
    - resistance: 35
      type: 0
    - resistance: 0
      type: 3
    - resistance: 0
      type: 3
    - resistance: 45
      type: 0
    - resistance: 0
      type: 3
    - resistance: 45
      type: 0
    - resistance: 0
      type: 3
    - resistance: 0
      type: 3
    - resistance: 35
      type: 0
    - resistance: 0
      type: 3
  - stageObstacles:
    - resistance: 0
      type: 3
    - resistance: 35
      type: 0
    - resistance: 0
      type: 3
    - resistance: 45
      type: 0
    - resistance: 0
      type: 3
    - resistance: 40
      type: 0
    - resistance: 0
      type: 3
    - resistance: 45
      type: 0
    - resistance: 0
      type: 3
    - resistance: 0
      type: 3
    - resistance: 0
      type: 3
  - stageObstacles:
    - resistance: 0
      type: 3
    - resistance: 0
      type: 3
    - resistance: 45
      type: 0
    - resistance: 0
      type: 3
    - resistance: 40
      type: 0
    - resistance: 0
      type: 3
    - resistance: 40
      type: 0
    - resistance: 0
      type: 3
    - resistance: 45
      type: 0
    - resistance: 0
      type: 3
    - resistance: 0
      type: 3
  - stageObstacles:
    - resistance: 0
      type: 3
    - resistance: 45
      type: 0
    - resistance: 0
      type: 3
    - resistance: 40
      type: 0
    - resistance: 0
      type: 3
    - resistance: 50
      type: 2
    - resistance: 0
      type: 3
    - resistance: 40
      type: 0
    - resistance: 0
      type: 3
    - resistance: 45
      type: 0
    - resistance: 0
      type: 3
  - stageObstacles:
    - resistance: 45
      type: 0
    - resistance: 0
      type: 3
    - resistance: 40
      type: 0
    - resistance: 0
      type: 3
    - resistance: 50
      type: 2
    - resistance: 40
      type: 0
    - resistance: 50
      type: 2
    - resistance: 0
      type: 3
    - resistance: 40
      type: 0
    - resistance: 0
      type: 3
    - resistance: 45
      type: 0
  - stageObstacles:
    - resistance: 0
      type: 3
    - resistance: 40
      type: 0
    - resistance: 0
      type: 3
    - resistance: 50
      type: 2
    - resistance: 10
      type: 0
    - resistance: 25
      type: 0
    - resistance: 10
      type: 0
    - resistance: 50
      type: 2
    - resistance: 0
      type: 3
    - resistance: 40
      type: 0
    - resistance: 0
      type: 3
  - stageObstacles:
    - resistance: 40
      type: 0
    - resistance: 0
      type: 3
    - resistance: 50
      type: 2
    - resistance: 40
      type: 0
    - resistance: 21
      type: 0
    - resistance: 3
      type: 4
    - resistance: 23
      type: 0
    - resistance: 40
      type: 0
    - resistance: 50
      type: 2
    - resistance: 0
      type: 3
    - resistance: 40
      type: 0
  - stageObstacles:
    - resistance: 0
      type: 3
    - resistance: 50
      type: 2
    - resistance: 35
      type: 0
    - resistance: 17
      type: 0
    - resistance: 3
      type: 4
    - resistance: 16
      type: 0
    - resistance: 3
      type: 4
    - resistance: 10
      type: 0
    - resistance: 35
      type: 0
    - resistance: 50
      type: 2
    - resistance: 0
      type: 3
  - stageObstacles:
    - resistance: 60
      type: 2
    - resistance: 40
      type: 0
    - resistance: 33
      type: 0
    - resistance: 52
      type: 0
    - resistance: 39
      type: 0
    - resistance: 40
      type: 0
    - resistance: 25
      type: 0
    - resistance: 58
      type: 0
    - resistance: 25
      type: 0
    - resistance: 40
      type: 0
    - resistance: 60
      type: 2
  - stageObstacles:
    - resistance: 50
      type: 2
    - resistance: 50
      type: 2
    - resistance: 50
      type: 2
    - resistance: 50
      type: 2
    - resistance: 50
      type: 2
    - resistance: 50
      type: 2
    - resistance: 50
      type: 2
    - resistance: 50
      type: 2
    - resistance: 50
      type: 2
    - resistance: 50
      type: 2
    - resistance: 50
      type: 2
  - stageObstacles:
    - resistance: 0
      type: 3
    - resistance: 0
      type: 3
    - resistance: 0
      type: 3
    - resistance: 0
      type: 3
    - resistance: 0
      type: 3
    - resistance: 0
      type: 3
    - resistance: 0
      type: 3
    - resistance: 0
      type: 3
    - resistance: 0
      type: 3
    - resistance: 0
      type: 3
    - resistance: 0
      type: 3
  - stageObstacles:
    - resistance: 0
      type: 3
    - resistance: 0
      type: 3
    - resistance: 0
      type: 3
    - resistance: 0
      type: 3
    - resistance: 0
      type: 3
    - resistance: 0
      type: 3
    - resistance: 0
      type: 3
    - resistance: 0
      type: 3
    - resistance: 0
      type: 3
    - resistance: 0
      type: 3
    - resistance: 0
      type: 3
  - stageObstacles:
    - resistance: 0
      type: 3
    - resistance: 0
      type: 3
    - resistance: 0
      type: 3
    - resistance: 0
      type: 3
    - resistance: 0
      type: 3
    - resistance: 0
      type: 3
    - resistance: 0
      type: 3
    - resistance: 0
      type: 3
    - resistance: 0
      type: 3
    - resistance: 0
      type: 3
    - resistance: 0
      type: 3
  - stageObstacles:
    - resistance: 0
      type: 3
    - resistance: 0
      type: 3
    - resistance: 0
      type: 3
    - resistance: 0
      type: 3
    - resistance: 0
      type: 3
    - resistance: 0
      type: 3
    - resistance: 0
      type: 3
    - resistance: 0
      type: 3
    - resistance: 0
      type: 3
    - resistance: 0
      type: 3
    - resistance: 0
      type: 3
  - stageObstacles:
    - resistance: 0
      type: 3
    - resistance: 0
      type: 3
    - resistance: 0
      type: 3
    - resistance: 0
      type: 3
    - resistance: 0
      type: 3
    - resistance: 0
      type: 3
    - resistance: 0
      type: 3
    - resistance: 0
      type: 3
    - resistance: 0
      type: 3
    - resistance: 0
      type: 3
    - resistance: 0
      type: 3
