%YAML 1.1
%TAG !u! tag:unity3d.com,2011:
--- !u!114 &11400000
MonoBehaviour:
  m_ObjectHideFlags: 0
  m_CorrespondingSourceObject: {fileID: 0}
  m_PrefabInstance: {fileID: 0}
  m_PrefabAsset: {fileID: 0}
  m_GameObject: {fileID: 0}
  m_Enabled: 1
  m_EditorHideFlags: 0
  m_Script: {fileID: 11500000, guid: 9fa5d40a25deaa64b96d565a9e91663e, type: 3}
  m_Name: Stage 4
  m_EditorClassIdentifier: 
  boardRows: 9
  col: 7
  gameRows: 13
  initBalls: 40
  IsFix: 0
  stageBoard:
  - stageObstacles:
    - resistance: 20
      type: 0
    - resistance: 0
      type: 3
    - resistance: 25
      type: 0
    - resistance: 2
      type: 4
    - resistance: 20
      type: 0
    - resistance: 0
      type: 3
    - resistance: 15
      type: 0
  - stageObstacles:
    - resistance: 18
      type: 0
    - resistance: 2
      type: 4
    - resistance: 20
      type: 0
    - resistance: 0
      type: 3
    - resistance: 30
      type: 0
    - resistance: 2
      type: 4
    - resistance: 5
      type: 0
  - stageObstacles:
    - resistance: 15
      type: 0
    - resistance: 2
      type: 4
    - resistance: 30
      type: 0
    - resistance: 0
      type: 3
    - resistance: 22
      type: 0
    - resistance: 2
      type: 4
    - resistance: 18
      type: 0
  - stageObstacles:
    - resistance: 40
      type: 0
    - resistance: 0
      type: 3
    - resistance: 30
      type: 0
    - resistance: 2
      type: 4
    - resistance: 15
      type: 0
    - resistance: 0
      type: 3
    - resistance: 25
      type: 0
  - stageObstacles:
    - resistance: 45
      type: 0
    - resistance: 55
      type: 0
    - resistance: 45
      type: 0
    - resistance: 60
      type: 2
    - resistance: 50
      type: 0
    - resistance: 40
      type: 0
    - resistance: 45
      type: 0
  - stageObstacles:
    - resistance: 40
      type: 0
    - resistance: 2
      type: 4
    - resistance: 18
      type: 0
    - resistance: 0
      type: 3
    - resistance: 25
      type: 0
    - resistance: 2
      type: 4
    - resistance: 24
      type: 0
  - stageObstacles:
    - resistance: 24
      type: 0
    - resistance: 0
      type: 3
    - resistance: 10
      type: 0
    - resistance: 2
      type: 4
    - resistance: 40
      type: 0
    - resistance: 0
      type: 3
    - resistance: 30
      type: 0
  - stageObstacles:
    - resistance: 25
      type: 0
    - resistance: 0
      type: 3
    - resistance: 35
      type: 0
    - resistance: 2
      type: 4
    - resistance: 25
      type: 0
    - resistance: 0
      type: 3
    - resistance: 10
      type: 0
  - stageObstacles:
    - resistance: 20
      type: 0
    - resistance: 2
      type: 4
    - resistance: 20
      type: 0
    - resistance: 0
      type: 3
    - resistance: 25
      type: 0
    - resistance: 2
      type: 4
    - resistance: 15
      type: 0
  - stageObstacles:
    - resistance: 0
      type: 3
    - resistance: 0
      type: 3
    - resistance: 0
      type: 3
    - resistance: 0
      type: 3
    - resistance: 0
      type: 3
    - resistance: 0
      type: 3
    - resistance: 0
      type: 3
  - stageObstacles:
    - resistance: 0
      type: 3
    - resistance: 0
      type: 3
    - resistance: 0
      type: 3
    - resistance: 0
      type: 3
    - resistance: 0
      type: 3
    - resistance: 0
      type: 3
    - resistance: 0
      type: 3
  - stageObstacles:
    - resistance: 0
      type: 3
    - resistance: 0
      type: 3
    - resistance: 0
      type: 3
    - resistance: 0
      type: 3
    - resistance: 0
      type: 3
    - resistance: 0
      type: 3
    - resistance: 0
      type: 3
  - stageObstacles:
    - resistance: 0
      type: 3
    - resistance: 0
      type: 3
    - resistance: 0
      type: 3
    - resistance: 0
      type: 3
    - resistance: 0
      type: 3
    - resistance: 0
      type: 3
    - resistance: 0
      type: 3
