{
	"info": {
		"_postman_id": "5909004c-0f0d-433c-9324-9244813e3564",
		"name": "QA refresher Go Rest",
		"schema": "https://schema.getpostman.com/json/collection/v2.1.0/collection.json",
		"_exporter_id": "24279693"
	},
	"item": [
		{
			"name": "New Request",
			"event": [
				{
					"listen": "test",
					"script": {
						"exec": [
							"pm.test(\"fetching id value from response body\", function(){",
							"   const jsonData=pm.response.json();",
							"   const id= jsonData.id;",
							"   pm.collectionVariables.set(\"idValue\", id);",
							"})"
						],
						"type": "text/javascript"
					}
				}
			],
			"request": {
				"auth": {
					"type": "bearer"
				},
				"method": "POST",
				"header": [
					{
						"key": "Authorization",
						"value": "Bearer 2a1b912708dc70387080d7256a82521fc550ee0ebbcaf42ba64e480f67a90a90",
						"type": "text"
					}
				],
				"body": {
					"mode": "raw",
					"raw": "{\n        \"name\": \"Mohit\",\n        \"email\": \"mohit1@gmail.com\",\n        \"gender\": \"male\",\n        \"status\": \"active\"\n    }",
					"options": {
						"raw": {
							"language": "json"
						}
					}
				},
				"url": {
					"raw": "https://gorest.co.in//public/v2/users",
					"protocol": "https",
					"host": [
						"gorest",
						"co",
						"in"
					],
					"path": [
						"",
						"public",
						"v2",
						"users"
					]
				}
			},
			"response": []
		},
		{
			"name": "New Request",
			"request": {
				"method": "DELETE",
				"header": [
					{
						"key": "Authorization",
						"value": "Bearer 2a1b912708dc70387080d7256a82521fc550ee0ebbcaf42ba64e480f67a90a90",
						"type": "text"
					}
				],
				"url": {
					"raw": "https://gorest.co.in/public/v2/users/{{idValue}}",
					"protocol": "https",
					"host": [
						"gorest",
						"co",
						"in"
					],
					"path": [
						"public",
						"v2",
						"users",
						"{{idValue}}"
					]
				}
			},
			"response": []
		},
		{
			"name": "New Request",
			"protocolProfileBehavior": {
				"disableBodyPruning": true
			},
			"request": {
				"method": "GET",
				"header": [],
				"body": {
					"mode": "raw",
					"raw": ""
				},
				"url": {
					"raw": "https://gorest.co.in/public/v2/users",
					"protocol": "https",
					"host": [
						"gorest",
						"co",
						"in"
					],
					"path": [
						"public",
						"v2",
						"users"
					]
				}
			},
			"response": []
		},
		{
			"name": "New Request",
			"request": {
				"method": "PUT",
				"header": [
					{
						"key": "Authorization",
						"value": "Bearer 2a1b912708dc70387080d7256a82521fc550ee0ebbcaf42ba64e480f67a90a90",
						"type": "text"
					}
				],
				"body": {
					"mode": "raw",
					"raw": "{\n\n    \"email\": \"mohit12@gmail.com\",\n    \"gender\": \"male\",\n    \"status\": \"active\"\n}",
					"options": {
						"raw": {
							"language": "json"
						}
					}
				},
				"url": {
					"raw": "https://gorest.co.in/public/v2/users/{{idValue}}",
					"protocol": "https",
					"host": [
						"gorest",
						"co",
						"in"
					],
					"path": [
						"public",
						"v2",
						"users",
						"{{idValue}}"
					]
				}
			},
			"response": []
		}
	],
	"event": [
		{
			"listen": "prerequest",
			"script": {
				"type": "text/javascript",
				"exec": [
					""
				]
			}
		},
		{
			"listen": "test",
			"script": {
				"type": "text/javascript",
				"exec": [
					""
				]
			}
		}
	],
	"variable": [
		{
			"key": "idValue",
			"value": " 156822",
			"type": "string"
		}
	]
}