{
    "environment": "production",
    "app": "ft-node-app",
    "server": {
      "port": 8080,
      "livenessPath": "/liveness/healthz"
    },
    "logger": {
      "level": "info"
    },
    "signal": {
      "graceFultimeout": 1000,
      "closeConnectionTimeout": 1000,
      "beforeDestroyTimeout": 2000
    },
    "service": {
      "test-service": {
        "base_url": "http://dev-api.freighttiger.com/dev",
        "timeout": 10000
      }
    },
  
    "ui_config": {
      "app1": {
        "service_url": "/test",
        "router_base_path": "/app1/"
      },
      "common": {
        "service_url": "/app",
        "api_path": "/api"
      }
    }
  }
  