<svg width="44" height="36" viewBox="0 0 44 36" fill="none" xmlns="http://www.w3.org/2000/svg">
<path d="M33.5884 8.56677L17.0337 4.65906C16.8482 4.61537 16.6549 4.61828 16.4709 4.66751C16.2868 4.71674 16.1179 4.81077 15.9792 4.94118L3.59922 16.5903C3.4485 16.7319 3.33881 16.9116 3.28166 17.1102C3.22452 17.3089 3.22204 17.5193 3.27449 17.7192L5.66003 26.6088C5.71381 26.8097 5.8211 26.9923 5.97049 27.1371C6.11989 27.2819 6.3058 27.3836 6.50847 27.4314L23.0632 31.3391C23.2486 31.3828 23.442 31.3799 23.626 31.3307C23.81 31.2814 23.9789 31.1874 24.1176 31.057L36.4976 19.4079C36.6492 19.2654 36.7593 19.0845 36.8162 18.8845C36.873 18.6844 36.8745 18.4728 36.8205 18.272L34.4349 9.38238C34.3802 9.18303 34.2727 9.00209 34.1238 8.85856C33.9748 8.71504 33.7899 8.61424 33.5884 8.56677ZM34.0956 17.0076L28.5957 15.7086L32.7083 11.8377L34.0956 17.0076ZM25.9088 15.0742L20.0876 13.7003L18.3793 7.33454L30.9753 10.308L25.9088 15.0742ZM20.6032 20.0666L16.1942 19.0265L19.4917 15.9246L23.9008 16.9647L20.6032 20.0666ZM16.1536 7.93003L17.8619 14.2958L13.5086 18.3918L6.73413 16.7936L16.1536 7.93003ZM5.99933 18.9836L11.4992 20.2827L7.38668 24.1535L5.99933 18.9836ZM14.1862 20.917L20.0074 22.2909L21.7156 28.6567L9.11968 25.6832L14.1862 20.917ZM23.9414 28.0612L22.2331 21.6954L26.5864 17.5994L33.3608 19.1976L23.9414 28.0612Z" fill="#AC5422"/>
<g filter="url(#filter0_b_526_23707)">
<path d="M40.4986 20.3017C40.5766 20.6519 40.4609 21.017 40.1955 21.2582L29.0043 31.4294C28.4503 31.9329 27.5593 31.6711 27.3652 30.9479L21.3216 8.42685C21.1259 7.69779 21.7779 7.0237 22.5134 7.19454L37.7884 10.7424C38.1634 10.8295 38.4553 11.124 38.5389 11.4996L40.4986 20.3017Z" fill="#D7692A" fill-opacity="0.05"/>
</g>
<defs>
<filter id="filter0_b_526_23707" x="18.2871" y="4.16797" width="25.2363" height="30.5234" filterUnits="userSpaceOnUse" color-interpolation-filters="sRGB">
<feFlood flood-opacity="0" result="BackgroundImageFix"/>
<feGaussianBlur in="BackgroundImageFix" stdDeviation="1.5"/>
<feComposite in2="SourceAlpha" operator="in" result="effect1_backgroundBlur_526_23707"/>
<feBlend mode="normal" in="SourceGraphic" in2="effect1_backgroundBlur_526_23707" result="shape"/>
</filter>
</defs>
</svg>
