<svg xmlns="http://www.w3.org/2000/svg" width="60" height="60" viewBox="0 0 60 60" fill="none">
<path d="M0 8C0 3.58172 3.58172 0 8 0H52C56.4183 0 60 3.58172 60 8V52C60 56.4183 56.4183 60 52 60H8C3.58172 60 0 56.4183 0 52V8Z" fill="#FDF4D5"/>
<path fill-rule="evenodd" clip-rule="evenodd" d="M15 24.3164L27.9005 31.7645C28.0394 31.8447 28.1851 31.9026 28.3333 31.9394V46.3846L15.9201 39.0384C15.3498 38.701 15 38.0875 15 37.4248L15 24.3164Z" fill="#F3C72D"/>
<path fill-rule="evenodd" clip-rule="evenodd" d="M45.0003 24.1172V37.4236C45.0003 38.0863 44.6505 38.6997 44.0803 39.0372L31.667 46.3834V31.8116C31.6972 31.7965 31.7272 31.7804 31.7569 31.7633L45.0003 24.1172Z" fill="#F3C72D"/>
<path opacity="0.5" fill-rule="evenodd" clip-rule="evenodd" d="M15.4053 20.7014C15.5628 20.5024 15.7617 20.3343 15.9936 20.2108L29.1186 13.2201C29.6696 12.9266 30.3305 12.9266 30.8815 13.2201L44.0065 20.2108C44.1852 20.306 44.3444 20.4277 44.4801 20.5697L30.0899 28.8778C29.9953 28.9325 29.9081 28.995 29.8286 29.064C29.7491 28.995 29.6618 28.9325 29.5672 28.8778L15.4053 20.7014Z" fill="#F3C72D"/>
</svg>