<svg width="16" height="16" viewBox="0 0 16 16" fill="none" xmlns="http://www.w3.org/2000/svg">
<path d="M15.1479 14.352L11.6274 10.8322C12.6478 9.60711 13.1566 8.03583 13.048 6.44518C12.9394 4.85453 12.2218 3.36699 11.0443 2.29199C9.8669 1.21699 8.32035 0.637312 6.72641 0.673537C5.13247 0.709762 3.61386 1.3591 2.48648 2.48648C1.3591 3.61386 0.709762 5.13247 0.673537 6.72641C0.637312 8.32035 1.21699 9.8669 2.29199 11.0443C3.36699 12.2218 4.85453 12.9394 6.44518 13.048C8.03583 13.1566 9.60711 12.6478 10.8322 11.6274L14.352 15.1479C14.4043 15.2002 14.4663 15.2417 14.5346 15.2699C14.6029 15.2982 14.6761 15.3128 14.75 15.3128C14.8239 15.3128 14.8971 15.2982 14.9654 15.2699C15.0336 15.2417 15.0957 15.2002 15.1479 15.1479C15.2002 15.0957 15.2417 15.0336 15.2699 14.9654C15.2982 14.8971 15.3128 14.8239 15.3128 14.75C15.3128 14.6761 15.2982 14.6029 15.2699 14.5346C15.2417 14.4663 15.2002 14.4043 15.1479 14.352ZM1.81248 6.87498C1.81248 5.87371 2.10939 4.89493 2.66566 4.0624C3.22194 3.22988 4.01259 2.58101 4.93764 2.19784C5.86269 1.81467 6.88059 1.71441 7.86262 1.90975C8.84465 2.10509 9.7467 2.58725 10.4547 3.29525C11.1627 4.00325 11.6449 4.9053 11.8402 5.88733C12.0355 6.86936 11.9353 7.88726 11.5521 8.81231C11.169 9.73736 10.5201 10.528 9.68755 11.0843C8.85503 11.6406 7.87625 11.9375 6.87498 11.9375C5.53278 11.936 4.24597 11.4021 3.29689 10.4531C2.34781 9.50398 1.81397 8.21718 1.81248 6.87498Z" fill="#A5A9AE"/>
</svg>
