<svg width="18" height="19" viewBox="0 0 18 19" fill="none" xmlns="http://www.w3.org/2000/svg">
<path opacity="0.2" d="M15.75 4.3375V7.15H2.25V4.3375C2.25 4.18832 2.30926 4.04524 2.41475 3.93975C2.52024 3.83426 2.66332 3.775 2.8125 3.775H15.1875C15.3367 3.775 15.4798 3.83426 15.5852 3.93975C15.6907 4.04524 15.75 4.18832 15.75 4.3375Z" fill="grey"/>
<path d="M15.1875 3.2125H2.8125C2.51413 3.2125 2.22798 3.33103 2.017 3.54201C1.80603 3.75298 1.6875 4.03913 1.6875 4.3375V14.4625C1.6875 14.7609 1.80603 15.047 2.017 15.258C2.22798 15.469 2.51413 15.5875 2.8125 15.5875H15.1875C15.4859 15.5875 15.772 15.469 15.983 15.258C16.194 15.047 16.3125 14.7609 16.3125 14.4625V4.3375C16.3125 4.03913 16.194 3.75298 15.983 3.54201C15.772 3.33103 15.4859 3.2125 15.1875 3.2125ZM15.1875 4.3375V6.5875H2.8125V4.3375H15.1875ZM15.1875 14.4625H2.8125V7.7125H15.1875V14.4625Z" fill="grey"/>
</svg>
