<svg width="18" height="18" viewBox="0 0 18 18" fill="none" xmlns="http://www.w3.org/2000/svg">
<path opacity="0.2" d="M12.1767 9H5.82324L8.99996 2.25L12.1767 9Z" fill="#F9C43D"/>
<path d="M4.26023 12.3216C4.32708 12.3531 4.39948 12.3711 4.4733 12.3746C4.54712 12.3781 4.62091 12.3671 4.69045 12.3421C4.75999 12.3171 4.82392 12.2786 4.87859 12.2289C4.93326 12.1791 4.9776 12.1191 5.00906 12.0523L6.18047 9.5625H11.8195L12.9909 12.0523C13.0224 12.1191 13.0668 12.1791 13.1214 12.2288C13.1761 12.2785 13.24 12.317 13.3096 12.342C13.3791 12.367 13.4529 12.3781 13.5267 12.3746C13.6005 12.3711 13.6729 12.353 13.7398 12.3216C13.8066 12.2901 13.8666 12.2457 13.9163 12.1911C13.966 12.1364 14.0045 12.0725 14.0295 12.0029C14.0545 11.9334 14.0656 11.8596 14.0621 11.7858C14.0586 11.712 14.0405 11.6396 14.0091 11.5727L9.50906 2.01023C9.46364 1.9136 9.39164 1.83189 9.3015 1.77465C9.21135 1.71742 9.10678 1.68703 9 1.68703C8.89322 1.68703 8.78865 1.71742 8.6985 1.77465C8.60836 1.83189 8.53636 1.9136 8.49094 2.01023L3.99094 11.5727C3.95942 11.6396 3.94139 11.712 3.93787 11.7858C3.93435 11.8596 3.94541 11.9334 3.97042 12.0029C3.99543 12.0725 4.0339 12.1364 4.08362 12.1911C4.13335 12.2458 4.19337 12.2901 4.26023 12.3216ZM9 3.57117L11.2901 8.4375H6.70992L9 3.57117ZM15.75 15.1875C15.75 15.3367 15.6907 15.4798 15.5852 15.5852C15.4798 15.6907 15.3367 15.75 15.1875 15.75H2.8125C2.66332 15.75 2.52024 15.6907 2.41475 15.5852C2.30926 15.4798 2.25 15.3367 2.25 15.1875C2.25 15.0383 2.30926 14.8952 2.41475 14.7898C2.52024 14.6843 2.66332 14.625 2.8125 14.625H15.1875C15.3367 14.625 15.4798 14.6843 15.5852 14.7898C15.6907 14.8952 15.75 15.0383 15.75 15.1875Z" fill="#F9C43D"/>
</svg>
