<svg width="25" height="25" viewBox="0 0 25 25" fill="none" xmlns="http://www.w3.org/2000/svg">
<g clip-path="url(#clip0_257_1799)">
<path d="M4.40332 14.4875V5.48755C4.40332 5.28864 4.48234 5.09787 4.62299 4.95722C4.76364 4.81657 4.95441 4.73755 5.15332 4.73755H20.1533C20.3522 4.73755 20.543 4.81657 20.6837 4.95722C20.8243 5.09787 20.9033 5.28864 20.9033 5.48755V20.4875C20.9033 20.6865 20.8243 20.8772 20.6837 21.0179C20.543 21.1585 20.3522 21.2375 20.1533 21.2375H13.4033" stroke="#5C2700" stroke-width="2" stroke-linecap="round" stroke-linejoin="round"/>
<path d="M4.40332 18.9875L6.65332 21.2375L11.9033 15.9875" stroke="#5C2700" stroke-width="2" stroke-linecap="round" stroke-linejoin="round"/>
</g>
<defs>
<clipPath id="clip0_257_1799">
<rect width="24" height="24" fill="white" transform="translate(0.65332 0.987549)"/>
</clipPath>
</defs>
</svg>
