<svg width="20" height="20" viewBox="0 0 20 20" fill="none" xmlns="http://www.w3.org/2000/svg">
<path d="M17.5 10C17.5 10.1658 17.4341 10.3247 17.3169 10.4419C17.1997 10.5591 17.0407 10.625 16.875 10.625H9.99998C9.83422 10.625 9.67525 10.5591 9.55804 10.4419C9.44083 10.3247 9.37498 10.1658 9.37498 10C9.37498 9.83424 9.44083 9.67527 9.55804 9.55805C9.67525 9.44084 9.83422 9.375 9.99998 9.375H16.875C17.0407 9.375 17.1997 9.44084 17.3169 9.55805C17.4341 9.67527 17.5 9.83424 17.5 10ZM9.99998 5.625H16.875C17.0407 5.625 17.1997 5.55915 17.3169 5.44194C17.4341 5.32473 17.5 5.16576 17.5 5C17.5 4.83424 17.4341 4.67527 17.3169 4.55805C17.1997 4.44084 17.0407 4.375 16.875 4.375H9.99998C9.83422 4.375 9.67525 4.44084 9.55804 4.55805C9.44083 4.67527 9.37498 4.83424 9.37498 5C9.37498 5.16576 9.44083 5.32473 9.55804 5.44194C9.67525 5.55915 9.83422 5.625 9.99998 5.625ZM16.875 14.375H9.99998C9.83422 14.375 9.67525 14.4408 9.55804 14.5581C9.44083 14.6753 9.37498 14.8342 9.37498 15C9.37498 15.1658 9.44083 15.3247 9.55804 15.4419C9.67525 15.5591 9.83422 15.625 9.99998 15.625H16.875C17.0407 15.625 17.1997 15.5591 17.3169 15.4419C17.4341 15.3247 17.5 15.1658 17.5 15C17.5 14.8342 17.4341 14.6753 17.3169 14.5581C17.1997 14.4408 17.0407 14.375 16.875 14.375ZM6.43279 3.30781L4.37498 5.3664L3.56717 4.55781C3.44989 4.44053 3.29083 4.37465 3.12498 4.37465C2.95913 4.37465 2.80007 4.44053 2.68279 4.55781C2.56552 4.67508 2.49963 4.83414 2.49963 5C2.49963 5.16585 2.56552 5.32491 2.68279 5.44218L3.93279 6.69218C3.99084 6.75029 4.05977 6.79639 4.13564 6.82785C4.21152 6.8593 4.29285 6.87549 4.37498 6.87549C4.45712 6.87549 4.53845 6.8593 4.61432 6.82785C4.69019 6.79639 4.75912 6.75029 4.81717 6.69218L7.31717 4.19218C7.43444 4.07491 7.50033 3.91585 7.50033 3.75C7.50033 3.58414 7.43444 3.42508 7.31717 3.30781C7.19989 3.19053 7.04083 3.12465 6.87498 3.12465C6.70913 3.12465 6.55007 3.19053 6.43279 3.30781ZM6.43279 8.30781L4.37498 10.3664L3.56717 9.55781C3.44989 9.44053 3.29083 9.37465 3.12498 9.37465C2.95913 9.37465 2.80007 9.44053 2.68279 9.55781C2.56552 9.67508 2.49963 9.83414 2.49963 10C2.49963 10.0821 2.51581 10.1634 2.54724 10.2393C2.57866 10.3152 2.62472 10.3841 2.68279 10.4422L3.93279 11.6922C3.99084 11.7503 4.05977 11.7964 4.13564 11.8278C4.21152 11.8593 4.29285 11.8755 4.37498 11.8755C4.45712 11.8755 4.53845 11.8593 4.61432 11.8278C4.69019 11.7964 4.75912 11.7503 4.81717 11.6922L7.31717 9.19218C7.43444 9.07491 7.50033 8.91585 7.50033 8.75C7.50033 8.58414 7.43444 8.42508 7.31717 8.30781C7.19989 8.19053 7.04083 8.12465 6.87498 8.12465C6.70913 8.12465 6.55007 8.19053 6.43279 8.30781ZM6.43279 13.3078L4.37498 15.3664L3.56717 14.5578C3.5091 14.4997 3.44016 14.4537 3.36429 14.4223C3.28842 14.3908 3.2071 14.3746 3.12498 14.3746C3.04286 14.3746 2.96154 14.3908 2.88567 14.4223C2.8098 14.4537 2.74086 14.4997 2.68279 14.5578C2.62472 14.6159 2.57866 14.6848 2.54724 14.7607C2.51581 14.8366 2.49963 14.9179 2.49963 15C2.49963 15.0821 2.51581 15.1634 2.54724 15.2393C2.57866 15.3152 2.62472 15.3841 2.68279 15.4422L3.93279 16.6922C3.99084 16.7503 4.05977 16.7964 4.13564 16.8278C4.21152 16.8593 4.29285 16.8755 4.37498 16.8755C4.45712 16.8755 4.53845 16.8593 4.61432 16.8278C4.69019 16.7964 4.75912 16.7503 4.81717 16.6922L7.31717 14.1922C7.43444 14.0749 7.50033 13.9158 7.50033 13.75C7.50033 13.5841 7.43444 13.4251 7.31717 13.3078C7.19989 13.1905 7.04083 13.1246 6.87498 13.1246C6.70913 13.1246 6.55007 13.1905 6.43279 13.3078Z" fill="black"/>
</svg>
