<svg width="18" height="19" viewBox="0 0 18 19" fill="none" xmlns="http://www.w3.org/2000/svg">
<g clip-path="url(#clip0_796_3783)">
<path d="M15.1875 4.4375H2.8125" stroke="#D7692A" stroke-width="1.5" stroke-linecap="round" stroke-linejoin="round"/>
<path d="M7.3125 7.8125V12.3125" stroke="#D7692A" stroke-width="1.5" stroke-linecap="round" stroke-linejoin="round"/>
<path d="M10.6875 7.8125V12.3125" stroke="#D7692A" stroke-width="1.5" stroke-linecap="round" stroke-linejoin="round"/>
<path d="M14.0625 4.4375V15.125C14.0625 15.2742 14.0032 15.4173 13.8977 15.5227C13.7923 15.6282 13.6492 15.6875 13.5 15.6875H4.5C4.35082 15.6875 4.20774 15.6282 4.10225 15.5227C3.99676 15.4173 3.9375 15.2742 3.9375 15.125V4.4375" stroke="#D7692A" stroke-width="1.5" stroke-linecap="round" stroke-linejoin="round"/>
<path d="M11.8125 4.4375V3.3125C11.8125 3.01413 11.694 2.72798 11.483 2.517C11.272 2.30603 10.9859 2.1875 10.6875 2.1875H7.3125C7.01413 2.1875 6.72798 2.30603 6.51701 2.517C6.30603 2.72798 6.1875 3.01413 6.1875 3.3125V4.4375" stroke="#D7692A" stroke-width="1.5" stroke-linecap="round" stroke-linejoin="round"/>
</g>
<defs>
<clipPath id="clip0_796_3783">
<rect width="18" height="18" fill="white" transform="translate(0 0.5)"/>
</clipPath>
</defs>
</svg>
