<svg width="18" height="19" viewBox="0 0 18 19" fill="none" xmlns="http://www.w3.org/2000/svg">
<path opacity="0.2" d="M10.6875 5.82501V12.575C10.6875 12.7242 10.6282 12.8673 10.5227 12.9728C10.4173 13.0782 10.2742 13.1375 10.125 13.1375H2.8125C2.66332 13.1375 2.52024 13.0782 2.41475 12.9728C2.30926 12.8673 2.25 12.7242 2.25 12.575V5.82501C2.25 5.67583 2.30926 5.53275 2.41475 5.42726C2.52024 5.32178 2.66332 5.26251 2.8125 5.26251H10.125C10.2742 5.26251 10.4173 5.32178 10.5227 5.42726C10.6282 5.53275 10.6875 5.67583 10.6875 5.82501Z" fill="grey"/>
<path d="M14.0625 1.88751H5.0625C4.76413 1.88751 4.47798 2.00604 4.267 2.21702C4.05603 2.428 3.9375 2.71414 3.9375 3.01251V4.70001H2.8125C2.51413 4.70001 2.22798 4.81854 2.017 5.02952C1.80603 5.2405 1.6875 5.52664 1.6875 5.82501V12.575C1.6875 12.8734 1.80603 13.1595 2.017 13.3705C2.22798 13.5815 2.51413 13.7 2.8125 13.7H3.9375V15.3875C3.9375 15.6859 4.05603 15.972 4.267 16.183C4.47798 16.394 4.76413 16.5125 5.0625 16.5125H14.0625C14.3609 16.5125 14.647 16.394 14.858 16.183C15.069 15.972 15.1875 15.6859 15.1875 15.3875V3.01251C15.1875 2.71414 15.069 2.428 14.858 2.21702C14.647 2.00604 14.3609 1.88751 14.0625 1.88751ZM11.25 7.51251H14.0625V10.8875H11.25V7.51251ZM5.0625 3.01251H14.0625V6.38751H11.25V5.82501C11.25 5.52664 11.1315 5.2405 10.9205 5.02952C10.7095 4.81854 10.4234 4.70001 10.125 4.70001H5.0625V3.01251ZM2.8125 5.82501H10.125V11.4381C10.125 11.4423 10.125 11.4458 10.125 11.45C10.125 11.4542 10.125 11.4577 10.125 11.462V12.575H2.8125V5.82501ZM5.0625 15.3875V13.7H10.125C10.4234 13.7 10.7095 13.5815 10.9205 13.3705C11.1315 13.1595 11.25 12.8734 11.25 12.575V12.0125H14.0625V15.3875H5.0625ZM4.79812 11.0239L3.95438 7.64892C3.93502 7.57679 3.93023 7.50153 3.94027 7.42753C3.95031 7.35353 3.97499 7.28226 4.01286 7.2179C4.05073 7.15353 4.10104 7.09736 4.16085 7.05264C4.22067 7.00792 4.28879 6.97557 4.36124 6.95745C4.43369 6.93934 4.50902 6.93584 4.58284 6.94715C4.65665 6.95845 4.72748 6.98435 4.79119 7.02332C4.85489 7.06229 4.9102 7.11355 4.95389 7.17412C4.99757 7.23469 5.02876 7.30336 5.04563 7.37611L5.52094 9.27454L5.96531 8.38439C6.01196 8.29078 6.08379 8.21204 6.17272 8.157C6.26165 8.10196 6.36416 8.0728 6.46875 8.0728C6.57334 8.0728 6.67585 8.10196 6.76478 8.157C6.85371 8.21204 6.92554 8.29078 6.97219 8.38439L7.41656 9.27454L7.89187 7.37611C7.9301 7.23363 8.02276 7.11187 8.1499 7.03706C8.27704 6.96225 8.42848 6.94038 8.57159 6.97616C8.7147 7.01194 8.83803 7.1025 8.915 7.22834C8.99198 7.35418 9.01644 7.50522 8.98313 7.64892L8.13938 11.0239C8.11134 11.1353 8.0499 11.2354 7.96329 11.3108C7.87669 11.3862 7.76908 11.4333 7.65492 11.4458C7.63461 11.448 7.61419 11.4492 7.59375 11.4493C7.48925 11.4494 7.38679 11.4203 7.29787 11.3655C7.20895 11.3106 7.13708 11.232 7.09031 11.1385L6.46875 9.8954L5.84719 11.1392C5.79581 11.2421 5.71414 11.3268 5.61317 11.3818C5.5122 11.4369 5.39679 11.4596 5.28248 11.4471C5.16817 11.4345 5.06046 11.3872 4.97386 11.3115C4.88726 11.2359 4.82592 11.1355 4.79812 11.0239Z" fill="grey"/>
</svg>
