<svg width="18" height="19" viewBox="0 0 18 19" fill="none" xmlns="http://www.w3.org/2000/svg">
<path opacity="0.2" d="M14.625 15.225H3.375V3.97501C6.35869 3.97501 9.22017 5.16027 11.33 7.27005C13.4397 9.37984 14.625 12.2413 14.625 15.225Z" fill="#F9C43D"/>
<path d="M6.95461 11.6454C7.42618 12.1144 7.80006 12.6722 8.0546 13.2867C8.30913 13.9011 8.43928 14.5599 8.4375 15.225C8.4375 15.3742 8.37824 15.5173 8.27275 15.6228C8.16726 15.7282 8.02418 15.7875 7.875 15.7875C7.72582 15.7875 7.58274 15.7282 7.47725 15.6228C7.37176 15.5173 7.3125 15.3742 7.3125 15.225C7.3125 14.1807 6.89766 13.1792 6.15923 12.4408C5.42081 11.7023 4.41929 11.2875 3.375 11.2875C3.22582 11.2875 3.08274 11.2282 2.97725 11.1228C2.87176 11.0173 2.8125 10.8742 2.8125 10.725C2.8125 10.5758 2.87176 10.4327 2.97725 10.3273C3.08274 10.2218 3.22582 10.1625 3.375 10.1625C4.04007 10.1607 4.6989 10.2909 5.31333 10.5454C5.92777 10.7999 6.48563 11.1738 6.95461 11.6454ZM3.375 6.7875C3.22582 6.7875 3.08274 6.84677 2.97725 6.95226C2.87176 7.05775 2.8125 7.20082 2.8125 7.35C2.8125 7.49919 2.87176 7.64226 2.97725 7.74775C3.08274 7.85324 3.22582 7.9125 3.375 7.9125C4.33529 7.9125 5.28618 8.10165 6.17337 8.46913C7.06057 8.83662 7.86669 9.37526 8.54572 10.0543C9.22475 10.7333 9.76338 11.5394 10.1309 12.4266C10.4984 13.3138 10.6875 14.2647 10.6875 15.225C10.6875 15.3742 10.7468 15.5173 10.8523 15.6228C10.9577 15.7282 11.1008 15.7875 11.25 15.7875C11.3992 15.7875 11.5423 15.7282 11.6477 15.6228C11.7532 15.5173 11.8125 15.3742 11.8125 15.225C11.8125 12.9872 10.9236 10.8411 9.34121 9.25879C7.75888 7.67645 5.61276 6.7875 3.375 6.7875ZM11.7274 6.87258C10.6332 5.7722 9.33151 4.8998 7.89781 4.30587C6.46411 3.71195 4.92685 3.4083 3.375 3.4125C3.22582 3.4125 3.08274 3.47177 2.97725 3.57726C2.87176 3.68275 2.8125 3.82582 2.8125 3.975C2.8125 4.12419 2.87176 4.26726 2.97725 4.37275C3.08274 4.47824 3.22582 4.5375 3.375 4.5375C4.77907 4.53365 6.16996 4.80834 7.46716 5.34566C8.76435 5.88298 9.94209 6.67226 10.9322 7.66782C11.9277 8.65792 12.717 9.83565 13.2543 11.1328C13.7917 12.43 14.0663 13.8209 14.0625 15.225C14.0625 15.3742 14.1218 15.5173 14.2273 15.6228C14.3327 15.7282 14.4758 15.7875 14.625 15.7875C14.7742 15.7875 14.9173 15.7282 15.0227 15.6228C15.1282 15.5173 15.1875 15.3742 15.1875 15.225C15.1917 13.6732 14.888 12.1359 14.2941 10.7022C13.7002 9.26852 12.8278 7.96686 11.7274 6.87258ZM3.65625 14.1C3.48937 14.1 3.32624 14.1495 3.18749 14.2422C3.04873 14.3349 2.94059 14.4667 2.87673 14.6209C2.81287 14.775 2.79616 14.9447 2.82871 15.1084C2.86127 15.272 2.94163 15.4224 3.05963 15.5404C3.17763 15.6584 3.32797 15.7387 3.49164 15.7713C3.65531 15.8038 3.82496 15.7871 3.97914 15.7233C4.13331 15.6594 4.26509 15.5513 4.3578 15.4125C4.45052 15.2738 4.5 15.1106 4.5 14.9438C4.5 14.72 4.41111 14.5054 4.25287 14.3471C4.09464 14.1889 3.88003 14.1 3.65625 14.1Z" fill="#F9C43D"/>
</svg>
