<svg width="25" height="25" viewBox="0 0 25 25" fill="none" xmlns="http://www.w3.org/2000/svg">
<g clip-path="url(#clip0_257_1803)">
<path d="M8.52832 15.9875C11.2207 15.9875 13.4033 13.8049 13.4033 11.1125C13.4033 8.42016 11.2207 6.23755 8.52832 6.23755C5.83593 6.23755 3.65332 8.42016 3.65332 11.1125C3.65332 13.8049 5.83593 15.9875 8.52832 15.9875Z" stroke="#5C2700" stroke-width="2" stroke-linecap="round" stroke-linejoin="round"/>
<path d="M1.6123 19.7376C2.36145 18.5857 3.38643 17.6392 4.59418 16.984C5.80193 16.3288 7.15421 15.9856 8.52824 15.9856C9.90228 15.9856 11.2546 16.3288 12.4623 16.984C13.6701 17.6392 14.695 18.5857 15.4442 19.7376" stroke="#5C2700" stroke-width="2" stroke-linecap="round" stroke-linejoin="round"/>
<path d="M16.7783 15.9876C18.1523 15.9867 19.5047 16.3294 20.7125 16.9843C21.9203 17.6392 22.9453 18.5856 23.6943 19.7376" stroke="#5C2700" stroke-width="2" stroke-linecap="round" stroke-linejoin="round"/>
<path d="M14.9678 6.58442C15.6346 6.31845 16.352 6.20305 17.0686 6.24647C17.7853 6.2899 18.4835 6.49107 19.1133 6.83561C19.7432 7.18015 20.2892 7.65957 20.7123 8.23959C21.1354 8.81961 21.4252 9.48593 21.5609 10.1909C21.6966 10.8959 21.6749 11.6222 21.4974 12.3179C21.3199 13.0135 20.991 13.6614 20.534 14.2151C20.0771 14.7689 19.5035 15.2149 18.8543 15.5213C18.205 15.8277 17.496 15.9869 16.7781 15.9875" stroke="#5C2700" stroke-width="2" stroke-linecap="round" stroke-linejoin="round"/>
</g>
<defs>
<clipPath id="clip0_257_1803">
<rect width="24" height="24" fill="white" transform="translate(0.65332 0.987549)"/>
</clipPath>
</defs>
</svg>
