<svg width="12" height="12" viewBox="0 0 12 12" fill="none" xmlns="http://www.w3.org/2000/svg">
<path d="M12 7.5V11C12 11.2652 11.8946 11.5196 11.7071 11.7071C11.5196 11.8946 11.2652 12 11 12H1C0.734784 12 0.48043 11.8946 0.292893 11.7071C0.105357 11.5196 0 11.2652 0 11V7.5C0 7.36739 0.0526785 7.24021 0.146447 7.14645C0.240215 7.05268 0.367392 7 0.5 7C0.632608 7 0.759785 7.05268 0.853553 7.14645C0.947321 7.24021 1 7.36739 1 7.5V11H11V7.5C11 7.36739 11.0527 7.24021 11.1464 7.14645C11.2402 7.05268 11.3674 7 11.5 7C11.6326 7 11.7598 7.05268 11.8536 7.14645C11.9473 7.24021 12 7.36739 12 7.5ZM5.64625 7.85375C5.69269 7.90024 5.74783 7.93712 5.80853 7.96228C5.86923 7.98744 5.93429 8.00039 6 8.00039C6.06571 8.00039 6.13077 7.98744 6.19147 7.96228C6.25217 7.93712 6.30731 7.90024 6.35375 7.85375L8.85375 5.35375C8.90021 5.3073 8.93705 5.25214 8.9622 5.19145C8.98734 5.13075 9.00028 5.0657 9.00028 5C9.00028 4.9343 8.98734 4.86925 8.9622 4.80855C8.93705 4.74786 8.90021 4.6927 8.85375 4.64625C8.80729 4.59979 8.75214 4.56294 8.69145 4.5378C8.63075 4.51266 8.5657 4.49972 8.5 4.49972C8.4343 4.49972 8.36925 4.51266 8.30855 4.5378C8.24786 4.56294 8.19271 4.59979 8.14625 4.64625L6.5 6.29313V0.5C6.5 0.367392 6.44732 0.240215 6.35355 0.146447C6.25979 0.0526785 6.13261 0 6 0C5.86739 0 5.74021 0.0526785 5.64645 0.146447C5.55268 0.240215 5.5 0.367392 5.5 0.5V6.29313L3.85375 4.64625C3.75993 4.55243 3.63268 4.49972 3.5 4.49972C3.36732 4.49972 3.24007 4.55243 3.14625 4.64625C3.05243 4.74007 2.99972 4.86732 2.99972 5C2.99972 5.13268 3.05243 5.25993 3.14625 5.35375L5.64625 7.85375Z" fill="#D7692A"/>
</svg>
