<svg width="18" height="19" viewBox="0 0 18 19" fill="none" xmlns="http://www.w3.org/2000/svg">
<path opacity="0.2" d="M14.0625 4.7375V14.8625H3.9375V4.7375H14.0625Z" fill="#F9C43D"/>
<path d="M14.625 4.7375V14.8625C14.625 15.0117 14.5657 15.1548 14.4602 15.2603C14.3548 15.3657 14.2117 15.425 14.0625 15.425C13.9133 15.425 13.7702 15.3657 13.6648 15.2603C13.5593 15.1548 13.5 15.0117 13.5 14.8625V10.3625H4.5V14.8625C4.5 15.0117 4.44074 15.1548 4.33525 15.2603C4.22976 15.3657 4.08668 15.425 3.9375 15.425C3.78832 15.425 3.64524 15.3657 3.53975 15.2603C3.43426 15.1548 3.375 15.0117 3.375 14.8625V4.7375C3.375 4.58832 3.43426 4.44524 3.53975 4.33976C3.64524 4.23427 3.78832 4.175 3.9375 4.175C4.08668 4.175 4.22976 4.23427 4.33525 4.33976C4.44074 4.44524 4.5 4.58832 4.5 4.7375V9.2375H13.5V4.7375C13.5 4.58832 13.5593 4.44524 13.6648 4.33976C13.7702 4.23427 13.9133 4.175 14.0625 4.175C14.2117 4.175 14.3548 4.23427 14.4602 4.33976C14.5657 4.44524 14.625 4.58832 14.625 4.7375Z" fill="#F9C43D"/>
</svg>
