<svg width="16" height="16" viewBox="0 0 16 16" fill="none" xmlns="http://www.w3.org/2000/svg">
<path d="M1.62388 8.43437L8.37031 14.2897C8.4221 14.3344 8.48817 14.3594 8.55781 14.3594L10.1382 14.3594C10.2703 14.3594 10.331 14.1951 10.231 14.1094L3.97746 8.6808L14.4275 8.6808C14.506 8.6808 14.5703 8.61652 14.5703 8.53795L14.5703 7.46652C14.5703 7.38795 14.506 7.32366 14.4275 7.32366L3.97924 7.32366L10.2328 1.89509C10.3328 1.80759 10.2721 1.64509 10.14 1.64509L8.50603 1.64509C8.4721 1.64509 8.43817 1.65759 8.41317 1.6808L1.62388 7.57009C1.56206 7.62384 1.5125 7.69024 1.47853 7.76479C1.44457 7.83934 1.42699 7.92031 1.42699 8.00223C1.42699 8.08415 1.44457 8.16512 1.47853 8.23967C1.5125 8.31422 1.56206 8.38062 1.62388 8.43437Z" fill="#D7692A"/>
</svg>
