<svg width="56" height="56" viewBox="0 0 56 56" fill="none" xmlns="http://www.w3.org/2000/svg">
<rect x="0.000244141" width="56" height="56" rx="8" fill="#D7692A" fill-opacity="0.15"/>
<g clip-path="url(#clip0_502_4003)">
<path opacity="0.2" d="M17.0002 26.3488V19C17.0002 18.7348 17.1056 18.4804 17.2931 18.2929C17.4807 18.1054 17.735 18 18.0002 18H38.0002C38.2655 18 38.5198 18.1054 38.7074 18.2929C38.8949 18.4804 39.0002 18.7348 39.0002 19V26.3462C39.0002 36.8687 30.0865 40.355 28.3077 40.9463C28.1085 41.015 27.892 41.015 27.6927 40.9463C25.914 40.3575 17.0002 36.875 17.0002 26.3488Z" fill="#D7692A"/>
<path d="M17.0002 26.3488V19C17.0002 18.7348 17.1056 18.4804 17.2931 18.2929C17.4807 18.1054 17.735 18 18.0002 18H38.0002C38.2655 18 38.5198 18.1054 38.7074 18.2929C38.8949 18.4804 39.0002 18.7348 39.0002 19V26.3462C39.0002 36.8687 30.0865 40.355 28.3077 40.9463C28.1085 41.015 27.892 41.015 27.6927 40.9463C25.914 40.3575 17.0002 36.875 17.0002 26.3488Z" stroke="#D7692A" stroke-width="2" stroke-linecap="round" stroke-linejoin="round"/>
</g>
<defs>
<clipPath id="clip0_502_4003">
<rect width="32" height="32" fill="white" transform="translate(12.0002 12)"/>
</clipPath>
</defs>
</svg>
