<svg width="24" height="24" viewBox="0 0 24 24" fill="none" xmlns="http://www.w3.org/2000/svg">
<path d="M19.5 3H4.5C4.10218 3 3.72064 3.15804 3.43934 3.43934C3.15804 3.72064 3 4.10218 3 4.5V19.5C3 19.8978 3.15804 20.2794 3.43934 20.5607C3.72064 20.842 4.10218 21 4.5 21H19.5C19.8978 21 20.2794 20.842 20.5607 20.5607C20.842 20.2794 21 19.8978 21 19.5V4.5C21 4.10218 20.842 3.72064 20.5607 3.43934C20.2794 3.15804 19.8978 3 19.5 3ZM19.5 19.5H4.5V4.5H19.5V19.5ZM15.5306 9.53063L13.0603 12L15.5306 14.4694C15.6003 14.5391 15.6556 14.6218 15.6933 14.7128C15.731 14.8039 15.7504 14.9015 15.7504 15C15.7504 15.0985 15.731 15.1961 15.6933 15.2872C15.6556 15.3782 15.6003 15.4609 15.5306 15.5306C15.4609 15.6003 15.3782 15.6556 15.2872 15.6933C15.1961 15.731 15.0985 15.7504 15 15.7504C14.9015 15.7504 14.8039 15.731 14.7128 15.6933C14.6218 15.6556 14.5391 15.6003 14.4694 15.5306L12 13.0603L9.53063 15.5306C9.46094 15.6003 9.37822 15.6556 9.28717 15.6933C9.19613 15.731 9.09855 15.7504 9 15.7504C8.90145 15.7504 8.80387 15.731 8.71283 15.6933C8.62178 15.6556 8.53906 15.6003 8.46937 15.5306C8.39969 15.4609 8.34442 15.3782 8.3067 15.2872C8.26899 15.1961 8.24958 15.0985 8.24958 15C8.24958 14.9015 8.26899 14.8039 8.3067 14.7128C8.34442 14.6218 8.39969 14.5391 8.46937 14.4694L10.9397 12L8.46937 9.53063C8.32864 9.38989 8.24958 9.19902 8.24958 9C8.24958 8.80098 8.32864 8.61011 8.46937 8.46937C8.61011 8.32864 8.80098 8.24958 9 8.24958C9.19902 8.24958 9.38989 8.32864 9.53063 8.46937L12 10.9397L14.4694 8.46937C14.5391 8.39969 14.6218 8.34442 14.7128 8.3067C14.8039 8.26899 14.9015 8.24958 15 8.24958C15.0985 8.24958 15.1961 8.26899 15.2872 8.3067C15.3782 8.34442 15.4609 8.39969 15.5306 8.46937C15.6003 8.53906 15.6556 8.62178 15.6933 8.71283C15.731 8.80387 15.7504 8.90145 15.7504 9C15.7504 9.09855 15.731 9.19613 15.6933 9.28717C15.6556 9.37822 15.6003 9.46094 15.5306 9.53063Z" fill="#940909"/>
</svg>
