<svg width="32" height="32" viewBox="0 0 32 32" fill="none" xmlns="http://www.w3.org/2000/svg">
<path d="M31.0018 16.0036C31.0081 18.385 30.2355 20.7033 28.8018 22.6048C28.7229 22.7099 28.624 22.7984 28.5109 22.8652C28.3977 22.9321 28.2725 22.976 28.1424 22.9944C28.0123 23.0129 27.8798 23.0055 27.7525 22.9728C27.6252 22.94 27.5056 22.8825 27.4006 22.8036C27.2955 22.7246 27.2071 22.6257 27.1402 22.5126C27.0734 22.3994 27.0295 22.2742 27.011 22.1441C26.9925 22.014 26.9999 21.8815 27.0326 21.7542C27.0654 21.627 27.1229 21.5074 27.2018 21.4023C28.3754 19.8476 29.0076 17.9515 29.0018 16.0036C29.0018 13.6166 28.0536 11.3274 26.3658 9.63961C24.678 7.95179 22.3888 7.00358 20.0018 7.00358C17.6149 7.00358 15.3257 7.95179 13.6379 9.63961C11.95 11.3274 11.0018 13.6166 11.0018 16.0036C11.0018 16.2688 10.8965 16.5231 10.7089 16.7107C10.5214 16.8982 10.2671 17.0036 10.0018 17.0036C9.73662 17.0036 9.48227 16.8982 9.29473 16.7107C9.10719 16.5231 9.00184 16.2688 9.00184 16.0036C9.00135 14.9944 9.13973 13.99 9.41309 13.0186C9.27684 13.0036 9.13934 13.0036 9.00184 13.0036C7.41054 13.0036 5.88442 13.6357 4.7592 14.7609C3.63398 15.8862 3.00184 17.4123 3.00184 19.0036C3.00184 20.5949 3.63398 22.121 4.7592 23.2462C5.88442 24.3714 7.41054 25.0036 9.00184 25.0036H12.0018C12.2671 25.0036 12.5214 25.1089 12.7089 25.2965C12.8965 25.484 13.0018 25.7384 13.0018 26.0036C13.0018 26.2688 12.8965 26.5231 12.7089 26.7107C12.5214 26.8982 12.2671 27.0036 12.0018 27.0036H9.00184C7.90206 27.0038 6.81404 26.7773 5.80573 26.3382C4.79742 25.8991 3.89048 25.2568 3.14156 24.4514C2.39263 23.646 1.81781 22.6949 1.45298 21.6574C1.08816 20.6199 0.941178 19.5183 1.02121 18.4214C1.10125 17.3245 1.40658 16.2559 1.91814 15.2824C2.4297 14.3088 3.1365 13.4512 3.9944 12.7631C4.8523 12.0749 5.84287 11.5711 6.90424 11.283C7.96561 10.9949 9.07499 10.9287 10.1631 11.0886C11.2711 8.87252 13.0948 7.09542 15.3387 6.04512C17.5827 4.99481 20.1156 4.73282 22.527 5.30158C24.9384 5.87034 27.0873 7.23654 28.6254 9.17889C30.1635 11.1212 31.0009 13.526 31.0018 16.0036ZM19.7093 15.2961C19.6165 15.2031 19.5062 15.1293 19.3848 15.079C19.2634 15.0287 19.1333 15.0028 19.0018 15.0028C18.8704 15.0028 18.7403 15.0287 18.6189 15.079C18.4975 15.1293 18.3872 15.2031 18.2943 15.2961L14.2943 19.2961C14.2014 19.389 14.1277 19.4993 14.0774 19.6207C14.0272 19.7421 14.0013 19.8722 14.0013 20.0036C14.0013 20.135 14.0272 20.2651 14.0774 20.3865C14.1277 20.5079 14.2014 20.6182 14.2943 20.7111C14.482 20.8987 14.7365 21.0041 15.0018 21.0041C15.1332 21.0041 15.2633 20.9783 15.3847 20.928C15.5061 20.8777 15.6164 20.804 15.7093 20.7111L18.0018 18.4173V26.0036C18.0018 26.2688 18.1072 26.5231 18.2947 26.7107C18.4823 26.8982 18.7366 27.0036 19.0018 27.0036C19.2671 27.0036 19.5214 26.8982 19.7089 26.7107C19.8965 26.5231 20.0018 26.2688 20.0018 26.0036V18.4173L22.2943 20.7111C22.3872 20.804 22.4975 20.8777 22.6189 20.928C22.7403 20.9783 22.8704 21.0041 23.0018 21.0041C23.1332 21.0041 23.2633 20.9783 23.3847 20.928C23.5061 20.8777 23.6164 20.804 23.7093 20.7111C23.8022 20.6182 23.8759 20.5079 23.9262 20.3865C23.9765 20.2651 24.0024 20.135 24.0024 20.0036C24.0024 19.8722 23.9765 19.7421 23.9262 19.6207C23.8759 19.4993 23.8022 19.389 23.7093 19.2961L19.7093 15.2961Z" fill="black"/>
</svg>
