<svg width="33" height="32" viewBox="0 0 33 32" fill="none" xmlns="http://www.w3.org/2000/svg">
<path opacity="0.2" d="M27.5 8V23H5.5V8H27.5Z" fill="#DF8755"/>
<path d="M15.5 8C15.5 8.26522 15.3946 8.51957 15.2071 8.70711C15.0196 8.89464 14.7652 9 14.5 9H5.5C5.23478 9 4.98043 8.89464 4.79289 8.70711C4.60536 8.51957 4.5 8.26522 4.5 8C4.5 7.73478 4.60536 7.48043 4.79289 7.29289C4.98043 7.10536 5.23478 7 5.5 7H14.5C14.7652 7 15.0196 7.10536 15.2071 7.29289C15.3946 7.48043 15.5 7.73478 15.5 8ZM14.5 12H5.5C5.23478 12 4.98043 12.1054 4.79289 12.2929C4.60536 12.4804 4.5 12.7348 4.5 13C4.5 13.2652 4.60536 13.5196 4.79289 13.7071C4.98043 13.8946 5.23478 14 5.5 14H14.5C14.7652 14 15.0196 13.8946 15.2071 13.7071C15.3946 13.5196 15.5 13.2652 15.5 13C15.5 12.7348 15.3946 12.4804 15.2071 12.2929C15.0196 12.1054 14.7652 12 14.5 12ZM14.5 17H5.5C5.23478 17 4.98043 17.1054 4.79289 17.2929C4.60536 17.4804 4.5 17.7348 4.5 18C4.5 18.2652 4.60536 18.5196 4.79289 18.7071C4.98043 18.8946 5.23478 19 5.5 19H14.5C14.7652 19 15.0196 18.8946 15.2071 18.7071C15.3946 18.5196 15.5 18.2652 15.5 18C15.5 17.7348 15.3946 17.4804 15.2071 17.2929C15.0196 17.1054 14.7652 17 14.5 17ZM14.5 22H5.5C5.23478 22 4.98043 22.1054 4.79289 22.2929C4.60536 22.4804 4.5 22.7348 4.5 23C4.5 23.2652 4.60536 23.5196 4.79289 23.7071C4.98043 23.8946 5.23478 24 5.5 24H14.5C14.7652 24 15.0196 23.8946 15.2071 23.7071C15.3946 23.5196 15.5 23.2652 15.5 23C15.5 22.7348 15.3946 22.4804 15.2071 22.2929C15.0196 22.1054 14.7652 22 14.5 22ZM18.5 9H27.5C27.7652 9 28.0196 8.89464 28.2071 8.70711C28.3946 8.51957 28.5 8.26522 28.5 8C28.5 7.73478 28.3946 7.48043 28.2071 7.29289C28.0196 7.10536 27.7652 7 27.5 7H18.5C18.2348 7 17.9804 7.10536 17.7929 7.29289C17.6054 7.48043 17.5 7.73478 17.5 8C17.5 8.26522 17.6054 8.51957 17.7929 8.70711C17.9804 8.89464 18.2348 9 18.5 9ZM27.5 12H18.5C18.2348 12 17.9804 12.1054 17.7929 12.2929C17.6054 12.4804 17.5 12.7348 17.5 13C17.5 13.2652 17.6054 13.5196 17.7929 13.7071C17.9804 13.8946 18.2348 14 18.5 14H27.5C27.7652 14 28.0196 13.8946 28.2071 13.7071C28.3946 13.5196 28.5 13.2652 28.5 13C28.5 12.7348 28.3946 12.4804 28.2071 12.2929C28.0196 12.1054 27.7652 12 27.5 12ZM27.5 17H18.5C18.2348 17 17.9804 17.1054 17.7929 17.2929C17.6054 17.4804 17.5 17.7348 17.5 18C17.5 18.2652 17.6054 18.5196 17.7929 18.7071C17.9804 18.8946 18.2348 19 18.5 19H27.5C27.7652 19 28.0196 18.8946 28.2071 18.7071C28.3946 18.5196 28.5 18.2652 28.5 18C28.5 17.7348 28.3946 17.4804 28.2071 17.2929C28.0196 17.1054 27.7652 17 27.5 17ZM27.5 22H18.5C18.2348 22 17.9804 22.1054 17.7929 22.2929C17.6054 22.4804 17.5 22.7348 17.5 23C17.5 23.2652 17.6054 23.5196 17.7929 23.7071C17.9804 23.8946 18.2348 24 18.5 24H27.5C27.7652 24 28.0196 23.8946 28.2071 23.7071C28.3946 23.5196 28.5 23.2652 28.5 23C28.5 22.7348 28.3946 22.4804 28.2071 22.2929C28.0196 22.1054 27.7652 22 27.5 22Z" fill="#DF8755"/>
</svg>
