<svg width="24" height="24" viewBox="0 0 24 24" fill="none" xmlns="http://www.w3.org/2000/svg">
<path d="M19.2864 10.7793L16.8949 13.1698L15.8578 12.1258C15.7773 12.0455 15.6682 12.0004 15.5545 12.0005C15.4408 12.0005 15.3317 12.0458 15.2514 12.1263C15.171 12.2067 15.1259 12.3159 15.126 12.4296C15.1261 12.5433 15.1713 12.6523 15.2518 12.7327L16.5984 14.0793C16.6787 14.1596 16.7877 14.2048 16.9014 14.2048C17.015 14.2048 17.124 14.1596 17.2044 14.0793L19.8992 11.3853C19.9401 11.3457 19.9728 11.2985 19.9953 11.2462C20.0177 11.1939 20.0295 11.1376 20.03 11.0807C20.0305 11.0238 20.0197 10.9674 19.9981 10.9147C19.9766 10.8621 19.9448 10.8142 19.9045 10.774C19.8643 10.7337 19.8164 10.7019 19.7638 10.6804C19.7111 10.6588 19.6547 10.648 19.5978 10.6485C19.5409 10.6489 19.4846 10.6608 19.4323 10.6832C19.38 10.7057 19.3327 10.7383 19.2932 10.7793H19.2864Z" fill="black"/>
<path d="M22.7147 12.429C22.7125 11.2148 22.2811 10.0405 21.4969 9.11354C20.7127 8.18658 19.626 7.56665 18.429 7.36328V5.14328C18.4291 5.08696 18.4181 5.03117 18.3966 4.97911C18.3751 4.92704 18.3436 4.87972 18.3038 4.83985L14.8753 1.41128C14.8354 1.3715 14.7881 1.33998 14.736 1.31851C14.684 1.29703 14.6282 1.28603 14.5718 1.28613H4.28613C4.17247 1.28613 4.06346 1.33129 3.98309 1.41166C3.90271 1.49203 3.85756 1.60104 3.85756 1.7147V3.85756H1.7147C1.60104 3.85756 1.49203 3.90272 1.41166 3.98309C1.33129 4.06346 1.28613 4.17247 1.28613 4.28613V22.2861C1.28613 22.3998 1.33129 22.5088 1.41166 22.5892C1.49203 22.6696 1.60104 22.7147 1.7147 22.7147H16.2861C16.3998 22.7147 16.5088 22.6696 16.5892 22.5892C16.6696 22.5088 16.7147 22.3998 16.7147 22.2861V20.1433H18.0004C18.1141 20.1433 18.2231 20.0981 18.3035 20.0178C18.3838 19.9374 18.429 19.8284 18.429 19.7147V17.4947C19.626 17.2913 20.7127 16.6714 21.4969 15.7444C22.2811 14.8175 22.7125 13.6432 22.7147 12.429ZM15.0004 2.74928L16.9658 4.71471H15.0004V2.74928ZM15.8576 21.8576H2.14328V4.71471H3.85756V19.7147C3.85756 19.8284 3.90271 19.9374 3.98309 20.0178C4.06346 20.0981 4.17247 20.1433 4.28613 20.1433H15.8576V21.8576ZM17.5718 19.2861H4.7147V2.14328H14.1433V5.14328C14.1433 5.25694 14.1884 5.36595 14.2688 5.44632C14.3492 5.5267 14.4582 5.57185 14.5718 5.57185H17.5718V7.28613C16.2079 7.28613 14.8998 7.82797 13.9353 8.79244C12.9708 9.75692 12.429 11.065 12.429 12.429C12.429 13.793 12.9708 15.1011 13.9353 16.0655C14.8998 17.03 16.2079 17.5718 17.5718 17.5718V19.2861ZM17.5718 16.7147C16.7242 16.7147 15.8956 16.4634 15.1908 15.9924C14.4861 15.5215 13.9367 14.8522 13.6124 14.0691C13.288 13.286 13.2031 12.4242 13.3685 11.5929C13.5338 10.7615 13.942 9.9979 14.5414 9.39853C15.1408 8.79917 15.9044 8.39099 16.7357 8.22563C17.5671 8.06026 18.4288 8.14513 19.2119 8.46951C19.995 8.79388 20.6644 9.34319 21.1353 10.048C21.6062 10.7528 21.8576 11.5814 21.8576 12.429C21.8562 13.5652 21.4042 14.6545 20.6008 15.4579C19.7974 16.2614 18.7081 16.7133 17.5718 16.7147Z" fill="black"/>
<path d="M9.00014 11.6969L7.67328 13.0289L7.159 12.5146C7.07864 12.4341 6.9696 12.3888 6.85587 12.3888C6.74214 12.3887 6.63304 12.4338 6.55257 12.5141C6.47209 12.5945 6.42684 12.7035 6.42676 12.8173C6.42668 12.931 6.47178 13.0401 6.55214 13.1206L7.369 13.9366C7.44937 14.0169 7.55835 14.062 7.672 14.062C7.78564 14.062 7.89463 14.0169 7.975 13.9366L9.60785 12.308C9.68833 12.2276 9.73358 12.1186 9.73366 12.0049C9.73374 11.8911 9.68864 11.782 9.60828 11.7016C9.52792 11.6211 9.41888 11.5758 9.30516 11.5758C9.19143 11.5757 9.08233 11.6208 9.00185 11.7011L9.00014 11.6969ZM9.00014 15.1254L7.67328 16.4574L7.159 15.9431C7.11921 15.9033 7.07196 15.8717 7.01995 15.8501C6.96794 15.8285 6.91218 15.8174 6.85587 15.8173C6.79956 15.8173 6.74379 15.8283 6.69175 15.8499C6.63971 15.8714 6.59241 15.9029 6.55257 15.9427C6.51272 15.9825 6.4811 16.0297 6.45951 16.0818C6.43793 16.1338 6.4268 16.1895 6.42676 16.2458C6.42672 16.3021 6.43777 16.3579 6.45928 16.41C6.4808 16.462 6.51235 16.5093 6.55214 16.5491L7.369 17.3651C7.44937 17.4455 7.55835 17.4906 7.672 17.4906C7.78564 17.4906 7.89463 17.4455 7.975 17.3651L9.60785 15.7366C9.68833 15.6562 9.73358 15.5472 9.73366 15.4334C9.73374 15.3197 9.68864 15.2106 9.60828 15.1301C9.52792 15.0497 9.41888 15.0044 9.30516 15.0043C9.19143 15.0042 9.08233 15.0493 9.00185 15.1297L9.00014 15.1254ZM6.85728 4.71456H12.0001C12.1138 4.71456 12.2228 4.66941 12.3032 4.58904C12.3836 4.50867 12.4287 4.39966 12.4287 4.28599C12.4287 4.17233 12.3836 4.06332 12.3032 3.98295C12.2228 3.90257 12.1138 3.85742 12.0001 3.85742H6.85728C6.74362 3.85742 6.63461 3.90257 6.55424 3.98295C6.47386 4.06332 6.42871 4.17233 6.42871 4.28599C6.42871 4.39966 6.47386 4.50867 6.55424 4.58904C6.63461 4.66941 6.74362 4.71456 6.85728 4.71456ZM12.0001 6.42885H6.85728C6.74362 6.42885 6.63461 6.474 6.55424 6.55438C6.47386 6.63475 6.42871 6.74376 6.42871 6.85742C6.42871 6.97109 6.47386 7.0801 6.55424 7.16047C6.63461 7.24084 6.74362 7.28599 6.85728 7.28599H12.0001C12.1138 7.28599 12.2228 7.24084 12.3032 7.16047C12.3836 7.0801 12.4287 6.97109 12.4287 6.85742C12.4287 6.74376 12.3836 6.63475 12.3032 6.55438C12.2228 6.474 12.1138 6.42885 12.0001 6.42885ZM9.42871 9.00028H6.85728C6.74362 9.00028 6.63461 9.04543 6.55424 9.1258C6.47386 9.20618 6.42871 9.31519 6.42871 9.42885C6.42871 9.54251 6.47386 9.65152 6.55424 9.7319C6.63461 9.81227 6.74362 9.85742 6.85728 9.85742H9.42871C9.54237 9.85742 9.65138 9.81227 9.73176 9.7319C9.81213 9.65152 9.85728 9.54251 9.85728 9.42885C9.85728 9.31519 9.81213 9.20618 9.73176 9.1258C9.65138 9.04543 9.54237 9.00028 9.42871 9.00028Z" fill="black"/>
</svg>
