<svg width="24" height="24" viewBox="0 0 24 24" fill="none" xmlns="http://www.w3.org/2000/svg">
<g clip-path="url(#clip0_413_20973)">
<path d="M24 10.0645H23.1301L21.8337 10.7467C21.6878 10.6662 21.536 10.5979 21.3723 10.5569L19.7415 10.1488V9.96339C20.463 9.45987 20.9032 8.62805 20.9032 7.74194V7.06529C20.9032 5.56152 19.7249 4.30306 18.2767 4.25918C18.2032 4.25729 18.1308 4.25995 18.058 4.26353L18.4808 3.27368L16.431 1.22444L15.2227 2.01092C14.7655 1.75322 14.279 1.55142 13.7737 1.40985L13.4752 0H10.5252L10.2267 1.41024C9.72135 1.55172 9.23485 1.75351 8.77771 2.01126L7.56939 1.22477L5.52121 3.27295L5.93685 4.26353C5.92098 4.26281 5.90589 4.25995 5.89002 4.25956C5.14873 4.23803 4.4505 4.50852 3.92013 5.02335C3.38898 5.5379 3.09677 6.22839 3.09677 6.96774V7.74194C3.09677 8.62805 3.53661 9.45948 4.25806 9.963V10.1488L3.19432 10.4147L1.26619 9.29032H0V17.3115L3.80821 18.5806H4.54989L4.6425 18.2563L5.80984 18.957C5.82895 19.5917 6.33794 20.1024 6.9721 20.1247C6.99435 20.7561 7.50194 21.2637 8.13339 21.286C8.15564 21.9174 8.66323 22.425 9.29468 22.4473C9.31771 23.0935 9.84697 23.6129 10.4985 23.6129C10.7404 23.6129 10.9776 23.5375 11.177 23.4031L11.5199 23.7059C11.7351 23.8954 12.0121 24 12.2988 24H12.3705C13.0146 24 13.5388 23.4793 13.5469 22.8372C14.184 22.8291 14.7 22.3131 14.7082 21.6759C15.3457 21.6678 15.8621 21.151 15.8695 20.5135C16.5129 20.4984 17.0323 19.9727 17.0323 19.3257C17.0323 19.2868 17.0303 19.2484 17.0264 19.2097L24 15.7231V10.0645ZM20.129 7.06529V7.74194C20.129 8.42903 19.7578 9.07089 19.1602 9.41695L18.9666 9.52887L18.9681 10.7538L20.9021 11.2369L16.6452 13.4775V12.4348C16.6452 11.9144 16.435 11.4379 16.0908 11.0857L17.4194 10.7538V9.5279L17.2262 9.41623C16.6289 9.07089 16.2581 8.42898 16.2581 7.74194V6.96774C16.2581 6.43984 16.4668 5.94615 16.8461 5.57855C17.225 5.21105 17.7278 5.013 18.2535 5.03337C19.2875 5.06439 20.129 5.97595 20.129 7.06529ZM12.5836 13.1732L10.8314 12.6132C10.0328 12.3572 9.16839 12.3191 8.35094 12.5001L8.12903 12.5493V12.4347C8.12903 11.901 8.49097 11.4375 9.00852 11.3078L11.2258 10.7538V9.5279L11.0326 9.41623C10.4354 9.07089 10.0645 8.42898 10.0645 7.74194V6.96774C10.0645 6.43984 10.2732 5.94615 10.6525 5.57855C11.0315 5.21105 11.5375 5.013 12.0599 5.03337C13.094 5.06439 13.9355 5.97595 13.9355 7.06529V7.74194C13.9355 8.42903 13.5643 9.07089 12.9666 9.41695L12.7731 9.52887L12.7745 10.7538L14.9915 11.3079C15.2428 11.3706 15.4659 11.5156 15.6253 11.7198C15.7847 11.924 15.8712 12.1756 15.871 12.4347V13.8852L15.7753 13.9355H15.5381L13.1582 13.2554C12.9707 13.2023 12.7776 13.1805 12.5836 13.1732ZM8.21579 5.79358C8.94271 4.38508 10.4059 3.48387 12 3.48387C13.579 3.48387 15.0359 4.37298 15.7683 5.76242C15.5811 6.13663 15.4837 6.54932 15.4839 6.96774V7.74194C15.4839 8.628 15.9237 9.45948 16.6452 9.963V10.1488L15.0968 10.5365L13.548 10.1488V9.96339C14.2695 9.45987 14.7097 8.628 14.7097 7.74194V7.06529C14.7097 5.56147 13.5314 4.30306 12.0832 4.25918C11.3422 4.23745 10.6437 4.50813 10.1133 5.02302C9.58253 5.53785 9.29032 6.22834 9.29032 6.96774V7.74194C9.29032 8.628 9.73016 9.45948 10.4516 9.963V10.1488L8.90323 10.5365L7.35445 10.1488V9.96339C8.0759 9.45987 8.51613 8.628 8.51613 7.74194V7.06529C8.51613 6.60977 8.40648 6.17729 8.21579 5.79358ZM6.43548 3.45252L7.67221 2.21579L8.76073 2.92418L8.96898 2.79644C9.49089 2.4766 10.0549 2.2424 10.6452 2.10126L10.8833 2.04416L11.1526 0.774194H12.8477L13.1163 2.04377L13.3545 2.10068C13.9448 2.24206 14.5088 2.47626 15.0306 2.79605L15.2389 2.92379L16.3275 2.2154L17.5626 3.45097L17.1235 4.479C16.8247 4.60756 16.5476 4.78844 16.3064 5.02224C16.2905 5.03773 16.2769 5.05437 16.2614 5.07024C15.3495 3.62056 13.7372 2.70968 12 2.70968C10.2503 2.70968 8.63352 3.62903 7.72379 5.09352C7.48035 4.83871 7.19076 4.63229 6.86985 4.4881L6.43548 3.45252ZM5.03226 10.7538V9.5279L4.8391 9.41623C4.24181 9.07089 3.87097 8.42898 3.87097 7.74194V6.96774C3.87097 6.43984 4.07966 5.94615 4.45897 5.57855C4.83794 5.21105 5.34184 5.013 5.86635 5.03337C6.90044 5.06439 7.74194 5.97595 7.74194 7.06529V7.74194C7.74194 8.42903 7.37071 9.07089 6.77308 9.41695L6.57953 9.52887L6.58098 10.7538L7.90921 11.0858C7.56503 11.4378 7.35484 11.9144 7.35484 12.4347V12.7214L6.14744 12.9898L6.17879 12.8802L6.19355 12.1648L4.15205 10.9738L5.03226 10.7538ZM0.774194 10.0645H1.05639L3.84034 11.6883L2.43561 17.307L0.774194 16.7531V10.0645ZM3.93373 17.8065L3.17182 17.5526L4.53648 12.0945L5.41935 12.6093V12.7199L3.96624 17.8065H3.93373ZM6.58064 18.9209C6.58092 18.8058 6.62656 18.6955 6.70766 18.6139L7.38813 17.9335C7.46971 17.8524 7.57998 17.8067 7.695 17.8065C7.93432 17.8065 8.12898 18.0011 8.12898 18.2404C8.12871 18.3555 8.08307 18.4658 8.00197 18.5474L7.3215 19.2278C7.23993 19.3089 7.12968 19.3545 7.01468 19.3548C6.77535 19.3548 6.58069 19.1602 6.58069 18.9209H6.58064ZM7.74194 20.0821C7.74221 19.9671 7.78785 19.8568 7.86895 19.7752L8.54942 19.0948C8.631 19.0137 8.74127 18.968 8.85629 18.9677C9.09561 18.9677 9.29027 19.1624 9.29027 19.4017C9.29 19.5168 9.24436 19.6271 9.16326 19.7087L8.48279 20.3891C8.40122 20.4702 8.29097 20.5158 8.17597 20.5161C7.93664 20.5161 7.74198 20.3215 7.74198 20.0821H7.74194ZM8.90323 21.2434C8.9035 21.1284 8.94914 21.0181 9.03024 20.9365L9.71071 20.256C9.79229 20.175 9.90256 20.1293 10.0176 20.129C10.2569 20.129 10.4516 20.3237 10.4516 20.563C10.4513 20.6781 10.4057 20.7884 10.3245 20.87L9.64408 21.5504C9.56251 21.6315 9.45226 21.6771 9.33726 21.6774C9.09794 21.6774 8.90327 21.4828 8.90327 21.2434H8.90323ZM10.4985 22.8387C10.2592 22.8387 10.0645 22.644 10.0645 22.4047C10.0648 22.2897 10.1104 22.1794 10.1915 22.0978L10.872 21.4173C10.9536 21.3363 11.0638 21.2906 11.1789 21.2903C11.4182 21.2903 11.6129 21.485 11.6129 21.7243C11.6126 21.8394 11.5669 21.9497 11.4858 22.0313L10.8054 22.7117C10.7238 22.7928 10.6136 22.8384 10.4985 22.8387H10.4985ZM12.3705 23.2258H12.2988C12.2005 23.2259 12.1056 23.1899 12.0321 23.1247L11.7426 22.8693L12.0332 22.5786C12.137 22.4748 12.2176 22.3515 12.2771 22.2189L12.629 22.5119C12.6745 22.5498 12.7111 22.5972 12.7362 22.6508C12.7613 22.7044 12.7743 22.7629 12.7742 22.8221C12.7742 23.0447 12.5931 23.2258 12.3705 23.2258ZM15.8418 19.7419H15.775C15.6776 19.7419 15.5833 19.7076 15.5086 19.6452L13.4095 17.8959L12.9135 18.4909L14.952 20.1893C14.9974 20.2273 15.0339 20.2747 15.0589 20.3283C15.0839 20.3819 15.0968 20.4403 15.0968 20.4995C15.0968 20.7222 14.9157 20.9032 14.693 20.9032H14.6085C14.5142 20.9031 14.4228 20.8699 14.3504 20.8095L12.2478 19.0575L11.7518 19.6525L13.7903 21.3512C13.8359 21.3889 13.8725 21.4362 13.8976 21.4897C13.9227 21.5432 13.9356 21.6017 13.9355 21.6608C13.9355 21.8835 13.7544 22.0645 13.5317 22.0645C13.3832 22.0645 13.2384 22.0118 13.1244 21.9171L12.2605 21.1969C12.0701 20.808 11.679 20.5367 11.2211 20.5205C11.1988 19.889 10.6913 19.3815 10.0598 19.3592C10.0375 18.7277 9.52998 18.2202 8.89853 18.1979C8.87579 17.5516 8.34658 17.0323 7.69505 17.0323C7.37695 17.0323 7.06563 17.1612 6.84073 17.3861L6.16031 18.0665C6.11966 18.1072 6.08598 18.1533 6.05177 18.199L4.86271 17.4855L5.90511 13.8372L8.5184 13.2562C9.20395 13.1029 9.92671 13.1362 10.5953 13.3501L11.1655 13.5325L9.23231 14.4991C8.79053 14.7205 8.51613 15.1648 8.51613 15.6589V15.7354C8.51613 16.4505 9.09789 17.0323 9.8129 17.0323C10.0479 17.0323 10.2791 16.9684 10.48 16.8472L11.9214 15.9828C12.2109 15.8094 12.5996 15.8474 12.8496 16.0723L16.1203 19.0157C16.1636 19.0549 16.1982 19.1028 16.2219 19.1562C16.2457 19.2095 16.258 19.2673 16.2581 19.3257C16.2581 19.5554 16.0715 19.7419 15.8418 19.7419ZM23.2258 15.2446L16.7043 18.5056C16.6831 18.4831 16.6609 18.4615 16.6378 18.441L13.3677 15.4975C13.0817 15.2392 12.71 15.0964 12.3247 15.0968C12.0422 15.0968 11.765 15.1737 11.5227 15.3191L10.0807 16.1837C9.99989 16.2324 9.90728 16.2581 9.8129 16.2581C9.52452 16.2581 9.29032 16.0239 9.29032 15.7355V15.6589C9.29032 15.4595 9.40113 15.2807 9.57914 15.1917L11.7384 14.112C12.1079 13.927 12.5466 13.8855 12.9449 14.0001L15.3775 14.695L15.9666 14.7097L23.2258 10.889V15.2446Z" fill="black"/>
</g>
<defs>
<clipPath id="clip0_413_20973">
<rect width="24" height="24" fill="white"/>
</clipPath>
</defs>
</svg>
