,M1,M2,M3,M4,M5,M6,M7,M8,M9,M10,M11,M12,M13,M14,M15,M16,M17,Jobs
121,0,0,0,0,0,0,0,0,0,0,0,0,0,0,0,0,0,122
84,0,0,0,0,0,0,0,0,0,0,0,0,0,0,0,0,0,85
13,0,0,0,0,0,0,0,0,0,0,0,0,0,0,0,0,0,14
10,0,0,0,0,0,0,0,0,0,0,0,0,0,0,0,0,0,11
9,0,0,0,0,0,0,0,0,0,0,0,0,0,0,0,0,0,10
4,0,0,0,0,0,0,0,0,0,0,0,0,0,0,0,0,0,5
38,0,0,0,0,0,0,0,0,0,0,0,0,0,0,0,0,0,39
132,0,0,0,0,0,0,0,0,0,0,0,0,0,0,0,0,0,133
86,0,0,0,0,0,0,0,0,0,0,0,0,0,0,0,0,0,87
16,0,0,0,0,0,0,0,0,0,0,0,0,0,0,0,0,0,17
143,0,0,0,0,0,0,0,0,0,0,0,0,0,0,0,0,0,144
60,0,0,0,0,0,0,0,0,0,0,0,0,0,0,0,0,0,61
53,0,0,0,0,0,0,0,0,0,0,0,0,0,0,0,0,0,54
111,0,0,0,0,0,0,0,0,0,0,0,0,0,0,0,0,0,112
81,0,0,0,0,0,0,0,0,0,0,0,0,0,0,0,0,0,82
3,0,0,0,0,0,0,0,0,0,0,0,0,0,0,0,0,0,4
100,0,0,0,0,0,0,0,0,0,0,0,0,0,0,0,0,0,101
51,0,0,0,0,0,0,0,0,0,0,0,0,0,0,0,0,0,52
24,0,0,0,0,0,0,0,0,0,0,0,0,0,0,0,0,0,25
19,0,0,0,0,0,0,0,0,0,0,0,0,0,0,0,0,0,20
149,0,0,0,0,0,0,0,0,0,0,0,0,0,0,0,0,0,150
140,0,0,0,0,0,0,0,0,0,0,0,0,0,0,0,0,0,141
146,0,0,0,0,0,0,0,0,0,0,0,0,0,0,0,0,0,147
91,0,0,0,0,0,0,0,0,0,0,0,0,0,0,0,0,0,92
35,0,0,0,0,0,0,0,0,0,0,0,0,0,0,0,0,0,36
133,0,0,0,0,0,0,0,0,0,0,0,0,0,0,0,0,0,134
142,0,0,0,0,0,0,0,0,0,0,0,0,0,0,0,0,0,143
150,0,0,0,0,0,0,0,0,0,0,0,0,0,0,0,0,0,151
30,0,0,0,0,0,0,0,0,0,0,0,0,0,0,0,0,0,31
20,0,0,0,0,0,0,0,0,0,0,0,0,0,0,0,0,0,21
52,0,0,0,0,0,0,0,0,0,0,0,0,0,0,0,0,0,53
134,0,0,0,0,0,0,0,0,0,0,0,0,0,0,0,0,0,135
139,0,0,0,0,0,0,0,0,0,0,0,0,0,0,0,0,0,140
29,0,0,0,0,0,0,0,0,0,0,0,0,0,0,0,0,0,30
159,0,0,0,0,0,0,0,0,0,0,0,0,0,0,0,0,0,160
5,0,0,0,0,0,0,0,0,0,0,0,0,0,0,0,0,0,6
76,0,0,0,0,0,0,0,0,0,0,0,0,0,0,0,0,0,77
79,0,0,0,0,0,0,0,0,0,0,0,0,0,0,0,0,0,80
45,0,0,0,0,0,0,0,0,0,0,0,0,0,0,0,0,0,46
156,0,0,0,0,0,0,0,0,0,0,0,0,0,0,0,0,0,157
107,0,0,0,0,0,0,0,0,0,0,0,0,0,0,0,0,0,108
103,0,0,0,0,0,0,0,0,0,0,0,0,0,0,0,0,0,104
11,0,0,0,0,0,0,0,0,0,0,0,0,0,0,0,0,0,12
74,0,0,0,0,0,0,0,0,0,0,0,0,0,0,0,0,0,75
122,0,0,0,0,0,0,0,0,0,0,0,0,0,0,0,0,0,123
118,0,0,0,0,0,0,0,0,0,0,0,0,0,0,0,0,0,119
68,0,0,0,0,0,0,0,0,0,0,0,0,0,0,0,0,0,69
22,0,0,0,0,0,0,0,0,0,0,0,0,0,0,0,0,0,23
71,0,0,0,0,0,0,0,0,0,0,0,0,0,0,0,0,0,72
55,0,0,0,0,0,0,0,0,0,0,0,0,0,0,0,0,0,56
152,0,0,0,0,0,0,0,0,0,0,0,0,0,0,0,0,0,153
34,0,0,0,0,0,0,0,0,0,0,0,0,0,0,0,0,0,35
17,0,0,0,0,0,0,0,0,0,0,0,0,0,0,0,0,0,18
58,0,0,0,0,0,0,0,0,0,0,0,0,0,0,0,0,0,59
8,0,0,0,0,0,0,0,0,0,0,0,0,0,0,0,0,0,9
145,0,0,0,0,0,0,0,0,0,0,0,0,0,0,0,0,0,146
135,0,0,0,0,0,0,0,0,0,0,0,0,0,0,0,0,0,136
31,0,0,0,0,0,0,0,0,0,0,0,0,0,0,0,0,0,32
64,0,0,0,0,0,0,0,0,0,0,0,0,0,0,0,0,0,65
1,0,0,0,0,0,0,0,0,0,0,0,0,0,0,0,0,0,2
117,0,0,0,0,0,0,0,0,0,0,0,0,0,0,0,0,0,118
124,0,0,0,0,0,0,0,0,0,0,0,0,0,0,0,0,0,125
125,0,0,0,0,0,0,0,0,0,0,0,0,0,0,0,0,0,126
36,0,0,0,0,0,0,0,0,0,0,0,0,0,0,0,0,0,37
110,0,0,0,0,0,0,0,0,0,0,0,0,0,0,0,0,0,111
138,0,0,0,0,0,0,0,0,0,0,0,0,0,0,0,0,0,139
62,0,0,0,0,0,0,0,0,0,0,0,0,0,0,0,0,0,63
46,0,0,0,0,0,0,0,0,0,0,0,0,0,0,0,0,0,47
96,0,0,0,0,0,0,0,0,0,0,0,0,0,0,0,0,0,97
50,0,0,0,0,0,0,0,0,0,0,0,0,0,0,0,0,0,51
113,0,0,0,0,0,0,0,0,0,0,0,0,0,0,0,0,0,114
72,0,0,0,0,0,0,0,0,0,0,0,0,0,0,0,0,0,73
92,0,0,0,0,0,0,0,0,0,0,0,0,0,0,0,0,0,93
148,0,0,0,0,0,0,0,0,0,0,0,0,0,0,0,0,0,149
59,0,0,0,0,0,0,0,0,0,0,0,0,0,0,0,0,0,60
83,0,0,0,0,0,0,0,0,0,0,0,0,0,0,0,0,0,84
54,0,0,0,0,0,0,0,0,0,0,0,0,0,0,0,0,0,55
42,0,0,0,0,0,0,0,0,0,0,0,0,0,0,0,0,0,43
44,0,0,0,0,0,0,0,0,0,0,0,0,0,0,0,0,0,45
155,0,0,0,0,0,0,0,0,0,0,0,0,0,0,0,0,0,156
87,0,0,0,0,0,0,0,0,0,0,0,0,0,0,0,0,0,88
106,0,0,0,0,0,0,0,0,0,0,0,0,0,0,0,0,0,107
73,0,0,0,0,0,0,0,0,0,0,0,0,0,0,0,0,0,74
39,0,0,0,0,0,0,0,0,0,0,0,0,0,0,0,0,0,40
120,0,0,0,0,0,0,0,0,0,0,0,0,0,0,0,0,0,121
47,0,0,0,0,0,0,0,0,0,0,0,0,0,0,0,0,0,48
131,0,0,0,0,0,0,0,0,0,0,0,0,0,0,0,0,0,132
18,0,0,0,0,0,0,0,0,0,0,0,0,0,0,0,0,0,19
94,0,0,0,0,0,0,0,0,0,0,0,0,0,0,0,0,0,95
112,0,0,0,0,0,0,0,0,0,0,0,0,0,0,0,0,0,113
129,0,0,0,0,0,0,0,0,0,0,0,0,0,0,0,0,0,130
21,0,0,0,0,0,0,0,0,0,0,0,0,0,0,0,0,0,22
67,0,0,0,0,0,0,0,0,0,0,0,0,0,0,0,0,0,68
102,0,0,0,0,0,0,0,0,0,0,0,0,0,0,0,0,0,103
109,0,0,0,0,0,0,0,0,0,0,0,0,0,0,0,0,0,110
108,0,0,0,0,0,0,0,0,0,0,0,0,0,0,0,0,0,109
32,0,0,0,0,0,0,0,0,0,0,0,0,0,0,0,0,0,33
151,0,0,0,0,0,0,0,0,0,0,0,0,0,0,0,0,0,152
57,0,0,0,0,0,0,0,0,0,0,0,0,0,0,0,0,0,58
77,0,0,0,0,0,0,0,0,0,0,0,0,0,0,0,0,0,78
41,0,0,0,0,0,0,0,0,0,0,0,0,0,0,0,0,0,42
93,0,0,0,0,0,0,0,0,0,0,0,0,0,0,0,0,0,94
147,0,0,0,0,0,0,0,0,0,0,0,0,0,0,0,0,0,148
114,0,0,0,0,0,0,0,0,0,0,0,0,0,0,0,0,0,115
37,0,0,0,0,0,0,0,0,0,0,0,0,0,0,0,0,0,38
157,0,0,0,0,0,0,0,0,0,0,0,0,0,0,0,0,0,158
25,0,0,0,0,0,0,0,0,0,0,0,0,0,0,0,0,0,26
12,0,0,0,0,0,0,0,0,0,0,0,0,0,0,0,0,0,13
33,0,0,0,0,0,0,0,0,0,0,0,0,0,0,0,0,0,34
88,0,0,0,0,0,0,0,0,0,0,0,0,0,0,0,0,0,89
154,0,0,0,0,0,0,0,0,0,0,0,0,0,0,0,0,0,155
7,0,0,0,0,0,0,0,0,0,0,0,0,0,0,0,0,0,8
95,0,0,0,0,0,0,0,0,0,0,0,0,0,0,0,0,0,96
6,0,0,0,0,0,0,0,0,0,0,0,0,0,0,0,0,0,7
23,0,0,0,0,0,0,0,0,0,0,0,0,0,0,0,0,0,24
56,0,0,0,0,0,0,0,0,0,0,0,0,0,0,0,0,0,57
63,0,0,0,0,0,0,0,0,0,0,0,0,0,0,0,0,0,64
65,0,0,0,0,0,0,0,0,0,0,0,0,0,0,0,0,0,66
126,0,0,0,0,0,0,0,0,0,0,0,0,0,0,0,0,0,127
136,0,0,0,0,0,0,0,0,0,0,0,0,0,0,0,0,0,137
105,0,0,0,0,0,0,0,0,0,0,0,0,0,0,0,0,0,106
28,0,0,0,0,0,0,0,0,0,0,0,0,0,0,0,0,0,29
130,0,0,0,0,0,0,0,0,0,0,0,0,0,0,0,0,0,131
40,0,0,0,0,0,0,0,0,0,0,0,0,0,0,0,0,0,41
99,0,0,0,0,0,0,0,0,0,0,0,0,0,0,0,0,0,100
49,0,0,0,0,0,0,0,0,0,0,0,0,0,0,0,0,0,50
153,0,0,0,0,0,0,0,0,0,0,0,0,0,0,0,0,0,154
127,0,0,0,0,0,0,0,0,0,0,0,0,0,0,0,0,0,128
78,0,0,0,0,0,0,0,0,0,0,0,0,0,0,0,0,0,79
119,0,0,0,0,0,0,0,0,0,0,0,0,0,0,0,0,0,120
70,0,0,0,0,0,0,0,0,0,0,0,0,0,0,0,0,0,71
116,0,0,0,0,0,0,0,0,0,0,0,0,0,0,0,0,0,117
141,0,0,0,0,0,0,0,0,0,0,0,0,0,0,0,0,0,142
66,0,0,0,0,0,0,0,0,0,0,0,0,0,0,0,0,0,67
26,0,0,0,0,0,0,0,0,0,0,0,0,0,0,0,0,0,27
85,0,0,0,0,0,0,0,0,0,0,0,0,0,0,0,0,0,86
137,0,0,0,0,0,0,0,0,0,0,0,0,0,0,0,0,0,138
15,0,0,0,0,0,0,0,0,0,0,0,0,0,0,0,0,0,16
75,0,0,0,0,0,0,0,0,0,0,0,0,0,0,0,0,0,76
97,0,0,0,0,0,0,0,0,0,0,0,0,0,0,0,0,0,98
104,0,0,0,0,0,0,0,0,0,0,0,0,0,0,0,0,0,105
123,0,0,0,0,0,0,0,0,0,0,0,0,0,0,0,0,0,124
158,0,0,0,0,0,0,0,0,0,0,0,0,0,0,0,0,0,159
80,0,0,0,0,0,0,0,0,0,0,0,0,0,0,0,0,0,81
144,0,0,0,0,0,0,0,0,0,0,0,0,0,0,0,0,0,145
98,0,0,0,0,0,0,0,0,0,0,0,0,0,0,0,0,0,99
27,0,0,0,0,0,0,0,0,0,0,0,0,0,0,0,0,0,28
0,0,0,0,0,0,0,0,0,0,0,0,0,0,0,0,0,0,1
90,0,0,0,0,0,0,0,0,0,0,0,0,0,0,0,0,0,91
48,0,0,0,0,0,0,0,0,0,0,0,0,0,0,0,0,0,49
69,0,0,0,0,0,0,0,0,0,0,0,0,0,0,0,0,0,70
43,0,0,0,0,0,0,0,0,0,0,0,0,0,0,0,0,0,44
82,0,0,0,0,0,0,0,0,0,0,0,0,0,0,0,0,0,83
101,0,0,0,0,0,0,0,0,0,0,0,0,0,0,0,0,0,102
14,0,0,0,0,0,0,0,0,0,0,0,0,0,0,0,0,0,15
61,0,0,0,0,0,0,0,0,0,0,0,0,0,0,0,0,0,62
89,0,0,0,0,0,0,0,0,0,0,0,0,0,0,0,0,0,90
2,0,0,0,0,0,0,0,0,0,0,0,0,0,0,0,0,0,3
128,0,0,0,0,0,0,0,0,0,0,0,0,0,0,0,0,0,129
115,0,0,0,0,0,0,0,0,0,0,0,0,0,0,0,0,0,116
