2019-09-20 10:31:14,163 ERROR: Exception on /reset_password_request [GET] [in /home/mohan/.virtualenv/flack_env/lib/python3.6/site-packages/flask/app.py:1891]
Traceback (most recent call last):
  File "/home/mohan/.virtualenv/flack_env/lib/python3.6/site-packages/flask/app.py", line 2446, in wsgi_app
    response = self.full_dispatch_request()
  File "/home/mohan/.virtualenv/flack_env/lib/python3.6/site-packages/flask/app.py", line 1951, in full_dispatch_request
    rv = self.handle_user_exception(e)
  File "/home/mohan/.virtualenv/flack_env/lib/python3.6/site-packages/flask/app.py", line 1820, in handle_user_exception
    reraise(exc_type, exc_value, tb)
  File "/home/mohan/.virtualenv/flack_env/lib/python3.6/site-packages/flask/_compat.py", line 39, in reraise
    raise value
  File "/home/mohan/.virtualenv/flack_env/lib/python3.6/site-packages/flask/app.py", line 1949, in full_dispatch_request
    rv = self.dispatch_request()
  File "/home/mohan/.virtualenv/flack_env/lib/python3.6/site-packages/flask/app.py", line 1935, in dispatch_request
    return self.view_functions[rule.endpoint](**req.view_args)
  File "/home/mohan/flask/microblog/app/routes.py", line 160, in reset_password_request
    title='Reset Password', form=form)
  File "/home/mohan/.virtualenv/flack_env/lib/python3.6/site-packages/flask/templating.py", line 138, in render_template
    ctx.app.jinja_env.get_or_select_template(template_name_or_list),
  File "/home/mohan/.virtualenv/flack_env/lib/python3.6/site-packages/jinja2/environment.py", line 869, in get_or_select_template
    return self.get_template(template_name_or_list, parent, globals)
  File "/home/mohan/.virtualenv/flack_env/lib/python3.6/site-packages/jinja2/environment.py", line 830, in get_template
    return self._load_template(name, self.make_globals(globals))
  File "/home/mohan/.virtualenv/flack_env/lib/python3.6/site-packages/jinja2/environment.py", line 804, in _load_template
    template = self.loader.load(self, name, globals)
  File "/home/mohan/.virtualenv/flack_env/lib/python3.6/site-packages/jinja2/loaders.py", line 113, in load
    source, filename, uptodate = self.get_source(environment, name)
  File "/home/mohan/.virtualenv/flack_env/lib/python3.6/site-packages/flask/templating.py", line 60, in get_source
    return self._get_source_fast(environment, template)
  File "/home/mohan/.virtualenv/flack_env/lib/python3.6/site-packages/flask/templating.py", line 89, in _get_source_fast
    raise TemplateNotFound(template)
jinja2.exceptions.TemplateNotFound: reset_password_request.html
2019-09-20 10:32:50,240 ERROR: Exception on /reset_password_request [GET] [in /home/mohan/.virtualenv/flack_env/lib/python3.6/site-packages/flask/app.py:1891]
Traceback (most recent call last):
  File "/home/mohan/.virtualenv/flack_env/lib/python3.6/site-packages/flask/app.py", line 2446, in wsgi_app
    response = self.full_dispatch_request()
  File "/home/mohan/.virtualenv/flack_env/lib/python3.6/site-packages/flask/app.py", line 1951, in full_dispatch_request
    rv = self.handle_user_exception(e)
  File "/home/mohan/.virtualenv/flack_env/lib/python3.6/site-packages/flask/app.py", line 1820, in handle_user_exception
    reraise(exc_type, exc_value, tb)
  File "/home/mohan/.virtualenv/flack_env/lib/python3.6/site-packages/flask/_compat.py", line 39, in reraise
    raise value
  File "/home/mohan/.virtualenv/flack_env/lib/python3.6/site-packages/flask/app.py", line 1949, in full_dispatch_request
    rv = self.dispatch_request()
  File "/home/mohan/.virtualenv/flack_env/lib/python3.6/site-packages/flask/app.py", line 1935, in dispatch_request
    return self.view_functions[rule.endpoint](**req.view_args)
  File "/home/mohan/flask/microblog/app/routes.py", line 160, in reset_password_request
    title='Reset Password', form=form)
  File "/home/mohan/.virtualenv/flack_env/lib/python3.6/site-packages/flask/templating.py", line 138, in render_template
    ctx.app.jinja_env.get_or_select_template(template_name_or_list),
  File "/home/mohan/.virtualenv/flack_env/lib/python3.6/site-packages/jinja2/environment.py", line 869, in get_or_select_template
    return self.get_template(template_name_or_list, parent, globals)
  File "/home/mohan/.virtualenv/flack_env/lib/python3.6/site-packages/jinja2/environment.py", line 830, in get_template
    return self._load_template(name, self.make_globals(globals))
  File "/home/mohan/.virtualenv/flack_env/lib/python3.6/site-packages/jinja2/environment.py", line 804, in _load_template
    template = self.loader.load(self, name, globals)
  File "/home/mohan/.virtualenv/flack_env/lib/python3.6/site-packages/jinja2/loaders.py", line 113, in load
    source, filename, uptodate = self.get_source(environment, name)
  File "/home/mohan/.virtualenv/flack_env/lib/python3.6/site-packages/flask/templating.py", line 60, in get_source
    return self._get_source_fast(environment, template)
  File "/home/mohan/.virtualenv/flack_env/lib/python3.6/site-packages/flask/templating.py", line 89, in _get_source_fast
    raise TemplateNotFound(template)
jinja2.exceptions.TemplateNotFound: reset_password_request.html
2019-09-20 10:33:46,937 ERROR: Exception on /reset_password_request [GET] [in /home/mohan/.virtualenv/flack_env/lib/python3.6/site-packages/flask/app.py:1891]
Traceback (most recent call last):
  File "/home/mohan/.virtualenv/flack_env/lib/python3.6/site-packages/flask/app.py", line 2446, in wsgi_app
    response = self.full_dispatch_request()
  File "/home/mohan/.virtualenv/flack_env/lib/python3.6/site-packages/flask/app.py", line 1951, in full_dispatch_request
    rv = self.handle_user_exception(e)
  File "/home/mohan/.virtualenv/flack_env/lib/python3.6/site-packages/flask/app.py", line 1820, in handle_user_exception
    reraise(exc_type, exc_value, tb)
  File "/home/mohan/.virtualenv/flack_env/lib/python3.6/site-packages/flask/_compat.py", line 39, in reraise
    raise value
  File "/home/mohan/.virtualenv/flack_env/lib/python3.6/site-packages/flask/app.py", line 1949, in full_dispatch_request
    rv = self.dispatch_request()
  File "/home/mohan/.virtualenv/flack_env/lib/python3.6/site-packages/flask/app.py", line 1935, in dispatch_request
    return self.view_functions[rule.endpoint](**req.view_args)
  File "/home/mohan/flask/microblog/app/routes.py", line 160, in reset_password_request
    title='Reset Password', form=form)
  File "/home/mohan/.virtualenv/flack_env/lib/python3.6/site-packages/flask/templating.py", line 138, in render_template
    ctx.app.jinja_env.get_or_select_template(template_name_or_list),
  File "/home/mohan/.virtualenv/flack_env/lib/python3.6/site-packages/jinja2/environment.py", line 869, in get_or_select_template
    return self.get_template(template_name_or_list, parent, globals)
  File "/home/mohan/.virtualenv/flack_env/lib/python3.6/site-packages/jinja2/environment.py", line 830, in get_template
    return self._load_template(name, self.make_globals(globals))
  File "/home/mohan/.virtualenv/flack_env/lib/python3.6/site-packages/jinja2/environment.py", line 804, in _load_template
    template = self.loader.load(self, name, globals)
  File "/home/mohan/.virtualenv/flack_env/lib/python3.6/site-packages/jinja2/loaders.py", line 113, in load
    source, filename, uptodate = self.get_source(environment, name)
  File "/home/mohan/.virtualenv/flack_env/lib/python3.6/site-packages/flask/templating.py", line 60, in get_source
    return self._get_source_fast(environment, template)
  File "/home/mohan/.virtualenv/flack_env/lib/python3.6/site-packages/flask/templating.py", line 89, in _get_source_fast
    raise TemplateNotFound(template)
jinja2.exceptions.TemplateNotFound: reset_password_request.html
2019-09-20 10:40:35,769 INFO: Microblog startup [in /home/mohan/flask/microblog/app/__init__.py:52]
2019-09-20 11:24:04,832 INFO: Microblog startup [in /home/mohan/flask/microblog/app/__init__.py:52]
