2019-09-20 17:51:53,959 ERROR: Exception on /index [GET] [in /home/mohan/.virtualenv/flack_env/lib/python3.6/site-packages/flask/app.py:1891]
Traceback (most recent call last):
  File "/home/mohan/.virtualenv/flack_env/lib/python3.6/site-packages/flask/app.py", line 2446, in wsgi_app
    response = self.full_dispatch_request()
  File "/home/mohan/.virtualenv/flack_env/lib/python3.6/site-packages/flask/app.py", line 1951, in full_dispatch_request
    rv = self.handle_user_exception(e)
  File "/home/mohan/.virtualenv/flack_env/lib/python3.6/site-packages/flask/app.py", line 1820, in handle_user_exception
    reraise(exc_type, exc_value, tb)
  File "/home/mohan/.virtualenv/flack_env/lib/python3.6/site-packages/flask/_compat.py", line 39, in reraise
    raise value
  File "/home/mohan/.virtualenv/flack_env/lib/python3.6/site-packages/flask/app.py", line 1947, in full_dispatch_request
    rv = self.preprocess_request()
  File "/home/mohan/.virtualenv/flack_env/lib/python3.6/site-packages/flask/app.py", line 2241, in preprocess_request
    rv = func()
  File "/home/mohan/flask/microblog/app/routes.py", line 17, in before_request
    g.locale = str(get_locale())
NameError: name 'g' is not defined
2019-09-20 17:52:11,339 ERROR: Exception on /index [GET] [in /home/mohan/.virtualenv/flack_env/lib/python3.6/site-packages/flask/app.py:1891]
Traceback (most recent call last):
  File "/home/mohan/.virtualenv/flack_env/lib/python3.6/site-packages/flask/app.py", line 2446, in wsgi_app
    response = self.full_dispatch_request()
  File "/home/mohan/.virtualenv/flack_env/lib/python3.6/site-packages/flask/app.py", line 1951, in full_dispatch_request
    rv = self.handle_user_exception(e)
  File "/home/mohan/.virtualenv/flack_env/lib/python3.6/site-packages/flask/app.py", line 1820, in handle_user_exception
    reraise(exc_type, exc_value, tb)
  File "/home/mohan/.virtualenv/flack_env/lib/python3.6/site-packages/flask/_compat.py", line 39, in reraise
    raise value
  File "/home/mohan/.virtualenv/flack_env/lib/python3.6/site-packages/flask/app.py", line 1947, in full_dispatch_request
    rv = self.preprocess_request()
  File "/home/mohan/.virtualenv/flack_env/lib/python3.6/site-packages/flask/app.py", line 2241, in preprocess_request
    rv = func()
  File "/home/mohan/flask/microblog/app/routes.py", line 17, in before_request
    g.locale = str(get_locale())
NameError: name 'g' is not defined
2019-09-20 17:52:13,382 ERROR: Exception on /index [GET] [in /home/mohan/.virtualenv/flack_env/lib/python3.6/site-packages/flask/app.py:1891]
Traceback (most recent call last):
  File "/home/mohan/.virtualenv/flack_env/lib/python3.6/site-packages/flask/app.py", line 2446, in wsgi_app
    response = self.full_dispatch_request()
  File "/home/mohan/.virtualenv/flack_env/lib/python3.6/site-packages/flask/app.py", line 1951, in full_dispatch_request
    rv = self.handle_user_exception(e)
  File "/home/mohan/.virtualenv/flack_env/lib/python3.6/site-packages/flask/app.py", line 1820, in handle_user_exception
    reraise(exc_type, exc_value, tb)
  File "/home/mohan/.virtualenv/flack_env/lib/python3.6/site-packages/flask/_compat.py", line 39, in reraise
    raise value
  File "/home/mohan/.virtualenv/flack_env/lib/python3.6/site-packages/flask/app.py", line 1947, in full_dispatch_request
    rv = self.preprocess_request()
  File "/home/mohan/.virtualenv/flack_env/lib/python3.6/site-packages/flask/app.py", line 2241, in preprocess_request
    rv = func()
  File "/home/mohan/flask/microblog/app/routes.py", line 17, in before_request
    g.locale = str(get_locale())
NameError: name 'g' is not defined
2019-09-20 17:53:09,152 ERROR: Exception on /index [GET] [in /home/mohan/.virtualenv/flack_env/lib/python3.6/site-packages/flask/app.py:1891]
Traceback (most recent call last):
  File "/home/mohan/.virtualenv/flack_env/lib/python3.6/site-packages/flask/app.py", line 2446, in wsgi_app
    response = self.full_dispatch_request()
  File "/home/mohan/.virtualenv/flack_env/lib/python3.6/site-packages/flask/app.py", line 1951, in full_dispatch_request
    rv = self.handle_user_exception(e)
  File "/home/mohan/.virtualenv/flack_env/lib/python3.6/site-packages/flask/app.py", line 1820, in handle_user_exception
    reraise(exc_type, exc_value, tb)
  File "/home/mohan/.virtualenv/flack_env/lib/python3.6/site-packages/flask/_compat.py", line 39, in reraise
    raise value
  File "/home/mohan/.virtualenv/flack_env/lib/python3.6/site-packages/flask/app.py", line 1947, in full_dispatch_request
    rv = self.preprocess_request()
  File "/home/mohan/.virtualenv/flack_env/lib/python3.6/site-packages/flask/app.py", line 2241, in preprocess_request
    rv = func()
  File "/home/mohan/flask/microblog/app/routes.py", line 17, in before_request
    g.locale = str(get_locale())
NameError: name 'g' is not defined
2019-09-20 17:53:33,649 ERROR: Exception on /index [GET] [in /home/mohan/.virtualenv/flack_env/lib/python3.6/site-packages/flask/app.py:1891]
Traceback (most recent call last):
  File "/home/mohan/.virtualenv/flack_env/lib/python3.6/site-packages/flask/app.py", line 2446, in wsgi_app
    response = self.full_dispatch_request()
  File "/home/mohan/.virtualenv/flack_env/lib/python3.6/site-packages/flask/app.py", line 1951, in full_dispatch_request
    rv = self.handle_user_exception(e)
  File "/home/mohan/.virtualenv/flack_env/lib/python3.6/site-packages/flask/app.py", line 1820, in handle_user_exception
    reraise(exc_type, exc_value, tb)
  File "/home/mohan/.virtualenv/flack_env/lib/python3.6/site-packages/flask/_compat.py", line 39, in reraise
    raise value
  File "/home/mohan/.virtualenv/flack_env/lib/python3.6/site-packages/flask/app.py", line 1947, in full_dispatch_request
    rv = self.preprocess_request()
  File "/home/mohan/.virtualenv/flack_env/lib/python3.6/site-packages/flask/app.py", line 2241, in preprocess_request
    rv = func()
  File "/home/mohan/flask/microblog/app/routes.py", line 17, in before_request
    g.locale = str(get_locale())
NameError: name 'g' is not defined
2019-09-20 17:53:36,001 ERROR: Exception on /index [GET] [in /home/mohan/.virtualenv/flack_env/lib/python3.6/site-packages/flask/app.py:1891]
Traceback (most recent call last):
  File "/home/mohan/.virtualenv/flack_env/lib/python3.6/site-packages/flask/app.py", line 2446, in wsgi_app
    response = self.full_dispatch_request()
  File "/home/mohan/.virtualenv/flack_env/lib/python3.6/site-packages/flask/app.py", line 1951, in full_dispatch_request
    rv = self.handle_user_exception(e)
  File "/home/mohan/.virtualenv/flack_env/lib/python3.6/site-packages/flask/app.py", line 1820, in handle_user_exception
    reraise(exc_type, exc_value, tb)
  File "/home/mohan/.virtualenv/flack_env/lib/python3.6/site-packages/flask/_compat.py", line 39, in reraise
    raise value
  File "/home/mohan/.virtualenv/flack_env/lib/python3.6/site-packages/flask/app.py", line 1947, in full_dispatch_request
    rv = self.preprocess_request()
  File "/home/mohan/.virtualenv/flack_env/lib/python3.6/site-packages/flask/app.py", line 2241, in preprocess_request
    rv = func()
  File "/home/mohan/flask/microblog/app/routes.py", line 17, in before_request
    g.locale = str(get_locale())
NameError: name 'g' is not defined
2019-09-20 17:56:34,507 INFO: Microblog startup [in /home/mohan/flask/microblog/app/__init__.py:57]
2019-09-21 06:35:12,188 INFO: Microblog startup [in /home/mohan/flask/microblog/app/__init__.py:57]
2019-09-21 06:35:23,341 INFO: Microblog startup [in /home/mohan/flask/microblog/app/__init__.py:57]
2019-09-21 15:39:57,601 INFO: Microblog startup [in /home/mohan/flask/microblog/app/__init__.py:74]
