2019-09-21 15:40:41,682 ERROR: Exception on / [GET] [in /home/mohan/.virtualenv/flack_env/lib/python3.6/site-packages/flask/app.py:1891]
Traceback (most recent call last):
  File "/home/mohan/.virtualenv/flack_env/lib/python3.6/site-packages/flask/app.py", line 2446, in wsgi_app
    response = self.full_dispatch_request()
  File "/home/mohan/.virtualenv/flack_env/lib/python3.6/site-packages/flask/app.py", line 1951, in full_dispatch_request
    rv = self.handle_user_exception(e)
  File "/home/mohan/.virtualenv/flack_env/lib/python3.6/site-packages/flask/app.py", line 1820, in handle_user_exception
    reraise(exc_type, exc_value, tb)
  File "/home/mohan/.virtualenv/flack_env/lib/python3.6/site-packages/flask/_compat.py", line 39, in reraise
    raise value
  File "/home/mohan/.virtualenv/flack_env/lib/python3.6/site-packages/flask/app.py", line 1947, in full_dispatch_request
    rv = self.preprocess_request()
  File "/home/mohan/.virtualenv/flack_env/lib/python3.6/site-packages/flask/app.py", line 2241, in preprocess_request
    rv = func()
  File "/home/mohan/flask/microblog/app/main/routes.py", line 16, in before_request
    if current_user.is_authenticated:
  File "/home/mohan/.virtualenv/flack_env/lib/python3.6/site-packages/werkzeug/local.py", line 348, in __getattr__
    return getattr(self._get_current_object(), name)
  File "/home/mohan/.virtualenv/flack_env/lib/python3.6/site-packages/werkzeug/local.py", line 307, in _get_current_object
    return self.__local()
  File "/home/mohan/.virtualenv/flack_env/lib/python3.6/site-packages/flask_login/utils.py", line 26, in <lambda>
    current_user = LocalProxy(lambda: _get_user())
  File "/home/mohan/.virtualenv/flack_env/lib/python3.6/site-packages/flask_login/utils.py", line 335, in _get_user
    current_app.login_manager._load_user()
  File "/home/mohan/.virtualenv/flack_env/lib/python3.6/site-packages/flask_login/login_manager.py", line 359, in _load_user
    return self.reload_user()
  File "/home/mohan/.virtualenv/flack_env/lib/python3.6/site-packages/flask_login/login_manager.py", line 321, in reload_user
    user = self.user_callback(user_id)
  File "/home/mohan/flask/microblog/app/models.py", line 83, in load_user
    return User.query.get(int(id))
  File "/home/mohan/.virtualenv/flack_env/lib/python3.6/site-packages/flask_sqlalchemy/__init__.py", line 517, in __get__
    mapper = orm.class_mapper(type)
  File "/home/mohan/.virtualenv/flack_env/lib/python3.6/site-packages/sqlalchemy/orm/base.py", line 441, in class_mapper
    mapper = _inspect_mapped_class(class_, configure=configure)
  File "/home/mohan/.virtualenv/flack_env/lib/python3.6/site-packages/sqlalchemy/orm/base.py", line 420, in _inspect_mapped_class
    mapper._configure_all()
  File "/home/mohan/.virtualenv/flack_env/lib/python3.6/site-packages/sqlalchemy/orm/mapper.py", line 1337, in _configure_all
    configure_mappers()
  File "/home/mohan/.virtualenv/flack_env/lib/python3.6/site-packages/sqlalchemy/orm/mapper.py", line 3244, in configure_mappers
    raise e
sqlalchemy.exc.InvalidRequestError: One or more mappers failed to initialize - can't proceed with initialization of other mappers. Triggering mapper: 'mapped class User->user'. Original exception was: When initializing mapper mapped class User->user, expression 'Post' failed to locate a name ("name 'Post' is not defined"). If this is a class name, consider adding this relationship() to the <class 'app.models.User'> class after both dependent classes have been defined.
2019-09-21 15:40:46,308 ERROR: Exception on /login [GET] [in /home/mohan/.virtualenv/flack_env/lib/python3.6/site-packages/flask/app.py:1891]
Traceback (most recent call last):
  File "/home/mohan/.virtualenv/flack_env/lib/python3.6/site-packages/flask/app.py", line 2446, in wsgi_app
    response = self.full_dispatch_request()
  File "/home/mohan/.virtualenv/flack_env/lib/python3.6/site-packages/flask/app.py", line 1951, in full_dispatch_request
    rv = self.handle_user_exception(e)
  File "/home/mohan/.virtualenv/flack_env/lib/python3.6/site-packages/flask/app.py", line 1820, in handle_user_exception
    reraise(exc_type, exc_value, tb)
  File "/home/mohan/.virtualenv/flack_env/lib/python3.6/site-packages/flask/_compat.py", line 39, in reraise
    raise value
  File "/home/mohan/.virtualenv/flack_env/lib/python3.6/site-packages/flask/app.py", line 1947, in full_dispatch_request
    rv = self.preprocess_request()
  File "/home/mohan/.virtualenv/flack_env/lib/python3.6/site-packages/flask/app.py", line 2241, in preprocess_request
    rv = func()
  File "/home/mohan/flask/microblog/app/main/routes.py", line 16, in before_request
    if current_user.is_authenticated:
  File "/home/mohan/.virtualenv/flack_env/lib/python3.6/site-packages/werkzeug/local.py", line 348, in __getattr__
    return getattr(self._get_current_object(), name)
  File "/home/mohan/.virtualenv/flack_env/lib/python3.6/site-packages/werkzeug/local.py", line 307, in _get_current_object
    return self.__local()
  File "/home/mohan/.virtualenv/flack_env/lib/python3.6/site-packages/flask_login/utils.py", line 26, in <lambda>
    current_user = LocalProxy(lambda: _get_user())
  File "/home/mohan/.virtualenv/flack_env/lib/python3.6/site-packages/flask_login/utils.py", line 335, in _get_user
    current_app.login_manager._load_user()
  File "/home/mohan/.virtualenv/flack_env/lib/python3.6/site-packages/flask_login/login_manager.py", line 359, in _load_user
    return self.reload_user()
  File "/home/mohan/.virtualenv/flack_env/lib/python3.6/site-packages/flask_login/login_manager.py", line 321, in reload_user
    user = self.user_callback(user_id)
  File "/home/mohan/flask/microblog/app/models.py", line 83, in load_user
    return User.query.get(int(id))
  File "/home/mohan/.virtualenv/flack_env/lib/python3.6/site-packages/flask_sqlalchemy/__init__.py", line 517, in __get__
    mapper = orm.class_mapper(type)
  File "/home/mohan/.virtualenv/flack_env/lib/python3.6/site-packages/sqlalchemy/orm/base.py", line 441, in class_mapper
    mapper = _inspect_mapped_class(class_, configure=configure)
  File "/home/mohan/.virtualenv/flack_env/lib/python3.6/site-packages/sqlalchemy/orm/base.py", line 420, in _inspect_mapped_class
    mapper._configure_all()
  File "/home/mohan/.virtualenv/flack_env/lib/python3.6/site-packages/sqlalchemy/orm/mapper.py", line 1337, in _configure_all
    configure_mappers()
  File "/home/mohan/.virtualenv/flack_env/lib/python3.6/site-packages/sqlalchemy/orm/mapper.py", line 3244, in configure_mappers
    raise e
sqlalchemy.exc.InvalidRequestError: One or more mappers failed to initialize - can't proceed with initialization of other mappers. Triggering mapper: 'mapped class User->user'. Original exception was: When initializing mapper mapped class User->user, expression 'Post' failed to locate a name ("name 'Post' is not defined"). If this is a class name, consider adding this relationship() to the <class 'app.models.User'> class after both dependent classes have been defined.
2019-09-21 15:50:44,103 INFO: Microblog startup [in /home/mohan/flask/microblog/app/__init__.py:74]
2019-09-21 15:50:53,146 INFO: Microblog startup [in /home/mohan/flask/microblog/app/__init__.py:74]
2019-09-21 15:51:29,535 INFO: Microblog startup [in /home/mohan/flask/microblog/app/__init__.py:74]
2019-09-21 15:54:21,257 INFO: Microblog startup [in /home/mohan/flask/microblog/app/__init__.py:74]
