2019-09-26 10:20:11,719 ERROR: Exception on / [GET] [in /home/mohan/.virtualenv/flack_env/lib/python3.6/site-packages/flask/app.py:1891]
Traceback (most recent call last):
  File "/home/mohan/.virtualenv/flack_env/lib/python3.6/site-packages/flask/app.py", line 2446, in wsgi_app
    response = self.full_dispatch_request()
  File "/home/mohan/.virtualenv/flack_env/lib/python3.6/site-packages/flask/app.py", line 1951, in full_dispatch_request
    rv = self.handle_user_exception(e)
  File "/home/mohan/.virtualenv/flack_env/lib/python3.6/site-packages/flask/app.py", line 1820, in handle_user_exception
    reraise(exc_type, exc_value, tb)
  File "/home/mohan/.virtualenv/flack_env/lib/python3.6/site-packages/flask/_compat.py", line 39, in reraise
    raise value
  File "/home/mohan/.virtualenv/flack_env/lib/python3.6/site-packages/flask/app.py", line 1947, in full_dispatch_request
    rv = self.preprocess_request()
  File "/home/mohan/.virtualenv/flack_env/lib/python3.6/site-packages/flask/app.py", line 2241, in preprocess_request
    rv = func()
  File "/home/mohan/flask/flaskq/app/auth/routes.py", line 16, in before_request
    current_user.last_seen = datetime.utcnow()
  File "/home/mohan/.virtualenv/flack_env/lib/python3.6/site-packages/werkzeug/local.py", line 348, in __getattr__
    return getattr(self._get_current_object(), name)
AttributeError: 'User' object has no attribute 'ping'
2019-09-26 10:20:17,508 INFO: Quora Startup [in /home/mohan/flask/flaskq/app/__init__.py:79]
2019-09-26 10:20:21,663 ERROR: Exception on / [GET] [in /home/mohan/.virtualenv/flack_env/lib/python3.6/site-packages/flask/app.py:1891]
Traceback (most recent call last):
  File "/home/mohan/.virtualenv/flack_env/lib/python3.6/site-packages/flask/app.py", line 2446, in wsgi_app
    response = self.full_dispatch_request()
  File "/home/mohan/.virtualenv/flack_env/lib/python3.6/site-packages/flask/app.py", line 1951, in full_dispatch_request
    rv = self.handle_user_exception(e)
  File "/home/mohan/.virtualenv/flack_env/lib/python3.6/site-packages/flask/app.py", line 1820, in handle_user_exception
    reraise(exc_type, exc_value, tb)
  File "/home/mohan/.virtualenv/flack_env/lib/python3.6/site-packages/flask/_compat.py", line 39, in reraise
    raise value
  File "/home/mohan/.virtualenv/flack_env/lib/python3.6/site-packages/flask/app.py", line 1947, in full_dispatch_request
    rv = self.preprocess_request()
  File "/home/mohan/.virtualenv/flack_env/lib/python3.6/site-packages/flask/app.py", line 2241, in preprocess_request
    rv = func()
  File "/home/mohan/flask/flaskq/app/auth/routes.py", line 16, in before_request
    current_user.last_seen = datetime.utcnow()
NameError: name 'datetime' is not defined
2019-09-26 10:20:58,955 INFO: Quora Startup [in /home/mohan/flask/flaskq/app/__init__.py:79]
2019-09-26 10:21:01,314 ERROR: Exception on / [GET] [in /home/mohan/.virtualenv/flack_env/lib/python3.6/site-packages/flask/app.py:1891]
Traceback (most recent call last):
  File "/home/mohan/.virtualenv/flack_env/lib/python3.6/site-packages/flask/app.py", line 2446, in wsgi_app
    response = self.full_dispatch_request()
  File "/home/mohan/.virtualenv/flack_env/lib/python3.6/site-packages/flask/app.py", line 1951, in full_dispatch_request
    rv = self.handle_user_exception(e)
  File "/home/mohan/.virtualenv/flack_env/lib/python3.6/site-packages/flask/app.py", line 1820, in handle_user_exception
    reraise(exc_type, exc_value, tb)
  File "/home/mohan/.virtualenv/flack_env/lib/python3.6/site-packages/flask/_compat.py", line 39, in reraise
    raise value
  File "/home/mohan/.virtualenv/flack_env/lib/python3.6/site-packages/flask/app.py", line 1947, in full_dispatch_request
    rv = self.preprocess_request()
  File "/home/mohan/.virtualenv/flack_env/lib/python3.6/site-packages/flask/app.py", line 2241, in preprocess_request
    rv = func()
  File "/home/mohan/flask/flaskq/app/auth/routes.py", line 19, in before_request
    g.search_form = SearchForm()
NameError: name 'SearchForm' is not defined
2019-09-26 10:21:17,129 INFO: Quora Startup [in /home/mohan/flask/flaskq/app/__init__.py:79]
2019-09-26 10:22:26,830 INFO: Quora Startup [in /home/mohan/flask/flaskq/app/__init__.py:79]
2019-09-26 10:47:20,405 INFO: Quora Startup [in /home/mohan/flask/flaskq/app/__init__.py:79]
2019-09-26 10:55:22,111 INFO: Quora Startup [in /home/mohan/flask/flaskq/app/__init__.py:79]
2019-09-26 10:57:27,667 INFO: Quora Startup [in /home/mohan/flask/flaskq/app/__init__.py:79]
2019-09-26 10:58:38,972 INFO: Quora Startup [in /home/mohan/flask/flaskq/app/__init__.py:79]
2019-09-26 11:03:36,521 INFO: Quora Startup [in /home/mohan/flask/flaskq/app/__init__.py:79]
2019-09-26 11:05:56,416 INFO: Quora Startup [in /home/mohan/flask/flaskq/app/__init__.py:79]
2019-09-26 11:06:53,384 INFO: Quora Startup [in /home/mohan/flask/flaskq/app/__init__.py:79]
2019-09-26 11:21:42,059 INFO: Quora Startup [in /home/mohan/flask/flaskq/app/__init__.py:79]
2019-09-26 11:21:49,377 INFO: Quora Startup [in /home/mohan/flask/flaskq/app/__init__.py:79]
2019-09-26 12:03:54,169 INFO: Quora Startup [in /home/mohan/flask/flaskq/app/__init__.py:79]
2019-09-26 12:06:49,360 INFO: Quora Startup [in /home/mohan/flask/flaskq/app/__init__.py:79]
2019-09-26 12:10:49,203 INFO: Quora Startup [in /home/mohan/flask/flaskq/app/__init__.py:79]
2019-09-26 12:22:09,341 INFO: Quora Startup [in /home/mohan/flask/flaskq/app/__init__.py:79]
2019-09-26 12:23:23,233 INFO: Quora Startup [in /home/mohan/flask/flaskq/app/__init__.py:79]
2019-09-26 12:49:23,205 INFO: Quora Startup [in /home/mohan/flask/flaskq/app/__init__.py:79]
2019-09-26 12:49:33,926 INFO: Quora Startup [in /home/mohan/flask/flaskq/app/__init__.py:79]
2019-09-26 12:49:40,955 INFO: Quora Startup [in /home/mohan/flask/flaskq/app/__init__.py:79]
2019-09-26 12:50:28,310 INFO: Quora Startup [in /home/mohan/flask/flaskq/app/__init__.py:79]
2019-09-26 12:51:25,576 INFO: Quora Startup [in /home/mohan/flask/flaskq/app/__init__.py:79]
2019-09-26 12:51:35,468 ERROR: Exception on /vote/2 [GET] [in /home/mohan/.virtualenv/flack_env/lib/python3.6/site-packages/flask/app.py:1891]
Traceback (most recent call last):
  File "/home/mohan/.virtualenv/flack_env/lib/python3.6/site-packages/flask/app.py", line 2446, in wsgi_app
    response = self.full_dispatch_request()
  File "/home/mohan/.virtualenv/flack_env/lib/python3.6/site-packages/flask/app.py", line 1952, in full_dispatch_request
    return self.finalize_request(rv)
  File "/home/mohan/.virtualenv/flack_env/lib/python3.6/site-packages/flask/app.py", line 1967, in finalize_request
    response = self.make_response(rv)
  File "/home/mohan/.virtualenv/flack_env/lib/python3.6/site-packages/flask/app.py", line 2097, in make_response
    "The view function did not return a valid response. The"
TypeError: The view function did not return a valid response. The function either returned None or ended without a return statement.
2019-09-26 12:55:49,817 INFO: Quora Startup [in /home/mohan/flask/flaskq/app/__init__.py:79]
2019-09-26 12:59:31,220 INFO: Quora Startup [in /home/mohan/flask/flaskq/app/__init__.py:79]
2019-09-26 13:33:31,055 INFO: Quora Startup [in /home/mohan/flask/flaskq/app/__init__.py:79]
2019-09-26 13:46:52,229 INFO: Quora Startup [in /home/mohan/flask/flaskq/app/__init__.py:79]
2019-09-26 13:46:55,394 INFO: Quora Startup [in /home/mohan/flask/flaskq/app/__init__.py:79]
2019-09-26 15:42:59,187 INFO: Quora Startup [in /home/mohan/flask/flaskq/app/__init__.py:79]
2019-09-26 16:11:44,952 INFO: Quora Startup [in /home/mohan/flask/flaskq/app/__init__.py:79]
2019-09-26 16:51:09,627 INFO: Quora Startup [in /home/mohan/flask/flaskq/app/__init__.py:79]
2019-09-26 16:51:28,913 INFO: Quora Startup [in /home/mohan/flask/flaskq/app/__init__.py:79]
2019-09-26 16:56:33,895 INFO: Quora Startup [in /home/mohan/flask/flaskq/app/__init__.py:79]
