2019-10-08 11:27:04,247 ERROR: Exception on /get_file/6ce2dc2a-0b4d-4bc1-9f7f-f08efe2d14e6 [GET] [in /home/mohan/.virtualenv/flack_env/lib/python3.6/site-packages/flask/app.py:1891]
Traceback (most recent call last):
  File "/home/mohan/.virtualenv/flack_env/lib/python3.6/site-packages/flask/app.py", line 2446, in wsgi_app
    response = self.full_dispatch_request()
  File "/home/mohan/.virtualenv/flack_env/lib/python3.6/site-packages/flask/app.py", line 1951, in full_dispatch_request
    rv = self.handle_user_exception(e)
  File "/home/mohan/.virtualenv/flack_env/lib/python3.6/site-packages/flask/app.py", line 1820, in handle_user_exception
    reraise(exc_type, exc_value, tb)
  File "/home/mohan/.virtualenv/flack_env/lib/python3.6/site-packages/flask/_compat.py", line 39, in reraise
    raise value
  File "/home/mohan/.virtualenv/flack_env/lib/python3.6/site-packages/flask/app.py", line 1949, in full_dispatch_request
    rv = self.dispatch_request()
  File "/home/mohan/.virtualenv/flack_env/lib/python3.6/site-packages/flask/app.py", line 1935, in dispatch_request
    return self.view_functions[rule.endpoint](**req.view_args)
  File "/home/mohan/flask/flaskq/app/main/routes.py", line 231, in get_file
    url = task.result
  File "/home/mohan/.virtualenv/flack_env/lib/python3.6/site-packages/celery/result.py", line 436, in result
    return self._get_task_meta()['result']
  File "/home/mohan/.virtualenv/flack_env/lib/python3.6/site-packages/celery/result.py", line 412, in _get_task_meta
    return self._maybe_set_cache(self.backend.get_task_meta(self.id))
  File "/home/mohan/.virtualenv/flack_env/lib/python3.6/site-packages/celery/backends/base.py", line 386, in get_task_meta
    meta = self._get_task_meta_for(task_id)
AttributeError: 'DisabledBackend' object has no attribute '_get_task_meta_for'
2019-10-08 11:27:08,122 ERROR: Exception on /get_file/9187ef93-99c2-4e7a-bd5e-66d03519877b [GET] [in /home/mohan/.virtualenv/flack_env/lib/python3.6/site-packages/flask/app.py:1891]
Traceback (most recent call last):
  File "/home/mohan/.virtualenv/flack_env/lib/python3.6/site-packages/flask/app.py", line 2446, in wsgi_app
    response = self.full_dispatch_request()
  File "/home/mohan/.virtualenv/flack_env/lib/python3.6/site-packages/flask/app.py", line 1951, in full_dispatch_request
    rv = self.handle_user_exception(e)
  File "/home/mohan/.virtualenv/flack_env/lib/python3.6/site-packages/flask/app.py", line 1820, in handle_user_exception
    reraise(exc_type, exc_value, tb)
  File "/home/mohan/.virtualenv/flack_env/lib/python3.6/site-packages/flask/_compat.py", line 39, in reraise
    raise value
  File "/home/mohan/.virtualenv/flack_env/lib/python3.6/site-packages/flask/app.py", line 1949, in full_dispatch_request
    rv = self.dispatch_request()
  File "/home/mohan/.virtualenv/flack_env/lib/python3.6/site-packages/flask/app.py", line 1935, in dispatch_request
    return self.view_functions[rule.endpoint](**req.view_args)
  File "/home/mohan/flask/flaskq/app/main/routes.py", line 231, in get_file
    url = task.result
  File "/home/mohan/.virtualenv/flack_env/lib/python3.6/site-packages/celery/result.py", line 436, in result
    return self._get_task_meta()['result']
  File "/home/mohan/.virtualenv/flack_env/lib/python3.6/site-packages/celery/result.py", line 412, in _get_task_meta
    return self._maybe_set_cache(self.backend.get_task_meta(self.id))
  File "/home/mohan/.virtualenv/flack_env/lib/python3.6/site-packages/celery/backends/base.py", line 386, in get_task_meta
    meta = self._get_task_meta_for(task_id)
AttributeError: 'DisabledBackend' object has no attribute '_get_task_meta_for'
2019-10-08 11:30:19,535 INFO: Quora startup [in /home/mohan/flask/flaskq/app/__init__.py:93]
2019-10-08 11:31:08,329 ERROR: Exception on /get_file/41007dee-4fd4-4188-8797-27ee85c589d7 [GET] [in /home/mohan/.virtualenv/flack_env/lib/python3.6/site-packages/flask/app.py:1891]
Traceback (most recent call last):
  File "/home/mohan/.virtualenv/flack_env/lib/python3.6/site-packages/flask/app.py", line 2446, in wsgi_app
    response = self.full_dispatch_request()
  File "/home/mohan/.virtualenv/flack_env/lib/python3.6/site-packages/flask/app.py", line 1951, in full_dispatch_request
    rv = self.handle_user_exception(e)
  File "/home/mohan/.virtualenv/flack_env/lib/python3.6/site-packages/flask/app.py", line 1820, in handle_user_exception
    reraise(exc_type, exc_value, tb)
  File "/home/mohan/.virtualenv/flack_env/lib/python3.6/site-packages/flask/_compat.py", line 39, in reraise
    raise value
  File "/home/mohan/.virtualenv/flack_env/lib/python3.6/site-packages/flask/app.py", line 1949, in full_dispatch_request
    rv = self.dispatch_request()
  File "/home/mohan/.virtualenv/flack_env/lib/python3.6/site-packages/flask/app.py", line 1935, in dispatch_request
    return self.view_functions[rule.endpoint](**req.view_args)
  File "/home/mohan/flask/flaskq/app/main/routes.py", line 231, in get_file
    url = task.result
  File "/home/mohan/.virtualenv/flack_env/lib/python3.6/site-packages/celery/result.py", line 436, in result
    return self._get_task_meta()['result']
  File "/home/mohan/.virtualenv/flack_env/lib/python3.6/site-packages/celery/result.py", line 412, in _get_task_meta
    return self._maybe_set_cache(self.backend.get_task_meta(self.id))
  File "/home/mohan/.virtualenv/flack_env/lib/python3.6/site-packages/celery/backends/base.py", line 386, in get_task_meta
    meta = self._get_task_meta_for(task_id)
AttributeError: 'DisabledBackend' object has no attribute '_get_task_meta_for'
2019-10-08 11:41:46,298 ERROR: Exception on /get_file/e8543e47-fb18-49ae-a7a5-985938e32590 [GET] [in /home/mohan/.virtualenv/flack_env/lib/python3.6/site-packages/flask/app.py:1891]
Traceback (most recent call last):
  File "/home/mohan/.virtualenv/flack_env/lib/python3.6/site-packages/flask/app.py", line 2446, in wsgi_app
    response = self.full_dispatch_request()
  File "/home/mohan/.virtualenv/flack_env/lib/python3.6/site-packages/flask/app.py", line 1951, in full_dispatch_request
    rv = self.handle_user_exception(e)
  File "/home/mohan/.virtualenv/flack_env/lib/python3.6/site-packages/flask/app.py", line 1820, in handle_user_exception
    reraise(exc_type, exc_value, tb)
  File "/home/mohan/.virtualenv/flack_env/lib/python3.6/site-packages/flask/_compat.py", line 39, in reraise
    raise value
  File "/home/mohan/.virtualenv/flack_env/lib/python3.6/site-packages/flask/app.py", line 1949, in full_dispatch_request
    rv = self.dispatch_request()
  File "/home/mohan/.virtualenv/flack_env/lib/python3.6/site-packages/flask/app.py", line 1935, in dispatch_request
    return self.view_functions[rule.endpoint](**req.view_args)
  File "/home/mohan/flask/flaskq/app/main/routes.py", line 231, in get_file
    url = task.result
  File "/home/mohan/.virtualenv/flack_env/lib/python3.6/site-packages/celery/result.py", line 436, in result
    return self._get_task_meta()['result']
  File "/home/mohan/.virtualenv/flack_env/lib/python3.6/site-packages/celery/result.py", line 412, in _get_task_meta
    return self._maybe_set_cache(self.backend.get_task_meta(self.id))
  File "/home/mohan/.virtualenv/flack_env/lib/python3.6/site-packages/celery/backends/base.py", line 386, in get_task_meta
    meta = self._get_task_meta_for(task_id)
AttributeError: 'DisabledBackend' object has no attribute '_get_task_meta_for'
2019-10-08 11:43:18,066 ERROR: Exception on /get_file/640ab479-c9b3-4f4b-8cb6-ff790dac3979 [GET] [in /home/mohan/.virtualenv/flack_env/lib/python3.6/site-packages/flask/app.py:1891]
Traceback (most recent call last):
  File "/home/mohan/.virtualenv/flack_env/lib/python3.6/site-packages/flask/app.py", line 2446, in wsgi_app
    response = self.full_dispatch_request()
  File "/home/mohan/.virtualenv/flack_env/lib/python3.6/site-packages/flask/app.py", line 1951, in full_dispatch_request
    rv = self.handle_user_exception(e)
  File "/home/mohan/.virtualenv/flack_env/lib/python3.6/site-packages/flask/app.py", line 1820, in handle_user_exception
    reraise(exc_type, exc_value, tb)
  File "/home/mohan/.virtualenv/flack_env/lib/python3.6/site-packages/flask/_compat.py", line 39, in reraise
    raise value
  File "/home/mohan/.virtualenv/flack_env/lib/python3.6/site-packages/flask/app.py", line 1949, in full_dispatch_request
    rv = self.dispatch_request()
  File "/home/mohan/.virtualenv/flack_env/lib/python3.6/site-packages/flask/app.py", line 1935, in dispatch_request
    return self.view_functions[rule.endpoint](**req.view_args)
  File "/home/mohan/flask/flaskq/app/main/routes.py", line 231, in get_file
    url = task.result
  File "/home/mohan/.virtualenv/flack_env/lib/python3.6/site-packages/celery/result.py", line 436, in result
    return self._get_task_meta()['result']
  File "/home/mohan/.virtualenv/flack_env/lib/python3.6/site-packages/celery/result.py", line 412, in _get_task_meta
    return self._maybe_set_cache(self.backend.get_task_meta(self.id))
  File "/home/mohan/.virtualenv/flack_env/lib/python3.6/site-packages/celery/backends/base.py", line 386, in get_task_meta
    meta = self._get_task_meta_for(task_id)
AttributeError: 'DisabledBackend' object has no attribute '_get_task_meta_for'
2019-10-08 11:43:40,112 INFO: Quora startup [in /home/mohan/flask/flaskq/app/__init__.py:93]
