2019-10-08 11:43:48,608 ERROR: Exception on /get_file/0cc03afe-3e98-4934-9d85-0cb3c90a8674 [GET] [in /home/mohan/.virtualenv/flack_env/lib/python3.6/site-packages/flask/app.py:1891]
Traceback (most recent call last):
  File "/home/mohan/.virtualenv/flack_env/lib/python3.6/site-packages/flask/app.py", line 2446, in wsgi_app
    response = self.full_dispatch_request()
  File "/home/mohan/.virtualenv/flack_env/lib/python3.6/site-packages/flask/app.py", line 1952, in full_dispatch_request
    return self.finalize_request(rv)
  File "/home/mohan/.virtualenv/flack_env/lib/python3.6/site-packages/flask/app.py", line 1967, in finalize_request
    response = self.make_response(rv)
  File "/home/mohan/.virtualenv/flack_env/lib/python3.6/site-packages/flask/app.py", line 2111, in make_response
    rv = jsonify(rv)
  File "/home/mohan/.virtualenv/flack_env/lib/python3.6/site-packages/flask/json/__init__.py", line 370, in jsonify
    dumps(data, indent=indent, separators=separators) + "\n",
  File "/home/mohan/.virtualenv/flack_env/lib/python3.6/site-packages/flask/json/__init__.py", line 211, in dumps
    rv = _json.dumps(obj, **kwargs)
  File "/usr/lib/python3.6/json/__init__.py", line 238, in dumps
    **kw).encode(obj)
  File "/usr/lib/python3.6/json/encoder.py", line 199, in encode
    chunks = self.iterencode(o, _one_shot=True)
  File "/usr/lib/python3.6/json/encoder.py", line 257, in iterencode
    return _iterencode(o, 0)
  File "/home/mohan/.virtualenv/flack_env/lib/python3.6/site-packages/flask/json/__init__.py", line 100, in default
    return _json.JSONEncoder.default(self, o)
  File "/usr/lib/python3.6/json/encoder.py", line 180, in default
    o.__class__.__name__)
TypeError: Object of type 'NotRegistered' is not JSON serializable
2019-10-08 11:43:56,589 ERROR: Exception on /get_file/7f665aba-f813-4619-b9b2-2110d8b8bb26 [GET] [in /home/mohan/.virtualenv/flack_env/lib/python3.6/site-packages/flask/app.py:1891]
Traceback (most recent call last):
  File "/home/mohan/.virtualenv/flack_env/lib/python3.6/site-packages/flask/app.py", line 2446, in wsgi_app
    response = self.full_dispatch_request()
  File "/home/mohan/.virtualenv/flack_env/lib/python3.6/site-packages/flask/app.py", line 1952, in full_dispatch_request
    return self.finalize_request(rv)
  File "/home/mohan/.virtualenv/flack_env/lib/python3.6/site-packages/flask/app.py", line 1967, in finalize_request
    response = self.make_response(rv)
  File "/home/mohan/.virtualenv/flack_env/lib/python3.6/site-packages/flask/app.py", line 2111, in make_response
    rv = jsonify(rv)
  File "/home/mohan/.virtualenv/flack_env/lib/python3.6/site-packages/flask/json/__init__.py", line 370, in jsonify
    dumps(data, indent=indent, separators=separators) + "\n",
  File "/home/mohan/.virtualenv/flack_env/lib/python3.6/site-packages/flask/json/__init__.py", line 211, in dumps
    rv = _json.dumps(obj, **kwargs)
  File "/usr/lib/python3.6/json/__init__.py", line 238, in dumps
    **kw).encode(obj)
  File "/usr/lib/python3.6/json/encoder.py", line 199, in encode
    chunks = self.iterencode(o, _one_shot=True)
  File "/usr/lib/python3.6/json/encoder.py", line 257, in iterencode
    return _iterencode(o, 0)
  File "/home/mohan/.virtualenv/flack_env/lib/python3.6/site-packages/flask/json/__init__.py", line 100, in default
    return _json.JSONEncoder.default(self, o)
  File "/usr/lib/python3.6/json/encoder.py", line 180, in default
    o.__class__.__name__)
TypeError: Object of type 'NotRegistered' is not JSON serializable
2019-10-08 11:50:34,908 INFO: Quora startup [in /home/mohan/flask/flaskq/app/__init__.py:93]
2019-10-08 11:50:58,026 ERROR: Exception on /get_file/a35c20d6-a5e5-4841-8e5d-8f1ad85679c1 [GET] [in /home/mohan/.virtualenv/flack_env/lib/python3.6/site-packages/flask/app.py:1891]
Traceback (most recent call last):
  File "/home/mohan/.virtualenv/flack_env/lib/python3.6/site-packages/flask/app.py", line 2446, in wsgi_app
    response = self.full_dispatch_request()
  File "/home/mohan/.virtualenv/flack_env/lib/python3.6/site-packages/flask/app.py", line 1952, in full_dispatch_request
    return self.finalize_request(rv)
  File "/home/mohan/.virtualenv/flack_env/lib/python3.6/site-packages/flask/app.py", line 1967, in finalize_request
    response = self.make_response(rv)
  File "/home/mohan/.virtualenv/flack_env/lib/python3.6/site-packages/flask/app.py", line 2111, in make_response
    rv = jsonify(rv)
  File "/home/mohan/.virtualenv/flack_env/lib/python3.6/site-packages/flask/json/__init__.py", line 370, in jsonify
    dumps(data, indent=indent, separators=separators) + "\n",
  File "/home/mohan/.virtualenv/flack_env/lib/python3.6/site-packages/flask/json/__init__.py", line 211, in dumps
    rv = _json.dumps(obj, **kwargs)
  File "/usr/lib/python3.6/json/__init__.py", line 238, in dumps
    **kw).encode(obj)
  File "/usr/lib/python3.6/json/encoder.py", line 199, in encode
    chunks = self.iterencode(o, _one_shot=True)
  File "/usr/lib/python3.6/json/encoder.py", line 257, in iterencode
    return _iterencode(o, 0)
  File "/home/mohan/.virtualenv/flack_env/lib/python3.6/site-packages/flask/json/__init__.py", line 100, in default
    return _json.JSONEncoder.default(self, o)
  File "/usr/lib/python3.6/json/encoder.py", line 180, in default
    o.__class__.__name__)
TypeError: Object of type 'NotRegistered' is not JSON serializable
2019-10-08 11:57:48,658 ERROR: Exception on /get_file/cab0cc85-c407-4c57-b0e8-895dd36acaf2 [GET] [in /home/mohan/.virtualenv/flack_env/lib/python3.6/site-packages/flask/app.py:1891]
Traceback (most recent call last):
  File "/home/mohan/.virtualenv/flack_env/lib/python3.6/site-packages/flask/app.py", line 2446, in wsgi_app
    response = self.full_dispatch_request()
  File "/home/mohan/.virtualenv/flack_env/lib/python3.6/site-packages/flask/app.py", line 1952, in full_dispatch_request
    return self.finalize_request(rv)
  File "/home/mohan/.virtualenv/flack_env/lib/python3.6/site-packages/flask/app.py", line 1967, in finalize_request
    response = self.make_response(rv)
  File "/home/mohan/.virtualenv/flack_env/lib/python3.6/site-packages/flask/app.py", line 2111, in make_response
    rv = jsonify(rv)
  File "/home/mohan/.virtualenv/flack_env/lib/python3.6/site-packages/flask/json/__init__.py", line 370, in jsonify
    dumps(data, indent=indent, separators=separators) + "\n",
  File "/home/mohan/.virtualenv/flack_env/lib/python3.6/site-packages/flask/json/__init__.py", line 211, in dumps
    rv = _json.dumps(obj, **kwargs)
  File "/usr/lib/python3.6/json/__init__.py", line 238, in dumps
    **kw).encode(obj)
  File "/usr/lib/python3.6/json/encoder.py", line 199, in encode
    chunks = self.iterencode(o, _one_shot=True)
  File "/usr/lib/python3.6/json/encoder.py", line 257, in iterencode
    return _iterencode(o, 0)
  File "/home/mohan/.virtualenv/flack_env/lib/python3.6/site-packages/flask/json/__init__.py", line 100, in default
    return _json.JSONEncoder.default(self, o)
  File "/usr/lib/python3.6/json/encoder.py", line 180, in default
    o.__class__.__name__)
TypeError: Object of type 'NotRegistered' is not JSON serializable
2019-10-08 11:57:56,970 INFO: Quora startup [in /home/mohan/flask/flaskq/app/__init__.py:91]
2019-10-08 11:58:07,986 ERROR: Exception on /get_file/58563f1f-0ea6-4fd0-b3d5-d680eb0673df [GET] [in /home/mohan/.virtualenv/flack_env/lib/python3.6/site-packages/flask/app.py:1891]
Traceback (most recent call last):
  File "/home/mohan/.virtualenv/flack_env/lib/python3.6/site-packages/flask/app.py", line 2446, in wsgi_app
    response = self.full_dispatch_request()
  File "/home/mohan/.virtualenv/flack_env/lib/python3.6/site-packages/flask/app.py", line 1952, in full_dispatch_request
    return self.finalize_request(rv)
  File "/home/mohan/.virtualenv/flack_env/lib/python3.6/site-packages/flask/app.py", line 1967, in finalize_request
    response = self.make_response(rv)
  File "/home/mohan/.virtualenv/flack_env/lib/python3.6/site-packages/flask/app.py", line 2111, in make_response
    rv = jsonify(rv)
  File "/home/mohan/.virtualenv/flack_env/lib/python3.6/site-packages/flask/json/__init__.py", line 370, in jsonify
    dumps(data, indent=indent, separators=separators) + "\n",
  File "/home/mohan/.virtualenv/flack_env/lib/python3.6/site-packages/flask/json/__init__.py", line 211, in dumps
    rv = _json.dumps(obj, **kwargs)
  File "/usr/lib/python3.6/json/__init__.py", line 238, in dumps
    **kw).encode(obj)
  File "/usr/lib/python3.6/json/encoder.py", line 199, in encode
    chunks = self.iterencode(o, _one_shot=True)
  File "/usr/lib/python3.6/json/encoder.py", line 257, in iterencode
    return _iterencode(o, 0)
  File "/home/mohan/.virtualenv/flack_env/lib/python3.6/site-packages/flask/json/__init__.py", line 100, in default
    return _json.JSONEncoder.default(self, o)
  File "/usr/lib/python3.6/json/encoder.py", line 180, in default
    o.__class__.__name__)
TypeError: Object of type 'NotRegistered' is not JSON serializable
2019-10-08 11:59:38,378 INFO: Quora startup [in /home/mohan/flask/flaskq/app/__init__.py:91]
2019-10-08 12:00:18,447 INFO: Quora startup [in /home/mohan/flask/flaskq/app/__init__.py:91]
2019-10-08 12:00:54,782 INFO: Quora startup [in /home/mohan/flask/flaskq/app/__init__.py:91]
2019-10-08 12:03:27,012 INFO: Quora startup [in /home/mohan/flask/flaskq/app/__init__.py:91]
2019-10-08 12:04:13,279 INFO: Quora startup [in /home/mohan/flask/flaskq/app/__init__.py:91]
2019-10-08 12:24:10,684 INFO: Quora startup [in /home/mohan/flask/flaskq/app/__init__.py:93]
2019-10-08 12:25:06,800 INFO: Quora startup [in /home/mohan/flask/flaskq/app/__init__.py:93]
2019-10-08 12:25:28,338 INFO: Quora startup [in /home/mohan/flask/flaskq/app/__init__.py:93]
2019-10-08 12:25:49,641 INFO: Quora startup [in /home/mohan/flask/flaskq/app/__init__.py:93]
2019-10-08 12:26:41,137 INFO: Quora startup [in /home/mohan/flask/flaskq/app/__init__.py:93]
2019-10-08 12:27:23,743 INFO: Quora startup [in /home/mohan/flask/flaskq/app/__init__.py:93]
2019-10-08 12:27:36,971 INFO: Quora startup [in /home/mohan/flask/flaskq/app/__init__.py:93]
2019-10-08 12:32:19,954 INFO: Quora startup [in /home/mohan/flask/flaskq/app/__init__.py:93]
