2019-10-01 09:56:31,678 INFO: Quora startup [in /home/mohan/flask/flaskq/app/__init__.py:86]
2019-10-01 09:58:05,243 INFO: Quora startup [in /home/mohan/flask/flaskq/app/__init__.py:86]
2019-10-01 09:58:05,243 INFO: Quora startup [in /home/mohan/flask/flaskq/app/__init__.py:86]
2019-10-01 09:58:05,249 INFO: Quora startup [in /home/mohan/flask/flaskq/app/__init__.py:86]
2019-10-01 09:58:05,282 INFO: Quora startup [in /home/mohan/flask/flaskq/app/__init__.py:86]
2019-10-01 10:57:32,838 INFO: Quora startup [in /home/mohan/flask/flaskq/app/__init__.py:86]
2019-10-01 10:58:16,879 INFO: Quora startup [in /home/mohan/flask/flaskq/app/__init__.py:86]
2019-10-01 12:24:27,406 INFO: Quora startup [in /home/mohan/flask/flaskq/app/__init__.py:86]
2019-10-03 11:48:21,237 INFO: Quora startup [in /home/mohan/flask/flaskq/app/__init__.py:86]
2019-10-03 11:59:10,036 INFO: Quora startup [in /home/mohan/flask/flaskq/app/__init__.py:86]
2019-10-05 11:47:56,948 INFO: Quora startup [in /home/mohan/flask/flaskq/app/__init__.py:86]
2019-10-07 12:04:45,160 ERROR: Exception on /answers/6 [POST] [in /home/mohan/.virtualenv/flack_env/lib/python3.6/site-packages/flask/app.py:1891]
Traceback (most recent call last):
  File "/home/mohan/.virtualenv/flack_env/lib/python3.6/site-packages/urllib3/connectionpool.py", line 421, in _make_request
    six.raise_from(e, None)
  File "<string>", line 3, in raise_from
  File "/home/mohan/.virtualenv/flack_env/lib/python3.6/site-packages/urllib3/connectionpool.py", line 416, in _make_request
    httplib_response = conn.getresponse()
  File "/usr/lib/python3.6/http/client.py", line 1346, in getresponse
    response.begin()
  File "/usr/lib/python3.6/http/client.py", line 307, in begin
    version, status, reason = self._read_status()
  File "/usr/lib/python3.6/http/client.py", line 268, in _read_status
    line = str(self.fp.readline(_MAXLINE + 1), "iso-8859-1")
  File "/usr/lib/python3.6/socket.py", line 586, in readinto
    return self._sock.recv_into(b)
socket.timeout: timed out

During handling of the above exception, another exception occurred:

Traceback (most recent call last):
  File "/home/mohan/.virtualenv/flack_env/lib/python3.6/site-packages/elasticsearch/connection/http_urllib3.py", line 233, in perform_request
    method, url, body, retries=Retry(False), headers=request_headers, **kw
  File "/home/mohan/.virtualenv/flack_env/lib/python3.6/site-packages/urllib3/connectionpool.py", line 720, in urlopen
    method, url, error=e, _pool=self, _stacktrace=sys.exc_info()[2]
  File "/home/mohan/.virtualenv/flack_env/lib/python3.6/site-packages/urllib3/util/retry.py", line 376, in increment
    raise six.reraise(type(error), error, _stacktrace)
  File "/home/mohan/.virtualenv/flack_env/lib/python3.6/site-packages/urllib3/packages/six.py", line 735, in reraise
    raise value
  File "/home/mohan/.virtualenv/flack_env/lib/python3.6/site-packages/urllib3/connectionpool.py", line 672, in urlopen
    chunked=chunked,
  File "/home/mohan/.virtualenv/flack_env/lib/python3.6/site-packages/urllib3/connectionpool.py", line 423, in _make_request
    self._raise_timeout(err=e, url=url, timeout_value=read_timeout)
  File "/home/mohan/.virtualenv/flack_env/lib/python3.6/site-packages/urllib3/connectionpool.py", line 331, in _raise_timeout
    self, url, "Read timed out. (read timeout=%s)" % timeout_value
urllib3.exceptions.ReadTimeoutError: HTTPConnectionPool(host='localhost', port=9200): Read timed out. (read timeout=10)

During handling of the above exception, another exception occurred:

Traceback (most recent call last):
  File "/home/mohan/.virtualenv/flack_env/lib/python3.6/site-packages/flask/app.py", line 2446, in wsgi_app
    response = self.full_dispatch_request()
  File "/home/mohan/.virtualenv/flack_env/lib/python3.6/site-packages/flask/app.py", line 1951, in full_dispatch_request
    rv = self.handle_user_exception(e)
  File "/home/mohan/.virtualenv/flack_env/lib/python3.6/site-packages/flask/app.py", line 1820, in handle_user_exception
    reraise(exc_type, exc_value, tb)
  File "/home/mohan/.virtualenv/flack_env/lib/python3.6/site-packages/flask/_compat.py", line 39, in reraise
    raise value
  File "/home/mohan/.virtualenv/flack_env/lib/python3.6/site-packages/flask/app.py", line 1949, in full_dispatch_request
    rv = self.dispatch_request()
  File "/home/mohan/.virtualenv/flack_env/lib/python3.6/site-packages/flask/app.py", line 1935, in dispatch_request
    return self.view_functions[rule.endpoint](**req.view_args)
  File "/home/mohan/.virtualenv/flack_env/lib/python3.6/site-packages/flask_login/utils.py", line 261, in decorated_view
    return func(*args, **kwargs)
  File "/home/mohan/flask/flaskq/app/main/routes.py", line 57, in answers
    db.session.commit()
  File "/home/mohan/.virtualenv/flack_env/lib/python3.6/site-packages/sqlalchemy/orm/scoping.py", line 162, in do
    return getattr(self.registry(), name)(*args, **kwargs)
  File "/home/mohan/.virtualenv/flack_env/lib/python3.6/site-packages/sqlalchemy/orm/session.py", line 1027, in commit
    self.transaction.commit()
  File "/home/mohan/.virtualenv/flack_env/lib/python3.6/site-packages/sqlalchemy/orm/session.py", line 501, in commit
    self.session.dispatch.after_commit(self.session)
  File "/home/mohan/.virtualenv/flack_env/lib/python3.6/site-packages/sqlalchemy/event/attr.py", line 261, in __call__
    fn(*args, **kw)
  File "/home/mohan/flask/flaskq/app/models.py", line 43, in after_commit
    add_to_index(obj.__tablename__, obj)
  File "/home/mohan/flask/flaskq/app/search.py", line 9, in add_to_index
    current_app.elasticsearch.index(index=index, id=model.id, body=payload)
  File "/home/mohan/.virtualenv/flack_env/lib/python3.6/site-packages/elasticsearch/client/utils.py", line 84, in _wrapped
    return func(*args, params=params, **kwargs)
  File "/home/mohan/.virtualenv/flack_env/lib/python3.6/site-packages/elasticsearch/client/__init__.py", line 364, in index
    "POST", _make_path(index, doc_type, id), params=params, body=body
  File "/home/mohan/.virtualenv/flack_env/lib/python3.6/site-packages/elasticsearch/transport.py", line 350, in perform_request
    timeout=timeout,
  File "/home/mohan/.virtualenv/flack_env/lib/python3.6/site-packages/elasticsearch/connection/http_urllib3.py", line 244, in perform_request
    raise ConnectionTimeout("TIMEOUT", str(e), e)
elasticsearch.exceptions.ConnectionTimeout: ConnectionTimeout caused by - ReadTimeoutError(HTTPConnectionPool(host='localhost', port=9200): Read timed out. (read timeout=10))
2019-10-07 12:05:53,900 INFO: Quora startup [in /home/mohan/flask/flaskq/app/__init__.py:86]
2019-10-08 10:57:46,678 INFO: Quora startup [in /home/mohan/flask/flaskq/app/__init__.py:93]
2019-10-08 11:15:43,772 INFO: Quora startup [in /home/mohan/flask/flaskq/app/__init__.py:93]
2019-10-08 11:17:20,597 INFO: Quora startup [in /home/mohan/flask/flaskq/app/__init__.py:93]
2019-10-08 11:17:27,264 ERROR: Exception on /get_file/dc9ca9e2-771e-44a1-8efd-430e27cb44d7 [GET] [in /home/mohan/.virtualenv/flack_env/lib/python3.6/site-packages/flask/app.py:1891]
Traceback (most recent call last):
  File "/home/mohan/.virtualenv/flack_env/lib/python3.6/site-packages/flask/app.py", line 2446, in wsgi_app
    response = self.full_dispatch_request()
  File "/home/mohan/.virtualenv/flack_env/lib/python3.6/site-packages/flask/app.py", line 1951, in full_dispatch_request
    rv = self.handle_user_exception(e)
  File "/home/mohan/.virtualenv/flack_env/lib/python3.6/site-packages/flask/app.py", line 1820, in handle_user_exception
    reraise(exc_type, exc_value, tb)
  File "/home/mohan/.virtualenv/flack_env/lib/python3.6/site-packages/flask/_compat.py", line 39, in reraise
    raise value
  File "/home/mohan/.virtualenv/flack_env/lib/python3.6/site-packages/flask/app.py", line 1949, in full_dispatch_request
    rv = self.dispatch_request()
  File "/home/mohan/.virtualenv/flack_env/lib/python3.6/site-packages/flask/app.py", line 1935, in dispatch_request
    return self.view_functions[rule.endpoint](**req.view_args)
  File "/home/mohan/flask/flaskq/app/main/routes.py", line 231, in get_file
    url = task.result
  File "/home/mohan/.virtualenv/flack_env/lib/python3.6/site-packages/celery/result.py", line 436, in result
    return self._get_task_meta()['result']
  File "/home/mohan/.virtualenv/flack_env/lib/python3.6/site-packages/celery/result.py", line 412, in _get_task_meta
    return self._maybe_set_cache(self.backend.get_task_meta(self.id))
  File "/home/mohan/.virtualenv/flack_env/lib/python3.6/site-packages/celery/backends/base.py", line 386, in get_task_meta
    meta = self._get_task_meta_for(task_id)
AttributeError: 'DisabledBackend' object has no attribute '_get_task_meta_for'
