2019-09-26 01:23:40,166 ERROR: Exception on /user/mohan [GET] [in /home/mohan/.virtualenv/flack_env/lib/python3.6/site-packages/flask/app.py:1891]
Traceback (most recent call last):
  File "/home/mohan/.virtualenv/flack_env/lib/python3.6/site-packages/flask/app.py", line 2446, in wsgi_app
    response = self.full_dispatch_request()
  File "/home/mohan/.virtualenv/flack_env/lib/python3.6/site-packages/flask/app.py", line 1951, in full_dispatch_request
    rv = self.handle_user_exception(e)
  File "/home/mohan/.virtualenv/flack_env/lib/python3.6/site-packages/flask/app.py", line 1820, in handle_user_exception
    reraise(exc_type, exc_value, tb)
  File "/home/mohan/.virtualenv/flack_env/lib/python3.6/site-packages/flask/_compat.py", line 39, in reraise
    raise value
  File "/home/mohan/.virtualenv/flack_env/lib/python3.6/site-packages/flask/app.py", line 1949, in full_dispatch_request
    rv = self.dispatch_request()
  File "/home/mohan/.virtualenv/flack_env/lib/python3.6/site-packages/flask/app.py", line 1935, in dispatch_request
    return self.view_functions[rule.endpoint](**req.view_args)
  File "/home/mohan/.virtualenv/flack_env/lib/python3.6/site-packages/flask_login/utils.py", line 261, in decorated_view
    return func(*args, **kwargs)
  File "/home/mohan/flask/flaskq/app/main/routes.py", line 112, in user
    next_url=next_url, prev_url=prev_url)
  File "/home/mohan/.virtualenv/flack_env/lib/python3.6/site-packages/flask/templating.py", line 140, in render_template
    ctx.app,
  File "/home/mohan/.virtualenv/flack_env/lib/python3.6/site-packages/flask/templating.py", line 120, in _render
    rv = template.render(context)
  File "/home/mohan/.virtualenv/flack_env/lib/python3.6/site-packages/jinja2/asyncsupport.py", line 76, in render
    return original_render(self, *args, **kwargs)
  File "/home/mohan/.virtualenv/flack_env/lib/python3.6/site-packages/jinja2/environment.py", line 1008, in render
    return self.environment.handle_exception(exc_info, True)
  File "/home/mohan/.virtualenv/flack_env/lib/python3.6/site-packages/jinja2/environment.py", line 780, in handle_exception
    reraise(exc_type, exc_value, tb)
  File "/home/mohan/.virtualenv/flack_env/lib/python3.6/site-packages/jinja2/_compat.py", line 37, in reraise
    raise value.with_traceback(tb)
  File "/home/mohan/flask/flaskq/app/templates/user.html", line 1, in top-level template code
    {% extends "base.html" %}
  File "/home/mohan/flask/flaskq/app/templates/base.html", line 2, in top-level template code
    {% import "bootstrap/wtf.html" as wtf %}
  File "/home/mohan/.virtualenv/flack_env/lib/python3.6/site-packages/flask_bootstrap/templates/bootstrap/base.html", line 1, in top-level template code
    {% block doc -%}
  File "/home/mohan/.virtualenv/flack_env/lib/python3.6/site-packages/flask_bootstrap/templates/bootstrap/base.html", line 4, in block "doc"
    {%- block html %}
  File "/home/mohan/.virtualenv/flack_env/lib/python3.6/site-packages/flask_bootstrap/templates/bootstrap/base.html", line 20, in block "html"
    {% block body -%}
  File "/home/mohan/.virtualenv/flack_env/lib/python3.6/site-packages/flask_bootstrap/templates/bootstrap/base.html", line 23, in block "body"
    {% block content -%}
  File "/home/mohan/flask/flaskq/app/templates/base.html", line 71, in block "content"
    {% block app_content %}{% endblock %}
  File "/home/mohan/flask/flaskq/app/templates/user.html", line 19, in block "app_content"
    <p><a href="{{ url_for('main.follow', username=user.username) }}">{{ 'Follow' }}</a></p>
  File "/home/mohan/.virtualenv/flack_env/lib/python3.6/site-packages/flask/helpers.py", line 370, in url_for
    return appctx.app.handle_url_build_error(error, endpoint, values)
  File "/home/mohan/.virtualenv/flack_env/lib/python3.6/site-packages/flask/app.py", line 2215, in handle_url_build_error
    reraise(exc_type, exc_value, tb)
  File "/home/mohan/.virtualenv/flack_env/lib/python3.6/site-packages/flask/_compat.py", line 39, in reraise
    raise value
  File "/home/mohan/.virtualenv/flack_env/lib/python3.6/site-packages/flask/helpers.py", line 358, in url_for
    endpoint, values, method=method, force_external=external
  File "/home/mohan/.virtualenv/flack_env/lib/python3.6/site-packages/werkzeug/routing.py", line 2020, in build
    raise BuildError(endpoint, values, method, self)
werkzeug.routing.BuildError: Could not build url for endpoint 'main.follow' with values ['username']. Did you mean 'main.answer' instead?
2019-09-26 01:26:24,902 ERROR: Exception on /search [GET] [in /home/mohan/.virtualenv/flack_env/lib/python3.6/site-packages/flask/app.py:1891]
Traceback (most recent call last):
  File "/home/mohan/.virtualenv/flack_env/lib/python3.6/site-packages/flask/app.py", line 2446, in wsgi_app
    response = self.full_dispatch_request()
  File "/home/mohan/.virtualenv/flack_env/lib/python3.6/site-packages/flask/app.py", line 1951, in full_dispatch_request
    rv = self.handle_user_exception(e)
  File "/home/mohan/.virtualenv/flack_env/lib/python3.6/site-packages/flask/app.py", line 1820, in handle_user_exception
    reraise(exc_type, exc_value, tb)
  File "/home/mohan/.virtualenv/flack_env/lib/python3.6/site-packages/flask/_compat.py", line 39, in reraise
    raise value
  File "/home/mohan/.virtualenv/flack_env/lib/python3.6/site-packages/flask/app.py", line 1949, in full_dispatch_request
    rv = self.dispatch_request()
  File "/home/mohan/.virtualenv/flack_env/lib/python3.6/site-packages/flask/app.py", line 1935, in dispatch_request
    return self.view_functions[rule.endpoint](**req.view_args)
  File "/home/mohan/.virtualenv/flack_env/lib/python3.6/site-packages/flask_login/utils.py", line 261, in decorated_view
    return func(*args, **kwargs)
  File "/home/mohan/flask/flaskq/app/main/routes.py", line 144, in search
    return render_template('search.html', title=_('Search'), posts=posts,
  File "/home/mohan/.virtualenv/flack_env/lib/python3.6/site-packages/flask_babel/__init__.py", line 552, in gettext
    t = get_translations()
  File "/home/mohan/.virtualenv/flack_env/lib/python3.6/site-packages/flask_babel/__init__.py", line 223, in get_translations
    babel = current_app.extensions['babel']
KeyError: 'babel'
2019-09-26 01:36:17,817 INFO: Quora Startup [in /home/mohan/flask/flaskq/app/__init__.py:79]
2019-09-26 01:59:46,630 INFO: Quora Startup [in /home/mohan/flask/flaskq/app/__init__.py:79]
2019-09-26 02:03:43,042 INFO: Quora Startup [in /home/mohan/flask/flaskq/app/__init__.py:79]
2019-09-26 02:04:40,193 INFO: Quora Startup [in /home/mohan/flask/flaskq/app/__init__.py:79]
2019-09-26 06:43:07,539 INFO: Quora Startup [in /home/mohan/flask/flaskq/app/__init__.py:79]
2019-09-26 07:54:25,585 INFO: Quora Startup [in /home/mohan/flask/flaskq/app/__init__.py:79]
2019-09-26 08:02:32,582 INFO: Quora Startup [in /home/mohan/flask/flaskq/app/__init__.py:79]
2019-09-26 08:07:17,517 INFO: Quora Startup [in /home/mohan/flask/flaskq/app/__init__.py:79]
2019-09-26 08:08:02,024 INFO: Quora Startup [in /home/mohan/flask/flaskq/app/__init__.py:79]
2019-09-26 10:04:26,444 INFO: Quora Startup [in /home/mohan/flask/flaskq/app/__init__.py:79]
2019-09-26 10:04:39,045 INFO: Quora Startup [in /home/mohan/flask/flaskq/app/__init__.py:79]
2019-09-26 10:17:26,221 INFO: Quora Startup [in /home/mohan/flask/flaskq/app/__init__.py:79]
2019-09-26 10:17:35,430 ERROR: Exception on / [GET] [in /home/mohan/.virtualenv/flack_env/lib/python3.6/site-packages/flask/app.py:1891]
Traceback (most recent call last):
  File "/home/mohan/.virtualenv/flack_env/lib/python3.6/site-packages/flask/app.py", line 2446, in wsgi_app
    response = self.full_dispatch_request()
  File "/home/mohan/.virtualenv/flack_env/lib/python3.6/site-packages/flask/app.py", line 1951, in full_dispatch_request
    rv = self.handle_user_exception(e)
  File "/home/mohan/.virtualenv/flack_env/lib/python3.6/site-packages/flask/app.py", line 1820, in handle_user_exception
    reraise(exc_type, exc_value, tb)
  File "/home/mohan/.virtualenv/flack_env/lib/python3.6/site-packages/flask/_compat.py", line 39, in reraise
    raise value
  File "/home/mohan/.virtualenv/flack_env/lib/python3.6/site-packages/flask/app.py", line 1947, in full_dispatch_request
    rv = self.preprocess_request()
  File "/home/mohan/.virtualenv/flack_env/lib/python3.6/site-packages/flask/app.py", line 2241, in preprocess_request
    rv = func()
  File "/home/mohan/flask/flaskq/app/auth/routes.py", line 16, in before_request
    current_user.ping()
  File "/home/mohan/.virtualenv/flack_env/lib/python3.6/site-packages/werkzeug/local.py", line 348, in __getattr__
    return getattr(self._get_current_object(), name)
AttributeError: 'User' object has no attribute 'ping'
2019-09-26 10:17:35,835 ERROR: Exception on /favicon.ico [GET] [in /home/mohan/.virtualenv/flack_env/lib/python3.6/site-packages/flask/app.py:1891]
Traceback (most recent call last):
  File "/home/mohan/.virtualenv/flack_env/lib/python3.6/site-packages/flask/app.py", line 2446, in wsgi_app
    response = self.full_dispatch_request()
  File "/home/mohan/.virtualenv/flack_env/lib/python3.6/site-packages/flask/app.py", line 1951, in full_dispatch_request
    rv = self.handle_user_exception(e)
  File "/home/mohan/.virtualenv/flack_env/lib/python3.6/site-packages/flask/app.py", line 1820, in handle_user_exception
    reraise(exc_type, exc_value, tb)
  File "/home/mohan/.virtualenv/flack_env/lib/python3.6/site-packages/flask/_compat.py", line 39, in reraise
    raise value
  File "/home/mohan/.virtualenv/flack_env/lib/python3.6/site-packages/flask/app.py", line 1947, in full_dispatch_request
    rv = self.preprocess_request()
  File "/home/mohan/.virtualenv/flack_env/lib/python3.6/site-packages/flask/app.py", line 2241, in preprocess_request
    rv = func()
  File "/home/mohan/flask/flaskq/app/auth/routes.py", line 16, in before_request
    current_user.ping()
  File "/home/mohan/.virtualenv/flack_env/lib/python3.6/site-packages/werkzeug/local.py", line 348, in __getattr__
    return getattr(self._get_current_object(), name)
AttributeError: 'User' object has no attribute 'ping'
