2019-09-26 16:58:38,581 ERROR: Exception on /search [GET] [in /home/mohan/.virtualenv/flack_env/lib/python3.6/site-packages/flask/app.py:1891]
Traceback (most recent call last):
  File "/home/mohan/.virtualenv/flack_env/lib/python3.6/site-packages/flask/app.py", line 2446, in wsgi_app
    response = self.full_dispatch_request()
  File "/home/mohan/.virtualenv/flack_env/lib/python3.6/site-packages/flask/app.py", line 1951, in full_dispatch_request
    rv = self.handle_user_exception(e)
  File "/home/mohan/.virtualenv/flack_env/lib/python3.6/site-packages/flask/app.py", line 1820, in handle_user_exception
    reraise(exc_type, exc_value, tb)
  File "/home/mohan/.virtualenv/flack_env/lib/python3.6/site-packages/flask/_compat.py", line 39, in reraise
    raise value
  File "/home/mohan/.virtualenv/flack_env/lib/python3.6/site-packages/flask/app.py", line 1949, in full_dispatch_request
    rv = self.dispatch_request()
  File "/home/mohan/.virtualenv/flack_env/lib/python3.6/site-packages/flask/app.py", line 1935, in dispatch_request
    return self.view_functions[rule.endpoint](**req.view_args)
  File "/home/mohan/.virtualenv/flack_env/lib/python3.6/site-packages/flask_login/utils.py", line 261, in decorated_view
    return func(*args, **kwargs)
  File "/home/mohan/flask/flaskq/app/main/routes.py", line 195, in search
    next_url=next_url, prev_url=prev_url)
  File "/home/mohan/.virtualenv/flack_env/lib/python3.6/site-packages/flask/templating.py", line 140, in render_template
    ctx.app,
  File "/home/mohan/.virtualenv/flack_env/lib/python3.6/site-packages/flask/templating.py", line 120, in _render
    rv = template.render(context)
  File "/home/mohan/.virtualenv/flack_env/lib/python3.6/site-packages/jinja2/asyncsupport.py", line 76, in render
    return original_render(self, *args, **kwargs)
  File "/home/mohan/.virtualenv/flack_env/lib/python3.6/site-packages/jinja2/environment.py", line 1008, in render
    return self.environment.handle_exception(exc_info, True)
  File "/home/mohan/.virtualenv/flack_env/lib/python3.6/site-packages/jinja2/environment.py", line 780, in handle_exception
    reraise(exc_type, exc_value, tb)
  File "/home/mohan/.virtualenv/flack_env/lib/python3.6/site-packages/jinja2/_compat.py", line 37, in reraise
    raise value.with_traceback(tb)
  File "/home/mohan/flask/flaskq/app/templates/search.html", line 1, in top-level template code
    {% extends "base.html" %}
  File "/home/mohan/flask/flaskq/app/templates/base.html", line 2, in top-level template code
    {% import "bootstrap/wtf.html" as wtf %}
  File "/home/mohan/.virtualenv/flack_env/lib/python3.6/site-packages/flask_bootstrap/templates/bootstrap/base.html", line 1, in top-level template code
    {% block doc -%}
  File "/home/mohan/.virtualenv/flack_env/lib/python3.6/site-packages/flask_bootstrap/templates/bootstrap/base.html", line 4, in block "doc"
    {%- block html %}
  File "/home/mohan/.virtualenv/flack_env/lib/python3.6/site-packages/flask_bootstrap/templates/bootstrap/base.html", line 20, in block "html"
    {% block body -%}
  File "/home/mohan/.virtualenv/flack_env/lib/python3.6/site-packages/flask_bootstrap/templates/bootstrap/base.html", line 23, in block "body"
    {% block content -%}
  File "/home/mohan/flask/flaskq/app/templates/base.html", line 71, in block "content"
    {% block app_content %}{% endblock %}
  File "/home/mohan/flask/flaskq/app/templates/search.html", line 6, in block "app_content"
    {% include '_questions.html' %}
  File "/home/mohan/flask/flaskq/app/templates/_questions.html", line 4, in top-level template code
    <a href="{{ url_for('main.user', username=question.author.username) }}">
  File "/home/mohan/.virtualenv/flack_env/lib/python3.6/site-packages/jinja2/environment.py", line 430, in getattr
    return getattr(obj, attribute)
jinja2.exceptions.UndefinedError: 'question' is undefined
2019-09-26 17:02:10,859 INFO: Quora Startup [in /home/mohan/flask/flaskq/app/__init__.py:79]
2019-09-26 17:19:22,342 INFO: Quora Startup [in /home/mohan/flask/flaskq/app/__init__.py:79]
2019-09-26 17:23:26,938 INFO: Quora Startup [in /home/mohan/flask/flaskq/app/__init__.py:79]
2019-09-26 17:36:22,941 INFO: Quora Startup [in /home/mohan/flask/flaskq/app/__init__.py:81]
2019-09-26 17:54:18,459 INFO: Quora Startup [in /home/mohan/flask/flaskq/app/__init__.py:81]
2019-09-26 17:54:51,525 INFO: Quora Startup [in /home/mohan/flask/flaskq/app/__init__.py:81]
2019-09-26 17:57:07,405 INFO: Quora Startup [in /home/mohan/flask/flaskq/app/__init__.py:81]
2019-09-26 17:57:31,228 INFO: Quora Startup [in /home/mohan/flask/flaskq/app/__init__.py:81]
2019-09-26 18:00:44,128 INFO: Quora Startup [in /home/mohan/flask/flaskq/app/__init__.py:81]
2019-09-26 18:03:19,247 INFO: Quora Startup [in /home/mohan/flask/flaskq/app/__init__.py:81]
2019-09-26 18:13:26,758 INFO: Quora Startup [in /home/mohan/flask/flaskq/app/__init__.py:81]
2019-09-26 21:12:12,736 INFO: Quora Startup [in /home/mohan/flask/flaskq/app/__init__.py:81]
2019-09-27 14:55:32,283 INFO: Quora Startup [in /home/mohan/flask/flaskq/app/__init__.py:81]
2019-09-27 15:09:47,778 INFO: Quora Startup [in /home/mohan/flask/flaskq/app/__init__.py:81]
2019-09-27 15:37:06,577 INFO: Quora Startup [in /home/mohan/flask/flaskq/app/__init__.py:81]
2019-09-27 15:37:11,057 ERROR: Exception on /index [GET] [in /home/mohan/.virtualenv/flack_env/lib/python3.6/site-packages/flask/app.py:1891]
Traceback (most recent call last):
  File "/home/mohan/.virtualenv/flack_env/lib/python3.6/site-packages/flask/app.py", line 2446, in wsgi_app
    response = self.full_dispatch_request()
  File "/home/mohan/.virtualenv/flack_env/lib/python3.6/site-packages/flask/app.py", line 1951, in full_dispatch_request
    rv = self.handle_user_exception(e)
  File "/home/mohan/.virtualenv/flack_env/lib/python3.6/site-packages/flask/app.py", line 1820, in handle_user_exception
    reraise(exc_type, exc_value, tb)
  File "/home/mohan/.virtualenv/flack_env/lib/python3.6/site-packages/flask/_compat.py", line 39, in reraise
    raise value
  File "/home/mohan/.virtualenv/flack_env/lib/python3.6/site-packages/flask/app.py", line 1949, in full_dispatch_request
    rv = self.dispatch_request()
  File "/home/mohan/.virtualenv/flack_env/lib/python3.6/site-packages/flask/app.py", line 1935, in dispatch_request
    return self.view_functions[rule.endpoint](**req.view_args)
  File "/home/mohan/.virtualenv/flack_env/lib/python3.6/site-packages/flask_login/utils.py", line 261, in decorated_view
    return func(*args, **kwargs)
  File "/home/mohan/flask/flaskq/app/main/routes.py", line 33, in index
    return render_template('index.html', title='Home',form=form, questions=questions)
  File "/home/mohan/.virtualenv/flack_env/lib/python3.6/site-packages/flask/templating.py", line 140, in render_template
    ctx.app,
  File "/home/mohan/.virtualenv/flack_env/lib/python3.6/site-packages/flask/templating.py", line 120, in _render
    rv = template.render(context)
  File "/home/mohan/.virtualenv/flack_env/lib/python3.6/site-packages/jinja2/asyncsupport.py", line 76, in render
    return original_render(self, *args, **kwargs)
  File "/home/mohan/.virtualenv/flack_env/lib/python3.6/site-packages/jinja2/environment.py", line 1008, in render
    return self.environment.handle_exception(exc_info, True)
  File "/home/mohan/.virtualenv/flack_env/lib/python3.6/site-packages/jinja2/environment.py", line 780, in handle_exception
    reraise(exc_type, exc_value, tb)
  File "/home/mohan/.virtualenv/flack_env/lib/python3.6/site-packages/jinja2/_compat.py", line 37, in reraise
    raise value.with_traceback(tb)
  File "/home/mohan/flask/flaskq/app/templates/index.html", line 2, in top-level template code
    {% import 'bootstrap/wtf.html' as wtf %}
  File "/home/mohan/flask/flaskq/app/templates/base.html", line 2, in top-level template code
    {% import "bootstrap/wtf.html" as wtf %}
  File "/home/mohan/.virtualenv/flack_env/lib/python3.6/site-packages/flask_bootstrap/templates/bootstrap/base.html", line 1, in top-level template code
    {% block doc -%}
  File "/home/mohan/.virtualenv/flack_env/lib/python3.6/site-packages/flask_bootstrap/templates/bootstrap/base.html", line 4, in block "doc"
    {%- block html %}
  File "/home/mohan/.virtualenv/flack_env/lib/python3.6/site-packages/flask_bootstrap/templates/bootstrap/base.html", line 20, in block "html"
    {% block body -%}
  File "/home/mohan/.virtualenv/flack_env/lib/python3.6/site-packages/flask_bootstrap/templates/bootstrap/base.html", line 21, in block "body"
    {% block navbar %}
  File "/home/mohan/flask/flaskq/app/templates/base.html", line 55, in block "navbar"
    <li><a href="{{ url_for('main.user', username=current_user.username) }}" style="text-transform: capitalize">Profile</a> </li>
  File "/home/mohan/.virtualenv/flack_env/lib/python3.6/site-packages/flask/helpers.py", line 370, in url_for
    return appctx.app.handle_url_build_error(error, endpoint, values)
  File "/home/mohan/.virtualenv/flack_env/lib/python3.6/site-packages/flask/app.py", line 2215, in handle_url_build_error
    reraise(exc_type, exc_value, tb)
  File "/home/mohan/.virtualenv/flack_env/lib/python3.6/site-packages/flask/_compat.py", line 39, in reraise
    raise value
  File "/home/mohan/.virtualenv/flack_env/lib/python3.6/site-packages/flask/helpers.py", line 358, in url_for
    endpoint, values, method=method, force_external=external
  File "/home/mohan/.virtualenv/flack_env/lib/python3.6/site-packages/werkzeug/routing.py", line 2020, in build
    raise BuildError(endpoint, values, method, self)
werkzeug.routing.BuildError: Could not build url for endpoint 'main.user' with values ['username']. Did you mean 'main.users' instead?
