{
  "version": "14.0.4",
  "vulnerabilities": [
    {
      "id": "5a01e3ccf2bcdf6a6b8d24fb9beb8f9f54be54f1fbb70aa684f049e05232344d",
      "category": "sast",
      "name": "Key Exchange without Entity Authentication",
      "message": "Use of ssh InsecureIgnoreHostKey should be audited",
      "description": "The software performs a key exchange with an actor without verifying the identity of that actor.",
      "cve": "foo.go:8:7: func foo() {\n8: \t_ = ssh.InsecureIgnoreHostKey()\n9: }\n:CWE-322",
      "severity": "Medium",
      "confidence": "High",
      "raw_source_code_extract": "7: func foo() {\n8: \t_ = ssh.InsecureIgnoreHostKey()\n9: }\n",
      "scanner": {
        "id": "gosec",
        "name": "Gosec"
      },
      "location": {
        "file": "foo.go",
        "start_line": 8
      },
      "identifiers": [
        {
          "type": "gosec_rule_id",
          "name": "Gosec Rule ID G106",
          "value": "G106"
        },
        {
          "type": "CWE",
          "name": "CWE-322",
          "value": "322",
          "url": "https://cwe.mitre.org/data/definitions/322.html"
        }
      ],
      "tracking": {
        "type": "source",
        "items": [
          {
            "file": "foo.go",
            "line_start": 8,
            "line_end": 8,
            "signatures": [
              {
                "algorithm": "scope_offset",
                "value": "foo.go|foo[0]:1"
              }
            ]
          }
        ]
      }
    },
    {
      "id": "e0701aed0c0d5eaff18491f807af61b201d00dbc8f7da1a7179f935777afb746",
      "category": "sast",
      "name": "Improper Neutralization of Input During Web Page Generation ('Cross-site Scripting')",
      "message": "this method will not auto-escape HTML. Verify data is well formed.",
      "description": "The software does not neutralize or incorrectly neutralizes user-controllable input before it is placed in output that is used as a web page that is served to other users.",
      "cve": "main.go:20:19: \t\t\"Title\": \"Test \u003cb\u003eWorld\u003c/b\u003e\",\n20: \t\t\"Body\":  template.HTML(a),\n21: \t}\n:CWE-79",
      "severity": "Medium",
      "confidence": "Low",
      "raw_source_code_extract": "19: \t\t\"Title\": \"Test \u003cb\u003eWorld\u003c/b\u003e\",\n20: \t\t\"Body\":  template.HTML(a),\n21: \t}\n",
      "scanner": {
        "id": "gosec",
        "name": "Gosec"
      },
      "location": {
        "file": "main.go",
        "start_line": 20
      },
      "identifiers": [
        {
          "type": "gosec_rule_id",
          "name": "Gosec Rule ID G203",
          "value": "G203"
        },
        {
          "type": "CWE",
          "name": "CWE-79",
          "value": "79",
          "url": "https://cwe.mitre.org/data/definitions/79.html"
        }
      ],
      "tracking": {
        "type": "source",
        "items": [
          {
            "file": "main.go",
            "line_start": 20,
            "line_end": 20,
            "signatures": [
              {
                "algorithm": "scope_offset",
                "value": "main.go|main[0]:8"
              }
            ]
          }
        ]
      }
    }
  ],
  "scan": {
    "scanner": {
      "id": "gosec",
      "name": "Gosec",
      "url": "https://github.com/securego/gosec",
      "vendor": {
        "name": "GitLab"
      },
      "version": "2.9.1"
    },
    "type": "sast",
    "start_time": "2021-11-10T19:28:20",
    "end_time": "2021-11-10T19:28:24",
    "status": "success"
  }
}
