{
  "https://opensource-demo.orangehrmlive.com/web/index.php/auth/logout" : {
    "transaction" : "https://opensource-demo.orangehrmlive.com/web/index.php/auth/logout",
    "sampleCount" : 20,
    "errorCount" : 0,
    "errorPct" : 0.0,
    "meanResTime" : 3174.9,
    "medianResTime" : 2979.5,
    "minResTime" : 2115.0,
    "maxResTime" : 6043.0,
    "pct1ResTime" : 4516.500000000001,
    "pct2ResTime" : 5968.0999999999985,
    "pct3ResTime" : 6043.0,
    "throughput" : 0.24429867956563694,
    "receivedKBytesPerSec" : 2.613828870301831,
    "sentKBytesPerSec" : 1.0995826309746295
  },
  "https://opensource-demo.orangehrmlive.com/web/index.php/auth/validate-0" : {
    "transaction" : "https://opensource-demo.orangehrmlive.com/web/index.php/auth/validate-0",
    "sampleCount" : 20,
    "errorCount" : 0,
    "errorPct" : 0.0,
    "meanResTime" : 1458.7000000000003,
    "medianResTime" : 1442.0,
    "minResTime" : 1114.0,
    "maxResTime" : 2180.0,
    "pct1ResTime" : 1894.9000000000005,
    "pct2ResTime" : 2166.95,
    "pct3ResTime" : 2180.0,
    "throughput" : 0.305787019341029,
    "receivedKBytesPerSec" : 0.5258700596284688,
    "sentKBytesPerSec" : 0.22754854368932037
  },
  "https://opensource-demo.orangehrmlive.com/web/index.php/auth/validate-1" : {
    "transaction" : "https://opensource-demo.orangehrmlive.com/web/index.php/auth/validate-1",
    "sampleCount" : 20,
    "errorCount" : 0,
    "errorPct" : 0.0,
    "meanResTime" : 1489.1499999999999,
    "medianResTime" : 1313.5,
    "minResTime" : 699.0,
    "maxResTime" : 2960.0,
    "pct1ResTime" : 2591.5000000000005,
    "pct2ResTime" : 2942.25,
    "pct3ResTime" : 2960.0,
    "throughput" : 0.3040114308297992,
    "receivedKBytesPerSec" : 1.3252107654247798,
    "sentKBytesPerSec" : 0.18852271345402585
  },
  "https://opensource-demo.orangehrmlive.com/web/index.php/auth/validate-2" : {
    "transaction" : "https://opensource-demo.orangehrmlive.com/web/index.php/auth/validate-2",
    "sampleCount" : 20,
    "errorCount" : 0,
    "errorPct" : 0.0,
    "meanResTime" : 506.45000000000005,
    "medianResTime" : 286.0,
    "minResTime" : 182.0,
    "maxResTime" : 1681.0,
    "pct1ResTime" : 962.3000000000002,
    "pct2ResTime" : 1645.3499999999995,
    "pct3ResTime" : 1681.0,
    "throughput" : 0.3046226486939304,
    "receivedKBytesPerSec" : 0.49798663468128856,
    "sentKBytesPerSec" : 0.19187657071053232
  },
  "https://opensource-demo.orangehrmlive.com/web/index.php/api/v2/admin/job-titles?limit=50&offset=0&sortField=jt.jobTitleName&sortOrder=ASC" : {
    "transaction" : "https://opensource-demo.orangehrmlive.com/web/index.php/api/v2/admin/job-titles?limit=50&offset=0&sortField=jt.jobTitleName&sortOrder=ASC",
    "sampleCount" : 20,
    "errorCount" : 20,
    "errorPct" : 100.0,
    "meanResTime" : 1032.8000000000002,
    "medianResTime" : 852.5,
    "minResTime" : 422.0,
    "maxResTime" : 1902.0,
    "pct1ResTime" : 1835.8000000000002,
    "pct2ResTime" : 1899.35,
    "pct3ResTime" : 1902.0,
    "throughput" : 0.32229993231701426,
    "receivedKBytesPerSec" : 0.1032366970702936,
    "sentKBytesPerSec" : 0.18475591823250717
  },
  "https://opensource-demo.orangehrmlive.com/web/index.php/auth/validate" : {
    "transaction" : "https://opensource-demo.orangehrmlive.com/web/index.php/auth/validate",
    "sampleCount" : 20,
    "errorCount" : 0,
    "errorPct" : 0.0,
    "meanResTime" : 13076.35,
    "medianResTime" : 13359.5,
    "minResTime" : 6959.0,
    "maxResTime" : 22364.0,
    "pct1ResTime" : 15727.2,
    "pct2ResTime" : 22035.799999999996,
    "pct3ResTime" : 22364.0,
    "throughput" : 0.27377758309149647,
    "receivedKBytesPerSec" : 1153.1580511570523,
    "sentKBytesPerSec" : 1.2400199515413677
  },
  "https://opensource-demo.orangehrmlive.com/web/index.php/auth/validate-3" : {
    "transaction" : "https://opensource-demo.orangehrmlive.com/web/index.php/auth/validate-3",
    "sampleCount" : 20,
    "errorCount" : 0,
    "errorPct" : 0.0,
    "meanResTime" : 4082.7500000000005,
    "medianResTime" : 3236.5,
    "minResTime" : 1538.0,
    "maxResTime" : 11045.0,
    "pct1ResTime" : 9160.7,
    "pct2ResTime" : 10953.449999999999,
    "pct3ResTime" : 11045.0,
    "throughput" : 0.29879734070366776,
    "receivedKBytesPerSec" : 164.2285309441996,
    "sentKBytesPerSec" : 0.19112525211025622
  },
  "https://opensource-demo.orangehrmlive.com/web/index.php/auth/validate-4" : {
    "transaction" : "https://opensource-demo.orangehrmlive.com/web/index.php/auth/validate-4",
    "sampleCount" : 20,
    "errorCount" : 0,
    "errorPct" : 0.0,
    "meanResTime" : 3730.5,
    "medianResTime" : 3583.5,
    "minResTime" : 1651.0,
    "maxResTime" : 8034.0,
    "pct1ResTime" : 6369.9000000000015,
    "pct2ResTime" : 7953.249999999999,
    "pct3ResTime" : 8034.0,
    "throughput" : 0.2990162365816464,
    "receivedKBytesPerSec" : 194.63766941138655,
    "sentKBytesPerSec" : 0.1883451880812128
  },
  "https://opensource-demo.orangehrmlive.com/web/index.php/auth/validate-5" : {
    "transaction" : "https://opensource-demo.orangehrmlive.com/web/index.php/auth/validate-5",
    "sampleCount" : 20,
    "errorCount" : 0,
    "errorPct" : 0.0,
    "meanResTime" : 8434.25,
    "medianResTime" : 8472.0,
    "minResTime" : 3460.0,
    "maxResTime" : 18293.0,
    "pct1ResTime" : 12323.900000000001,
    "pct2ResTime" : 17997.899999999994,
    "pct3ResTime" : 18293.0,
    "throughput" : 0.2818370136550033,
    "receivedKBytesPerSec" : 432.11201391922555,
    "sentKBytesPerSec" : 0.1797261424967941
  },
  "https://opensource-demo.orangehrmlive.com/web/index.php/auth/validate-6" : {
    "transaction" : "https://opensource-demo.orangehrmlive.com/web/index.php/auth/validate-6",
    "sampleCount" : 20,
    "errorCount" : 0,
    "errorPct" : 0.0,
    "meanResTime" : 7928.449999999998,
    "medianResTime" : 8390.5,
    "minResTime" : 2284.0,
    "maxResTime" : 12925.0,
    "pct1ResTime" : 12497.300000000003,
    "pct2ResTime" : 12909.35,
    "pct3ResTime" : 12925.0,
    "throughput" : 0.2922865577412095,
    "receivedKBytesPerSec" : 429.823367579575,
    "sentKBytesPerSec" : 0.18353540686288838
  },
  "https://opensource-demo.orangehrmlive.com/web/index.php/auth/logout-1" : {
    "transaction" : "https://opensource-demo.orangehrmlive.com/web/index.php/auth/logout-1",
    "sampleCount" : 20,
    "errorCount" : 0,
    "errorPct" : 0.0,
    "meanResTime" : 1308.6999999999998,
    "medianResTime" : 1080.0,
    "minResTime" : 565.0,
    "maxResTime" : 2765.0,
    "pct1ResTime" : 2702.5000000000005,
    "pct2ResTime" : 2763.35,
    "pct3ResTime" : 2765.0,
    "throughput" : 0.24684044233807265,
    "receivedKBytesPerSec" : 1.0442748830593405,
    "sentKBytesPerSec" : 0.1412583000098736
  },
  "https://opensource-demo.orangehrmlive.com/web/index.php/auth/logout-2" : {
    "transaction" : "https://opensource-demo.orangehrmlive.com/web/index.php/auth/logout-2",
    "sampleCount" : 20,
    "errorCount" : 0,
    "errorPct" : 0.0,
    "meanResTime" : 301.7,
    "medianResTime" : 244.5,
    "minResTime" : 164.0,
    "maxResTime" : 584.0,
    "pct1ResTime" : 575.5,
    "pct2ResTime" : 583.65,
    "pct3ResTime" : 584.0,
    "throughput" : 0.2501000400160064,
    "receivedKBytesPerSec" : 0.24204017544517806,
    "sentKBytesPerSec" : 0.1665705344637855
  },
  "https://opensource-demo.orangehrmlive.com/web/index.php/auth/logout-0" : {
    "transaction" : "https://opensource-demo.orangehrmlive.com/web/index.php/auth/logout-0",
    "sampleCount" : 20,
    "errorCount" : 0,
    "errorPct" : 0.0,
    "meanResTime" : 1370.0,
    "medianResTime" : 1214.0,
    "minResTime" : 633.0,
    "maxResTime" : 3782.0,
    "pct1ResTime" : 2561.5000000000005,
    "pct2ResTime" : 3722.449999999999,
    "pct3ResTime" : 3782.0,
    "throughput" : 0.2535111291385692,
    "receivedKBytesPerSec" : 0.410717737539928,
    "sentKBytesPerSec" : 0.1453232742229884
  },
  "https://opensource-demo.orangehrmlive.com/web/index.php/core/i18n/messages" : {
    "transaction" : "https://opensource-demo.orangehrmlive.com/web/index.php/core/i18n/messages",
    "sampleCount" : 40,
    "errorCount" : 40,
    "errorPct" : 100.0,
    "meanResTime" : 1145.7250000000001,
    "medianResTime" : 1007.5,
    "minResTime" : 508.0,
    "maxResTime" : 3639.0,
    "pct1ResTime" : 1967.0999999999997,
    "pct2ResTime" : 2070.35,
    "pct3ResTime" : 3639.0,
    "throughput" : 0.38461168642609206,
    "receivedKBytesPerSec" : 0.3951284122268055,
    "sentKBytesPerSec" : 0.202446971663734
  },
  "https://opensource-demo.orangehrmlive.com/web/index.php/auth/logout-5" : {
    "transaction" : "https://opensource-demo.orangehrmlive.com/web/index.php/auth/logout-5",
    "sampleCount" : 20,
    "errorCount" : 0,
    "errorPct" : 0.0,
    "meanResTime" : 400.59999999999997,
    "medianResTime" : 346.5,
    "minResTime" : 168.0,
    "maxResTime" : 960.0,
    "pct1ResTime" : 668.2000000000003,
    "pct2ResTime" : 945.9499999999998,
    "pct3ResTime" : 960.0,
    "throughput" : 0.25020955049854254,
    "receivedKBytesPerSec" : 0.24287919257378052,
    "sentKBytesPerSec" : 0.1693312680620019
  },
  "https://opensource-demo.orangehrmlive.com/web/index.php/auth/logout-6" : {
    "transaction" : "https://opensource-demo.orangehrmlive.com/web/index.php/auth/logout-6",
    "sampleCount" : 20,
    "errorCount" : 0,
    "errorPct" : 0.0,
    "meanResTime" : 431.8,
    "medianResTime" : 445.5,
    "minResTime" : 174.0,
    "maxResTime" : 767.0,
    "pct1ResTime" : 734.9000000000001,
    "pct2ResTime" : 765.75,
    "pct3ResTime" : 767.0,
    "throughput" : 0.2501469613397871,
    "receivedKBytesPerSec" : 0.24281843708178555,
    "sentKBytesPerSec" : 0.16684606894050255
  },
  "Test" : {
    "transaction" : "Test",
    "sampleCount" : 20,
    "errorCount" : 20,
    "errorPct" : 100.0,
    "meanResTime" : 19575.499999999996,
    "medianResTime" : 18780.0,
    "minResTime" : 12595.0,
    "maxResTime" : 29881.0,
    "pct1ResTime" : 26047.800000000003,
    "pct2ResTime" : 29700.549999999996,
    "pct3ResTime" : 29881.0,
    "throughput" : 0.2529852256628213,
    "receivedKBytesPerSec" : 1068.8877287144555,
    "sentKBytesPerSec" : 2.6958738109694393
  },
  "https://opensource-demo.orangehrmlive.com/web/index.php/auth/logout-3" : {
    "transaction" : "https://opensource-demo.orangehrmlive.com/web/index.php/auth/logout-3",
    "sampleCount" : 20,
    "errorCount" : 0,
    "errorPct" : 0.0,
    "meanResTime" : 373.65,
    "medianResTime" : 338.0,
    "minResTime" : 163.0,
    "maxResTime" : 669.0,
    "pct1ResTime" : 655.2000000000002,
    "pct2ResTime" : 668.65,
    "pct3ResTime" : 669.0,
    "throughput" : 0.25015009005403244,
    "receivedKBytesPerSec" : 0.2425771869371623,
    "sentKBytesPerSec" : 0.16953531493896337
  },
  "Total" : {
    "transaction" : "Total",
    "sampleCount" : 380,
    "errorCount" : 60,
    "errorPct" : 15.789474,
    "meanResTime" : 2725.139473684208,
    "medianResTime" : 1185.0,
    "minResTime" : 163.0,
    "maxResTime" : 22364.0,
    "pct1ResTime" : 8898.300000000005,
    "pct2ResTime" : 11710.899999999998,
    "pct3ResTime" : 15210.319999999998,
    "throughput" : 3.284838740350786,
    "receivedKBytesPerSec" : 1460.51257801492,
    "sentKBytesPerSec" : 3.4035292026486172
  },
  "https://opensource-demo.orangehrmlive.com/web/index.php/auth/logout-4" : {
    "transaction" : "https://opensource-demo.orangehrmlive.com/web/index.php/auth/logout-4",
    "sampleCount" : 20,
    "errorCount" : 0,
    "errorPct" : 0.0,
    "meanResTime" : 385.45,
    "medianResTime" : 364.5,
    "minResTime" : 176.0,
    "maxResTime" : 702.0,
    "pct1ResTime" : 650.2,
    "pct2ResTime" : 699.5,
    "pct3ResTime" : 702.0,
    "throughput" : 0.25017825200455324,
    "receivedKBytesPerSec" : 0.24260449632863415,
    "sentKBytesPerSec" : 0.16711125426866644
  }
}