<?xml version="1.0" encoding="UTF-8"?>
<svg width="24px" height="24px" viewBox="0 0 24 24" version="1.1" xmlns="http://www.w3.org/2000/svg" xmlns:xlink="http://www.w3.org/1999/xlink">
    <title>4DAC5820-7C0A-4EE7-B1D8-F2E7B94029F6</title>
    <g id="Other_insurance" stroke="none" stroke-width="1" fill="none" fill-rule="evenodd">
        <g id="Library" transform="translate(-232.000000, -305.000000)">
            <g id="_phosphor/cake-bold-copy-14" transform="translate(232.000000, 305.000000)">
                <rect id="bounds" x="0" y="0" width="24" height="24"></rect>
                <path d="M12.7655075,0.300607322 C13.1066081,0.617343561 13.5913297,1.14053521 14.0778516,1.81239868 C14.8789215,2.91863818 15.3910886,4.04517344 15.4524039,5.18388571 C15.5415755,6.83993074 14.6452124,8.22214317 12.790186,9.12546667 L19.3078201,9.12495126 C20.2053125,9.12125652 21.0671264,9.47612447 21.701751,10.110749 C22.3363755,10.7453736 22.6912435,11.6071875 22.6875487,12.5 L22.6875487,13.746875 C22.6875487,14.9691776 22.1838156,16.0835952 21.3751618,16.8822847 L21.375,20.5 C21.375,21.5355339 20.5355339,22.375 19.5,22.375 L4.5,22.375 C3.46446609,22.375 2.625,21.5355339 2.625,20.5 L2.6238887,16.8812913 C1.81577445,16.0826723 1.31246085,14.9686715 1.31246085,13.746875 L1.31246085,12.5046799 C1.30875652,11.6071875 1.66362447,10.7453736 2.29824904,10.110749 C2.93287362,9.47612447 3.79468755,9.12125652 4.6875,9.12495126 L11.209814,9.12546667 C9.35478763,8.22214317 8.45842447,6.83993074 8.54759613,5.18388571 C8.60891141,4.04517344 9.12107846,2.91863818 9.92214845,1.81239868 C10.4086703,1.14053521 10.8933919,0.617343561 11.2344925,0.300607322 C11.6661338,-0.100202441 12.3338662,-0.100202441 12.7655075,0.300607322 Z M19.3125,11.3749803 L4.68282013,11.3749705 C4.38529669,11.3737329 4.09960815,11.4913705 3.8892393,11.7017393 C3.67887045,11.9121081 3.56123287,12.1977967 3.56248028,12.5 L3.56248028,13.746875 C3.56248028,14.9270966 4.52684853,15.8991256 5.66746326,15.8752385 C6.78993365,15.8521239 7.68773799,14.9354468 7.68750003,13.8127385 C7.68746491,13.647053 7.72324878,13.4897256 7.78753276,13.3480781 C7.80370972,13.3124524 7.82156926,13.2780243 7.84109548,13.244691 L7.90441893,13.1482821 C8.10906623,12.8689738 8.43946935,12.687579 8.81226155,12.6875 C9.01936832,12.6874561 9.21341577,12.7433794 9.38010313,12.8409751 L9.47691039,12.9045597 C9.75617532,13.1092662 9.9375,13.4397078 9.9375,13.8125 C9.9375,14.9515873 10.8609127,15.875 12,15.875 C13.1390873,15.875 14.0625,14.9515873 14.0625,13.8125 C14.0625,13.6053932 14.1184644,13.4113576 14.2160955,13.244691 L14.2797006,13.1478972 C14.2899261,13.1339535 14.3004651,13.1202542 14.3113072,13.1068095 C14.3730125,13.0303572 14.4441369,12.9624336 14.5230896,12.9045597 L14.6198969,12.8409751 C14.7865842,12.7433794 14.9806317,12.6874561 15.1877385,12.6875 C15.8090588,12.6876317 16.3126317,13.1914181 16.3125,13.8127385 C16.312262,14.9354468 17.2100663,15.8521239 18.33293,15.8752466 C19.4731515,15.8991256 20.4375197,14.9270966 20.4375197,13.746875 L20.4375295,12.4953201 C20.4387671,12.1977967 20.3211295,11.9121081 20.1107607,11.7017393 C19.9003919,11.4913705 19.6147033,11.3737329 19.3125,11.3749803 Z M11.9996667,2.797 L11.9766747,2.82567041 L11.7445182,3.13204576 C11.1740257,3.91986876 10.8279271,4.68112865 10.7943414,5.30486429 C10.7602149,5.93864247 11.0506221,6.46726496 11.8795026,6.93920901 L11.9986667,7.004 L12.1204974,6.93920901 C12.8941192,6.4987279 13.198671,6.00887356 13.2080934,5.43023222 L13.2056586,5.30486429 C13.1720729,4.68112865 12.8259743,3.91986876 12.2554818,3.13204576 C12.1798831,3.02764758 12.1022665,2.92538785 12.0233253,2.82567041 L11.9996667,2.797 Z" id="Combined-Shape" fill="#2A55E5"></path>
            </g>
        </g>
    </g>
</svg>