<?xml version="1.0" encoding="UTF-8"?>
<svg width="32px" height="32px" viewBox="0 0 32 32" version="1.1" xmlns="http://www.w3.org/2000/svg" xmlns:xlink="http://www.w3.org/1999/xlink">
    <title>F540E5A9-CE52-4BD8-9E04-87647ECC3402</title>
    <defs>
        <rect id="path-1" x="0" y="0" width="328" height="593" rx="8"></rect>
        <filter x="-8.5%" y="-3.4%" width="117.1%" height="109.4%" filterUnits="objectBoundingBox" id="filter-2">
            <feMorphology radius="4" operator="erode" in="SourceAlpha" result="shadowSpreadOuter1"></feMorphology>
            <feOffset dx="0" dy="8" in="shadowSpreadOuter1" result="shadowOffsetOuter1"></feOffset>
            <feGaussianBlur stdDeviation="12" in="shadowOffsetOuter1" result="shadowBlurOuter1"></feGaussianBlur>
            <feColorMatrix values="0 0 0 0 0   0 0 0 0 0   0 0 0 0 0  0 0 0 0.114018794 0" type="matrix" in="shadowBlurOuter1"></feColorMatrix>
        </filter>
        <path d="M12,0 L316,0 C322.627417,-1.21743675e-15 328,5.372583 328,12 L328,209 L328,209 L0,209 L0,12 C-8.11624501e-16,5.372583 5.372583,-5.88799061e-15 12,0 Z" id="path-3"></path>
        <filter x="-0.2%" y="-0.2%" width="100.3%" height="101.0%" filterUnits="objectBoundingBox" id="filter-4">
            <feOffset dx="0" dy="1" in="SourceAlpha" result="shadowOffsetOuter1"></feOffset>
            <feColorMatrix values="0 0 0 0 0   0 0 0 0 0   0 0 0 0 0  0 0 0 0.1 0" type="matrix" in="shadowOffsetOuter1"></feColorMatrix>
        </filter>
    </defs>
    <g id="Other_insurance" stroke="none" stroke-width="1" fill="none" fill-rule="evenodd">
        <g id="m.Group-Cancer_quote" transform="translate(-61.000000, -283.000000)">
            <rect id="bg" fill="#F1F3F6" x="0" y="0" width="360" height="1603"></rect>
            <g id="Group-3" transform="translate(17.000000, 169.000000)">
                <g id="Plan-Health_g-Copy" transform="translate(0.000000, 28.000000)">
                    <g id="card_bg">
                        <use fill="black" fill-opacity="1" filter="url(#filter-2)" xlink:href="#path-1"></use>
                        <use fill="#FFFFFF" fill-rule="evenodd" xlink:href="#path-1"></use>
                    </g>
                    <g id="Rectangle-Copy" opacity="0.100000001">
                        <use fill="black" fill-opacity="1" filter="url(#filter-4)" xlink:href="#path-3"></use>
                        <use fill="#FFFFFF" fill-rule="evenodd" xlink:href="#path-3"></use>
                    </g>
                    <g id="features" transform="translate(16.000000, 86.000000)" fill="#2874F0" fill-rule="nonzero">
                        <g id="ic_hosp" transform="translate(28.000000, 0.000000)">
                            <path d="M11,12 L11,26 L4,26 L4,12 L11,12 Z M10,13 L5,13 L5,25 L10,25 L10,13 Z M9,21 L9,23 L7,23 L7,21 L9,21 Z M9,17 L9,19 L7,19 L7,17 L9,17 Z" id="Combined-Shape"></path>
                            <path d="M28,12 L28,26 L21,26 L21,12 L28,12 Z M27,13 L22,13 L22,25 L27,25 L27,13 Z M25,21 L25,23 L23,23 L23,21 L25,21 Z M25,17 L25,19 L23,19 L23,17 L25,17 Z" id="Combined-Shape"></path>
                            <path d="M22,6 L22,26 L10,26 L10,6 L22,6 Z M21,7 L11,7 L11,25 L21,25 L21,7 Z M14,21 L14,23 L12,23 L12,21 L14,21 Z M17,21 L17,23 L15,23 L15,21 L17,21 Z M20,21 L20,23 L18,23 L18,21 L20,21 Z M14,17 L14,19 L12,19 L12,17 L14,17 Z M17,17 L17,19 L15,19 L15,17 L17,17 Z M20,17 L20,19 L18,19 L18,17 L20,17 Z M17,8 L17,10 L19,10 L19,12 L17,12 L17,14 L15,14 L15,12 L13,12 L13,10 L15,10 L15,8 L17,8 Z" id="Combined-Shape"></path>
                        </g>
                    </g>
                </g>
            </g>
        </g>
    </g>
</svg>