<?xml version="1.0" encoding="UTF-8"?>
<svg width="16px" height="16px" viewBox="0 0 16 16" version="1.1" xmlns="http://www.w3.org/2000/svg" xmlns:xlink="http://www.w3.org/1999/xlink">
    <title>7134F843-8B14-4CF0-99F5-0F2EABF0DDFB</title>
    <g id="Other_insurance" stroke="none" stroke-width="1" fill="none" fill-rule="evenodd">
        <g id="Library" transform="translate(-373.000000, -308.000000)">
            <g id="_phosphor/arrow-line-down-bold" transform="translate(373.000000, 308.000000)">
                <rect id="bounds" x="0" y="0" width="16" height="16"></rect>
                <path d="M8.29401718,11.6910613 L8.26054355,11.7034837 C8.22503419,11.7169201 8.19640897,11.7252055 8.16713652,11.7317795 C8.15830133,11.7332413 8.15028764,11.7349177 8.14225356,11.736462 C8.12019403,11.741126 8.09676726,11.7444613 8.07301859,11.7466893 C8.05875123,11.7478343 8.04508256,11.7487767 8.03140126,11.7493464 C8.02186053,11.7498078 8.01199438,11.75 8.00208333,11.75 L7.97358125,11.7495375 C7.95722994,11.7489647 7.9408938,11.74786 7.924601,11.7462234 L8.00208333,11.75 C7.95699886,11.75 7.91284351,11.746022 7.86994914,11.7383978 C7.85488092,11.7360792 7.83917371,11.7328242 7.82356375,11.7290622 C7.80622891,11.7243826 7.78946031,11.7196451 7.77294109,11.7143505 C7.75604763,11.7096261 7.73897337,11.703541 7.72209395,11.6968185 C7.71138095,11.6916745 7.70097666,11.6872023 7.69069696,11.6825047 C7.6106377,11.6472724 7.5355503,11.5962105 7.46966991,11.5303301 L2.96966991,7.03033009 C2.6767767,6.73743687 2.6767767,6.26256313 2.96966991,5.96966991 C3.26256313,5.6767767 3.73743687,5.6767767 4.03033009,5.96966991 L7.252,9.191 L7.25208333,2 C7.25208333,1.58578644 7.58786977,1.25 8.00208333,1.25 C8.4162969,1.25 8.75208333,1.58578644 8.75208333,2 L8.752,9.187 L11.9696699,5.96966991 C12.2625631,5.6767767 12.7374369,5.6767767 13.0303301,5.96966991 C13.3232233,6.26256313 13.3232233,6.73743687 13.0303301,7.03033009 L8.54727908,11.5150383 C8.49308228,11.5723882 8.42993508,11.6211904 8.36007204,11.6592104 L8.29401718,11.6910613 Z M13.5,12.7520833 C13.9142136,12.7520833 14.25,13.0878698 14.25,13.5020833 C14.25,13.9162969 13.9142136,14.2520833 13.5,14.2520833 L2.5,14.2520833 C2.08578644,14.2520833 1.75,13.9162969 1.75,13.5020833 C1.75,13.0878698 2.08578644,12.7520833 2.5,12.7520833 L13.5,12.7520833 Z" id="Combined-Shape" fill="#2A55E5"></path>
            </g>
        </g>
    </g>
</svg>