<?xml version="1.0" encoding="UTF-8"?>
<svg width="32px" height="32px" viewBox="0 0 32 32" version="1.1" xmlns="http://www.w3.org/2000/svg" xmlns:xlink="http://www.w3.org/1999/xlink">
    <title>ic_hosp</title>
    <g id="Other_insurance" stroke="none" stroke-width="1" fill="none" fill-rule="evenodd">
        <g id="m.Group-Cancer_quote-3" transform="translate(-165.000000, -259.000000)" fill="#2A55E5">
            <g id="car-plan" transform="translate(13.000000, 186.000000)">
                <g id="features" transform="translate(16.000000, 73.000000)">
                    <g id="sa-copy" transform="translate(108.000000, 0.000000)">
                        <g id="ic_hosp" transform="translate(28.000000, -0.000000)">
                            <path d="M17.7496889,4.14471111 C17.8101333,4.15217778 17.8695111,4.17031111 17.9235556,4.19804444 C18.0600889,4.26773333 21.1427556,5.91288889 20.4355556,11.2526222 L24.2712889,11.2526222 C25.1409778,11.2526222 25.9466667,11.6458667 26.4814222,12.3317333 C27.0165333,13.0179556 27.2014222,13.8954667 26.9891556,14.7388444 L25.2771556,21.5434667 C24.7569778,23.6103111 22.9056,25.0538667 20.7740444,25.0538667 L15.1064889,25.0538667 C14.2830222,25.0538667 13.4705778,24.8359111 12.7573333,24.4238222 C12.7395556,24.4135111 12.7224889,24.4024889 12.7061333,24.3900444 L12.4483556,24.1973333 L12.4728889,24.4849778 C12.4856889,24.6314667 12.4359111,24.7761778 12.3367111,24.8842667 C12.2371556,24.9923556 12.0974222,25.0538667 11.9505778,25.0538667 L6.8704,25.0538667 C6.58133333,25.0538667 6.34631111,24.8192 6.34631111,24.5297778 L6.34631111,11.2526222 C6.34631111,10.9639111 6.57991111,10.7296 6.86862222,10.7285333 L11.6576,10.7057778 C11.6945778,10.7057778 11.7294222,10.7093333 11.7632,10.7160889 C11.7845333,10.7203556 11.8048,10.7281778 11.8250667,10.7349333 C11.8371556,10.7388444 11.8496,10.7409778 11.8609778,10.7459556 C11.8840889,10.7559111 11.9054222,10.7683556 11.9267556,10.7811556 C11.9349333,10.7861333 11.9434667,10.7893333 11.9509333,10.7943111 C12.0078222,10.8323556 12.0568889,10.8814222 12.0952889,10.9383111 C12.0977778,10.9418667 12.0992,10.9457778 12.1013333,10.9493333 C12.1173333,10.9745778 12.1319111,11.0005333 12.1436444,11.0282667 C12.1475556,11.0378667 12.1493333,11.0481778 12.1528889,11.0577778 C12.1607111,11.0801778 12.1692444,11.1022299 12.1738667,11.1260444 C12.1806222,11.1601778 12.1841778,11.1946667 12.1841778,11.2298667 L12.1841778,12.128 L15.2835556,9.03573333 C15.4688,8.7616 15.5662222,8.44266667 15.5662222,8.11093333 L15.5662222,5.0144 C15.5662222,4.78862222 15.6618667,4.57991111 15.8353778,4.42666667 C16.3015111,4.01493333 17.3287111,4.09208889 17.7496889,4.14471111 Z M16.6154667,5.19004444 L16.6154667,8.11057778 C16.6154667,8.6752 16.4423111,9.21706667 16.1148444,9.67715556 C16.0977778,9.70133333 16.0789333,9.72373333 16.0579556,9.74435556 L12.1848889,13.6081778 L12.1848889,22.6915556 L13.3088,23.5313778 C13.8563556,23.8421333 14.4775111,24.0060444 15.1075556,24.0060444 L20.7751111,24.0060444 C22.4252444,24.0060444 23.8588444,22.8881778 24.2613333,21.2878222 L24.4135111,20.6826667 L22.7797333,20.6826667 C22.5916444,20.6826667 22.4394667,20.5301333 22.4394667,20.3424 C22.4394667,20.1543111 22.5916444,20.0021333 22.7797333,20.0021333 L24.5845333,20.0021333 L25.4883556,16.4092444 L23.3724444,16.4092444 C23.1843556,16.4092444 23.0321778,16.2567111 23.0321778,16.0689778 C23.0321778,15.8808889 23.1843556,15.7287111 23.3724444,15.7287111 L25.6593778,15.7287111 L25.9726222,14.4832 C26.1056,13.9552 25.9900444,13.4058667 25.6558222,12.976 C25.3208889,12.5464889 24.8163556,12.3000889 24.272,12.3000889 L19.8243556,12.3000889 C19.6689778,12.3000889 19.5217778,12.2314667 19.4225778,12.1127111 C19.3230222,11.9936 19.2810667,11.8368 19.3084444,11.6842667 C20.1301333,7.06951111 17.9662222,5.45315556 17.5189333,5.17297778 C17.1797333,5.14097778 16.8067556,5.14915556 16.6154667,5.19004444 Z M11.136,11.7557333 L7.39555556,11.7745778 L7.39555556,24.0056889 L11.136,24.0056889 L11.136,11.7557333 Z M8.6144,1.78915556 L9.94666667,4.09635556 C9.52355556,4.31182222 9.11395556,4.54862222 8.71857778,4.8064 L7.38595556,2.49813333 L8,2.14364444 L8.6144,1.78915556 Z M23.3856,1.78915556 L24.6136889,2.49813333 L23.2810667,4.8064 C22.8860444,4.54862222 22.4760889,4.31182222 22.0533333,4.09635556 L23.3856,1.78915556 Z M16.7093333,-6.66133815e-16 L16.7093333,2.66346667 C16.4743111,2.65137778 16.2378667,2.64462222 16.0003556,2.64426667 C15.7621333,2.64426667 15.5260444,2.65102222 15.2910222,2.66346667 L15.2910222,-6.66133815e-16 L16.7093333,-6.66133815e-16 Z M16.7093333,29.3365333 C16.4743111,29.3489778 16.2378667,29.3557333 16,29.3557333 C15.7621333,29.3557333 15.5256889,29.3489778 15.2906667,29.3365333 L15.2906667,32 L16,32 L16.7093333,32 L16.7093333,29.3365333 Z M23.2814222,27.1939556 C22.8860444,27.4517333 22.4764444,27.6885333 22.0533333,27.904 L23.3856,30.2112 L24.6140444,29.5022222 L23.2814222,27.1939556 Z M1.7888,8.6144 L4.09635556,9.94666667 C4.31182222,9.52391111 4.54862222,9.11395556 4.8064,8.71857778 L2.49848889,7.38595556 L1.7888,8.6144 Z M27.1936,23.2817778 L29.5018667,24.6144 L29.8563556,24.0003556 L30.2112,23.3859556 L27.9036444,22.0536889 C27.6881778,22.4764444 27.4513778,22.8864 27.1936,23.2817778 Z M2.64426667,16 C2.64426667,15.7617778 2.65102222,15.5253333 2.66346667,15.2903111 L0,15.2903111 L0,16 L0,16.7093333 L2.66346667,16.7093333 C2.65102222,16.4743111 2.64426667,16.2382222 2.64426667,16 Z M29.3553778,16 C29.3553778,16.2378667 29.3486222,16.4743111 29.3361778,16.7093333 L32,16.7093333 L32,15.2906667 L29.3365333,15.2906667 C29.3486222,15.5256889 29.3553778,15.7621333 29.3553778,16 Z M1.7888,23.3856 L2.14364444,24 L2.49813333,24.6140444 L4.80604444,23.2814222 C4.54826667,22.8860444 4.31146667,22.4760889 4.096,22.0533333 L1.7888,23.3856 Z M30.2112,8.6144 L29.5018667,7.38595556 L27.1936,8.71857778 C27.4513778,9.11395556 27.6881778,9.52391111 27.9036444,9.94666667 L30.2112,8.6144 Z M7.3856,29.5022222 L8.61404444,30.2112 L9.94595556,27.904 C9.5232,27.6885333 9.11324444,27.4517333 8.71786667,27.1939556 L7.3856,29.5022222 Z" id="Combined-Shape"></path>
                        </g>
                    </g>
                </g>
            </g>
        </g>
    </g>
</svg>