<?xml version="1.0" encoding="UTF-8"?>
<svg width="48px" height="48px" viewBox="0 0 48 48" version="1.1" xmlns="http://www.w3.org/2000/svg" xmlns:xlink="http://www.w3.org/1999/xlink">
    <title>EECC8DD2-2E9A-4E0A-B4EA-8A9AF7DF122B</title>
    <defs>
        <rect id="path-1" x="0" y="0" width="750" height="576" rx="16"></rect>
        <filter x="-7.5%" y="-8.0%" width="114.9%" height="120.5%" filterUnits="objectBoundingBox" id="filter-2">
            <feMorphology radius="4" operator="erode" in="SourceAlpha" result="shadowSpreadOuter1"></feMorphology>
            <feOffset dx="0" dy="16" in="shadowSpreadOuter1" result="shadowOffsetOuter1"></feOffset>
            <feGaussianBlur stdDeviation="17" in="shadowOffsetOuter1" result="shadowBlurOuter1"></feGaussianBlur>
            <feColorMatrix values="0 0 0 0 0.541176471   0 0 0 0 0.564705882   0 0 0 0 0.709803922  0 0 0 0.1 0" type="matrix" in="shadowBlurOuter1" result="shadowMatrixOuter1"></feColorMatrix>
            <feMorphology radius="0.5" operator="dilate" in="SourceAlpha" result="shadowSpreadOuter2"></feMorphology>
            <feOffset dx="0" dy="0" in="shadowSpreadOuter2" result="shadowOffsetOuter2"></feOffset>
            <feGaussianBlur stdDeviation="12" in="shadowOffsetOuter2" result="shadowBlurOuter2"></feGaussianBlur>
            <feColorMatrix values="0 0 0 0 0.419607843   0 0 0 0 0.478431373   0 0 0 0 0.996078431  0 0 0 0.12 0" type="matrix" in="shadowBlurOuter2" result="shadowMatrixOuter2"></feColorMatrix>
            <feMerge>
                <feMergeNode in="shadowMatrixOuter1"></feMergeNode>
                <feMergeNode in="shadowMatrixOuter2"></feMergeNode>
            </feMerge>
        </filter>
        <rect id="path-3" x="0" y="56" width="750" height="520" rx="24"></rect>
        <filter x="-2.8%" y="-4.0%" width="105.6%" height="108.1%" filterUnits="objectBoundingBox" id="filter-4">
            <feMorphology radius="4" operator="erode" in="SourceAlpha" result="shadowSpreadOuter1"></feMorphology>
            <feOffset dx="0" dy="16" in="shadowSpreadOuter1" result="shadowOffsetOuter1"></feOffset>
            <feGaussianBlur stdDeviation="17" in="shadowOffsetOuter1" result="shadowBlurOuter1"></feGaussianBlur>
            <feColorMatrix values="0 0 0 0 0.541176471   0 0 0 0 0.564705882   0 0 0 0 0.709803922  0 0 0 0.1 0" type="matrix" in="shadowBlurOuter1" result="shadowMatrixOuter1"></feColorMatrix>
            <feMorphology radius="0.5" operator="dilate" in="SourceAlpha" result="shadowSpreadOuter2"></feMorphology>
            <feOffset dx="0" dy="0" in="shadowSpreadOuter2" result="shadowOffsetOuter2"></feOffset>
            <feGaussianBlur stdDeviation="12" in="shadowOffsetOuter2" result="shadowBlurOuter2"></feGaussianBlur>
            <feColorMatrix values="0 0 0 0 0.419607843   0 0 0 0 0.478431373   0 0 0 0 0.996078431  0 0 0 0.12 0" type="matrix" in="shadowBlurOuter2" result="shadowMatrixOuter2"></feColorMatrix>
            <feMerge>
                <feMergeNode in="shadowMatrixOuter1"></feMergeNode>
                <feMergeNode in="shadowMatrixOuter2"></feMergeNode>
            </feMerge>
        </filter>
        <rect id="path-5" x="0" y="0" width="96" height="96" rx="8"></rect>
        <filter x="-43.2%" y="-34.9%" width="186.5%" height="186.5%" filterUnits="objectBoundingBox" id="filter-6">
            <feMorphology radius="0.5" operator="dilate" in="SourceAlpha" result="shadowSpreadOuter1"></feMorphology>
            <feOffset dx="0" dy="8" in="shadowSpreadOuter1" result="shadowOffsetOuter1"></feOffset>
            <feGaussianBlur stdDeviation="12" in="shadowOffsetOuter1" result="shadowBlurOuter1"></feGaussianBlur>
            <feComposite in="shadowBlurOuter1" in2="SourceAlpha" operator="out" result="shadowBlurOuter1"></feComposite>
            <feColorMatrix values="0 0 0 0 0.541176471   0 0 0 0 0.564705882   0 0 0 0 0.709803922  0 0 0 0.16 0" type="matrix" in="shadowBlurOuter1"></feColorMatrix>
        </filter>
    </defs>
    <g id="Other_insurance" stroke="none" stroke-width="1" fill="none" fill-rule="evenodd">
        <g id="Group-Cancer_PQ-memberSelect" transform="translate(-598.000000, -357.000000)">
            <rect fill="#FAFAFC" x="0" y="0" width="1440" height="800"></rect>
            <g id="Rename-this-Group" transform="translate(247.000000, 168.000000)">
                <g id="bg">
                    <use fill="black" fill-opacity="1" filter="url(#filter-2)" xlink:href="#path-1"></use>
                    <use fill="#FFFFFF" fill-rule="evenodd" xlink:href="#path-1"></use>
                </g>
                <g id="bg" opacity="0">
                    <use fill="black" fill-opacity="1" filter="url(#filter-4)" xlink:href="#path-3"></use>
                    <use fill="#FFFFFF" fill-rule="evenodd" xlink:href="#path-3"></use>
                </g>
                <g id="Grp" transform="translate(223.000000, 177.000000)">
                    <g id="memberTile-set-Copy-2" transform="translate(104.000000, 0.000000)">
                        <g id="Rectangle">
                            <use fill="black" fill-opacity="1" filter="url(#filter-6)" xlink:href="#path-5"></use>
                            <rect stroke-opacity="0.12" stroke="#6B7AFE" stroke-width="1" stroke-linejoin="square" fill="#FFFFFF" fill-rule="evenodd" x="0.5" y="0.5" width="95" height="95" rx="8"></rect>
                        </g>
                        <g id="ic_member_set_ss1" transform="translate(24.000000, 12.000000)" fill-rule="nonzero">
                            <g id="gril" transform="translate(3.000000, 2.571429)">
                                <circle id="Oval" fill="#F9C19B" cx="36.264" cy="26.3734286" r="4.94485714"></circle>
                                <circle id="Oval" fill="#F9C19B" cx="4.94485714" cy="26.3734286" r="4.94485714"></circle>
                                <circle id="Oval" fill="#FFD5AB" cx="21.0161912" cy="22.6649883" r="16.896"></circle>
                                <path d="M14.010989,25.1373627 C14.010989,26.2520266 13.1029987,27.1978022 11.9505495,27.1978022 C10.8330229,27.1978022 9.89010986,26.2858044 9.89010986,25.1373627 C9.89010986,24.0226986 10.7981002,23.0769231 11.9505495,23.0769231 C13.068076,23.0769231 14.010989,23.9889209 14.010989,25.1373627 Z" id="Shape" fill="#442106"></path>
                                <path d="M28.021978,25.1373627 C28.021978,26.2520266 28.9299683,27.1978022 30.0824175,27.1978022 C31.1999441,27.1978022 32.1428571,26.2858044 32.1428571,25.1373627 C32.1428571,24.0226986 31.2348669,23.0769231 30.0824175,23.0769231 C28.9299683,23.0769231 28.021978,23.9889209 28.021978,25.1373627 Z" id="Shape" fill="#442106"></path>
                                <path d="M25.0102037,30.5091297 C24.6596127,30.4323773 24.2739624,30.6626346 24.2038442,31.0847729 C24.1687851,31.1615253 23.7480758,33.1187123 21.4341745,33.1187123 C19.2605096,33.1187123 18.6995638,31.276654 18.6645047,31.0847729 C18.5943865,30.739387 18.3139137,30.5091297 17.9983816,30.5091297 C17.9282634,30.5091297 17.8932043,30.5091297 17.8230861,30.5475059 C17.472495,30.6626346 17.2270812,31.0847729 17.3322585,31.4685351 C17.6127314,32.5430691 18.8047412,34.6153846 21.4341745,34.6153846 C24.1337259,34.6153846 25.2906766,32.5430691 25.5360903,31.4301589 C25.6062086,31.0080205 25.395854,30.5858822 25.0102037,30.5091297 Z" id="Shape" fill="#935D4A"></path>
                                <path d="M21.0164835,14.010989 C23.0425824,14.010989 24.7252747,12.4764936 24.7252747,9.75625183 C24.7252747,9.0936288 24.6222527,7.73350794 24.4162088,7.10575983 C24.4162088,7.10575983 24.4162088,7.07088494 24.4162088,7.07088494 C22.8708791,1.97915028 23.8324176,0.793403858 23.7980769,0.793403858 C23.9354396,0.653904279 23.9697802,0.409780015 23.9010989,0.23540554 C23.8324176,0.0261561712 23.6607143,-0.0435936186 23.489011,0.0261561712 C17.6510989,2.81614776 17.3763736,8.18688157 17.342033,8.43100583 C17.342033,8.46588073 17.342033,8.46588073 17.342033,8.50075563 C17.3076923,8.710005 17.3076923,9.58187734 17.3076923,9.75625183 C17.3076923,12.4764936 18.9560439,14.010989 21.0164835,14.010989 Z" id="Shape" fill="#59351C"></path>
                                <path d="M21.4285714,10.0518524 C21.4285714,10.4118837 20.8373905,10.6999088 20.1071081,10.6999088 L15.8992905,13.0401123 C14.6473779,13.7961782 13.1868132,11.5279808 13.1868132,8.57572397 C13.1868132,5.65947024 14.8212547,3.64329483 15.8992905,4.21934494 L20.1071081,6.55954854 C20.8373905,6.55954854 21.4285714,6.8475736 21.4285714,7.20760492 L21.4285714,10.0518524 Z" id="Shape" fill="#F27288"></path>
                                <path d="M21.4285714,10.0518524 C21.4285714,10.4118837 22.0197524,10.6999088 22.7500347,10.6999088 L26.9578523,13.0401123 C28.2097649,13.7961782 29.6703297,11.5279808 29.6703297,8.57572397 C29.6703297,5.65947024 28.0358882,3.64329483 26.9578523,4.21934494 L22.7500347,6.55954854 C22.0197524,6.55954854 21.4285714,6.8475736 21.4285714,7.20760492 L21.4285714,10.0518524 Z" id="Shape" fill="#F27288"></path>
                                <circle id="Oval" fill="#FF8A98" cx="21.4285714" cy="8.24142857" r="3.29657143"></circle>
                                <ellipse id="Oval" fill="#FCB19A" cx="11.5388571" cy="30.4945714" rx="3.29657143" ry="2.47285714"></ellipse>
                                <ellipse id="Oval" fill="#FCB19A" cx="30.4945714" cy="30.4945714" rx="3.29657143" ry="2.47285714"></ellipse>
                            </g>
                        </g>
                        <g id="check" transform="translate(68.000000, 4.000000)">
                            <rect id="bg" x="0" y="0" width="16" height="16"></rect>
                            <path d="M8,1.33333333 C10.0474562,1.33333333 11.879337,2.25632186 13.1022589,3.70891565 L12.9233333,3.53 L5.86333333,10.5833333 L3.08333333,7.80333333 L2.13666667,8.74333333 L5.86333333,12.47 L13.7346673,4.59825729 C14.3266857,5.59413579 14.6666667,6.75736449 14.6666667,8 C14.6666667,11.6818983 11.6818983,14.6666667 8,14.6666667 C4.31810167,14.6666667 1.33333333,11.6818983 1.33333333,8 C1.33333333,4.31810167 4.31810167,1.33333333 8,1.33333333 Z" id="shape" fill="#FFFFFF"></path>
                        </g>
                    </g>
                </g>
            </g>
        </g>
    </g>
</svg>