<?xml version="1.0" encoding="UTF-8"?>
<svg width="48px" height="48px" viewBox="0 0 48 48" version="1.1" xmlns="http://www.w3.org/2000/svg" xmlns:xlink="http://www.w3.org/1999/xlink">
    <title>34291851-E9DC-473B-9422-12B4D5A6E39C</title>
    <defs>
        <rect id="path-1" x="0" y="0" width="750" height="368" rx="16"></rect>
        <filter x="-7.5%" y="-12.5%" width="114.9%" height="132.1%" filterUnits="objectBoundingBox" id="filter-2">
            <feMorphology radius="4" operator="erode" in="SourceAlpha" result="shadowSpreadOuter1"></feMorphology>
            <feOffset dx="0" dy="16" in="shadowSpreadOuter1" result="shadowOffsetOuter1"></feOffset>
            <feGaussianBlur stdDeviation="17" in="shadowOffsetOuter1" result="shadowBlurOuter1"></feGaussianBlur>
            <feColorMatrix values="0 0 0 0 0.541176471   0 0 0 0 0.564705882   0 0 0 0 0.709803922  0 0 0 0.1 0" type="matrix" in="shadowBlurOuter1" result="shadowMatrixOuter1"></feColorMatrix>
            <feMorphology radius="0.5" operator="dilate" in="SourceAlpha" result="shadowSpreadOuter2"></feMorphology>
            <feOffset dx="0" dy="0" in="shadowSpreadOuter2" result="shadowOffsetOuter2"></feOffset>
            <feGaussianBlur stdDeviation="12" in="shadowOffsetOuter2" result="shadowBlurOuter2"></feGaussianBlur>
            <feColorMatrix values="0 0 0 0 0.419607843   0 0 0 0 0.478431373   0 0 0 0 0.996078431  0 0 0 0.12 0" type="matrix" in="shadowBlurOuter2" result="shadowMatrixOuter2"></feColorMatrix>
            <feMerge>
                <feMergeNode in="shadowMatrixOuter1"></feMergeNode>
                <feMergeNode in="shadowMatrixOuter2"></feMergeNode>
            </feMerge>
        </filter>
        <rect id="path-3" x="0" y="56" width="750" height="312" rx="24"></rect>
        <filter x="-2.8%" y="-6.7%" width="105.6%" height="113.5%" filterUnits="objectBoundingBox" id="filter-4">
            <feMorphology radius="4" operator="erode" in="SourceAlpha" result="shadowSpreadOuter1"></feMorphology>
            <feOffset dx="0" dy="16" in="shadowSpreadOuter1" result="shadowOffsetOuter1"></feOffset>
            <feGaussianBlur stdDeviation="17" in="shadowOffsetOuter1" result="shadowBlurOuter1"></feGaussianBlur>
            <feColorMatrix values="0 0 0 0 0.541176471   0 0 0 0 0.564705882   0 0 0 0 0.709803922  0 0 0 0.1 0" type="matrix" in="shadowBlurOuter1" result="shadowMatrixOuter1"></feColorMatrix>
            <feMorphology radius="0.5" operator="dilate" in="SourceAlpha" result="shadowSpreadOuter2"></feMorphology>
            <feOffset dx="0" dy="0" in="shadowSpreadOuter2" result="shadowOffsetOuter2"></feOffset>
            <feGaussianBlur stdDeviation="12" in="shadowOffsetOuter2" result="shadowBlurOuter2"></feGaussianBlur>
            <feColorMatrix values="0 0 0 0 0.419607843   0 0 0 0 0.478431373   0 0 0 0 0.996078431  0 0 0 0.12 0" type="matrix" in="shadowBlurOuter2" result="shadowMatrixOuter2"></feColorMatrix>
            <feMerge>
                <feMergeNode in="shadowMatrixOuter1"></feMergeNode>
                <feMergeNode in="shadowMatrixOuter2"></feMergeNode>
            </feMerge>
        </filter>
        <rect id="path-5" x="0" y="0" width="96" height="96" rx="8"></rect>
        <filter x="-10.4%" y="-6.2%" width="120.8%" height="125.0%" filterUnits="objectBoundingBox" id="filter-6">
            <feMorphology radius="4" operator="erode" in="SourceAlpha" result="shadowSpreadOuter1"></feMorphology>
            <feOffset dx="0" dy="8" in="shadowSpreadOuter1" result="shadowOffsetOuter1"></feOffset>
            <feGaussianBlur stdDeviation="6" in="shadowOffsetOuter1" result="shadowBlurOuter1"></feGaussianBlur>
            <feComposite in="shadowBlurOuter1" in2="SourceAlpha" operator="out" result="shadowBlurOuter1"></feComposite>
            <feColorMatrix values="0 0 0 0 0   0 0 0 0 0   0 0 0 0 0  0 0 0 0.12 0" type="matrix" in="shadowBlurOuter1"></feColorMatrix>
        </filter>
    </defs>
    <g id="Other_insurance" stroke="none" stroke-width="1" fill="none" fill-rule="evenodd">
        <g id="Group-Cancer_PQ-Gender" transform="translate(-542.000000, -313.000000)">
            <rect fill="#FAFAFC" x="0" y="0" width="1440" height="800"></rect>
            <g id="Rename-this-Group" transform="translate(247.000000, 168.000000)">
                <g id="bg">
                    <use fill="black" fill-opacity="1" filter="url(#filter-2)" xlink:href="#path-1"></use>
                    <use fill="#FFFFFF" fill-rule="evenodd" xlink:href="#path-1"></use>
                </g>
                <g id="bg" opacity="0">
                    <use fill="black" fill-opacity="1" filter="url(#filter-4)" xlink:href="#path-3"></use>
                    <use fill="#FFFFFF" fill-rule="evenodd" xlink:href="#path-3"></use>
                </g>
                <g id="Gender" transform="translate(251.000000, 87.000000)">
                    <g id="genderTile-Male" transform="translate(20.000000, 46.000000)">
                        <g id="Rectangle">
                            <use fill="black" fill-opacity="1" filter="url(#filter-6)" xlink:href="#path-5"></use>
                            <rect stroke="#6B7AFE" stroke-width="2" stroke-linejoin="square" fill="#FFFFFF" fill-rule="evenodd" x="1" y="1" width="94" height="94" rx="8"></rect>
                        </g>
                        <g id="ic_member_set_ss1" transform="translate(24.000000, 12.000000)" fill-rule="nonzero">
                            <g id="male.ae02e34e" transform="translate(4.714286, 6.000000)">
                                <circle id="Oval" fill="#F9C19B" cx="33.8571429" cy="21" r="4.71428571"></circle>
                                <circle id="Oval" fill="#F9C19B" cx="4.71428571" cy="21" r="4.71428571"></circle>
                                <path d="M35.1428571,18.4285714 C35.1428571,27.1817143 28.0388571,34.2857143 19.2857143,34.2857143 C10.5325714,34.2857143 3.42857143,27.1817143 3.42857143,18.4285714 C3.42857143,9.67542857 10.5325714,2.57142857 19.2857143,2.57142857 C28.0388571,2.57142857 35.1428571,9.67542857 35.1428571,18.4285714 Z" id="Shape" fill="#FFD5AB"></path>
                                <path d="M31.1129032,23.0361589 C29.8686636,26.3331357 28.6555299,27.1973919 26.5714286,27.805572 C26.1670507,25.8850029 24.4562212,24.764671 21.9055299,24.764671 L15.8087558,24.764671 C13.2580645,24.764671 11.547235,25.8850029 11.1428571,27.805572 C8.90322583,27.7735625 7.28571429,25.1487849 6.60138249,23.1001779 C6.25921659,22.1078838 5.35714286,21.0515709 4.54838709,20.8915234 L3.42857143,20.5714286 C3.42857143,30.5263782 10.2096774,36 18.8571429,36 C27.5046083,36 34.2857143,30.6864256 34.2857143,20.6034381 C34.2857143,20.6034381 33.9435484,20.731476 33.1658986,20.8915234 C32.3571429,21.0195614 31.4550691,22.0438648 31.1129032,23.0361589 Z" id="Shape" fill="#59351C"></path>
                                <path d="M12.8571429,19.7146766 C12.8571429,20.6732957 12.0819876,21.4285714 11.1279503,21.4285714 C10.173913,21.4285714 9.42857143,20.6442467 9.42857143,19.7146766 C9.42857143,18.7851065 10.2037267,18.0007818 11.1279503,18.0007818 C12.0819876,17.9717327 12.8571429,18.7560574 12.8571429,19.7146766 Z" id="Shape" fill="#442106"></path>
                                <path d="M25.7142857,19.7146766 C25.7142857,20.6732957 26.4827586,21.4285714 27.4285714,21.4285714 C28.3743843,21.4285714 29.1428571,20.6442467 29.1428571,19.7146766 C29.1428571,18.7851065 28.3743843,18.0007818 27.4285714,18.0007818 C26.4827586,17.9717327 25.7142857,18.7560574 25.7142857,19.7146766 Z" id="Shape" fill="#442106"></path>
                                <path d="M38.5714286,13.9751553 C38.5714286,12.5465839 37.5931996,11.3664597 36.2363013,11.0248447 C36.6780822,10.621118 36.9620841,10.0310559 36.9620841,9.40993791 C36.9620841,8.16770187 35.9207436,7.17391305 34.6585127,7.17391305 L33.4593933,7.17391305 C33.8696184,6.83229813 34.1536203,6.33540373 34.1536203,5.74534161 C34.1536203,4.68944099 33.3016145,3.85093167 32.2287182,3.85093167 L30.3669276,3.85093167 C27.5584638,1.42857143 23.8033268,0 19.5748533,0 C11.1179061,0 4.74363993,5.55900621 3.41829746,13.6024845 C2.47162426,13.6335404 1.71428571,14.378882 1.71428571,15.310559 C1.71428571,16.2732919 2.50318004,17.0186336 3.48140901,17.0186336 C3.76541096,17.0186336 4.04941292,16.9254658 4.3018591,16.8012423 C5.62720156,16.3664596 8.5934442,14.8447205 13.5161448,9.62732923 C14.4943737,10.5279503 18.6912915,14.1925466 23.0459883,15.5279503 C27.3375734,16.863354 30.87182,17.1428571 33.0807241,17.1428571 C34.4691781,17.1428571 35.3527397,17.0496894 35.6367417,16.9875777 C37.2460861,16.9254658 38.5714286,15.5900621 38.5714286,13.9751553 Z" id="Shape" fill="#59351C"></path>
                                <path d="M23.8412698,27.4285714 L15.5873016,27.4285714 C15.4920635,27.4285714 15.4285714,27.4920635 15.4285714,27.5873016 C15.4285714,29.3968254 17.3650794,30.8571429 19.7142857,30.8571429 C22.063492,30.8571429 24,29.3968254 24,27.5873016 C24,27.4920635 23.9365079,27.4285714 23.8412698,27.4285714 Z" id="Shape" fill="#FFFFFF"></path>
                            </g>
                        </g>
                        <g id="check" transform="translate(68.000000, 4.000000)">
                            <rect id="bg" x="0" y="0" width="16" height="16"></rect>
                            <path d="M8,1.33333333 C10.0474562,1.33333333 11.879337,2.25632186 13.1022589,3.70891565 L12.9233333,3.53 L5.86333333,10.5833333 L3.08333333,7.80333333 L2.13666667,8.74333333 L5.86333333,12.47 L13.7346673,4.59825729 C14.3266857,5.59413579 14.6666667,6.75736449 14.6666667,8 C14.6666667,11.6818983 11.6818983,14.6666667 8,14.6666667 C4.31810167,14.6666667 1.33333333,11.6818983 1.33333333,8 C1.33333333,4.31810167 4.31810167,1.33333333 8,1.33333333 Z" id="shape" fill="#FFFFFF"></path>
                        </g>
                    </g>
                </g>
            </g>
        </g>
    </g>
</svg>