{
    "name": "Main",
    "alias": "ماژول ها",
    "description": "مدیریت تمام ماژول ها",
    "keywords": [],
    "priority": 0,
    "canDisable": false,
    "providers": [
        "Modules\\Main\\Providers\\MainServiceProvider"
    ],
    "aliases": {},
    "files": [],
    "requires": []
}
