{
  "accountSettings": {
    "logOut": "Account log out",
    "logOutLink": "Log out",
    "supplierName": "Supplier name"
  },
  "emailVerification": {
    "accountVerified": "Your account is already verified. Please <0>click here</0> to login.",
    "address": "We sent an email to <0>{{email}}</0>",
    "findEmail": "Still can’t find the email?",
    "resend": "Resend Email",
    "success": "Resend verification email success",
    "successDescription": "Please check your email for your verification link",
    "verifyEmailRequest": "Please verify your email",
    "verifyEmailStep": "Just click on the link in that email to complete your signup."
  },
  "forgotPassword": {
    "backToLoginButton": "Back to login",
    "emailLink": "We've sent an email to {{email}} to reset your password. The link in the email will expire in 24 hours.",
    "requestResetLinkButton": "Reset my password",
    "sendLink": "Please fill in your email and we’ll send you a link to reset your password.",
    "title": "Forgot your password?"
  },
  "login": {
    "forgotPassword": "Forgot Your Password",
    "registerNewAccount": "Don't have an account yet? <0>Sign up here</0>",
    "rememberMe": "Remember me",
    "signIn": "Login",
    "termsAndPolicy": "By clicking this box, you agree to our <0>Terms</0> and <1>Privacy Policy</1>",
    "welcomeBack": "Welcome back!"
  },
  "notification": {
    "accountVerifiedContent": "Your account has been successfully verified.",
    "accountVerifiedTitle": "Account verified.",
    "changeEmailAddress": "Email address changed.",
    "changePassword": "Password changed.",
    "changePhoneNumber": "Phone number changed.",
    "emailUpdatedContent": "Your email has been successfully updated.",
    "emailUpdatedTitle": "Email updated",
    "emailVerified": "The email has already been verified. If you have any questions, please <0>contact us</0>.",
    "passwordResetContent": "Your password has been successfully reset.",
    "passwordResetTitle": "Password reset.",
    "sessionExpired": "Session expired, please login again.",
    "successfulLogout": "Logged out successfully.",
    "successfulUpdate": "Successfully updated."
  },
  "register": {
    "brandName": "Company name",
    "businessWebsite": "Business website <0>(optional)</0>",
    "confirmPassword": "Confirm password",
    "contactName": "Contact name",
    "country": "Country",
    "createPassword": "Create a password",
    "email": "Email",
    "existingAccount": "Already a Trustana member? <0>Log in</0>",
    "howItWorks": "Why Trustana?",
    "objectiveHeader": "Start your export journey with Trustana today",
    "register": "Register",
    "signup": "Sign up",
    "stepOne": "Get Noticed",
    "stepOneSubtitle": "Set up and showcase your product catalogue in our marketplaces at zero cost.",
    "stepThree": "Sell Smarter",
    "stepThreeSubtitle": "Accept orders 24/7 and fulfil them in under a minute with automated workflows.",
    "stepTwo": "Go Global",
    "stepTwoSubtitle": "Scale your business, get real-time analytics and connect with new buyers across the Asia-Pacific in one place.",
    "termsAndPolicy": "By signing up, you agree to our <0>Terms & Conditions</0> and <1>Privacy Policy</1>."
  },
  "resetPassword": {
    "firstLoginHeader": "Set your password on first login",
    "header": "Reset your password",
    "resetPasswordButton": "Reset Password"
  },
  "updateEmail": {
    "confirmEmailAddress": "Confirm email address",
    "emailVerify": "Please verify your email",
    "emailVerifyLink": "We’ve sent an email to {{email}} to verify your email address. The link in the email will expire in 24 hours.",
    "instructions": "If you edit your email, you will need to verify this new address.",
    "newEmailAddress": "New email address"
  },
  "updatePassword": {
    "confirmPassword": "Confirm new password",
    "currentPassword": "Current password",
    "newPassword": "Enter new password",
    "updatePasswordButton": "Update password"
  }
}