[
  {
    "title": "داشبورد",
    "icon": "nb-home",
    "link": "/pages/dashboard",
    "home": true
  },
  {
    "title": "مدیریت",
    "group": true
  },
  {
    "title": "کاربران",
    "icon": "nb-keypad",
    "link": "/pages/users",
    "children": [
      {
        "title": "لیست کاربران",
        "link": "/pages/users/list"
      }
    ]
  },
  {
    "title": "دیدگاه ها",
    "icon": "nb-gear",
    "children": [
      {
        "title": "لیست دیدگاه ها",
        "link": "/pages/reviews/list"
      }
    ]
  },
  {
    "title": "تخفیف ها",
    "icon": "nb-heart",
    "children": [
      {
        "title": "لیست تخفیف ها",
        "link": "/pages/crud/list/discounts"
      },
      {
        "title": "افزودن تخفیف جدید",
        "link": "/pages/crud/add/discounts"
      }
    ]
  }
]
