[
    {
        "id" : 0,
        "key": 0,
        "name": "Appetizers",
        "image": "../assets/categories/cat1.png"
    },
    {   
        "id" : 1,
        "key": 1,
        "name": "Pizzas & Pasta",
        "image": "../assets/categories/cat2.png"
    },
    {
        "id" : 2,
        "key": 2,
        "name": "avatar",
        "image": "../assets/categories/cat3.png"
    },
    {
        "id" : 3,
        "key" : 3,
        "name": "Salads",
        "image": "../assets/categories/cat4.png"
    },
    {
        "id" : 4,
        "key" : 4,
        "name": "APPETIZERS",
        "image": "../assets/categories/cat5.png"
    },
    {
        "id" : 5,
        "key" : 5,
        "name": "SALADS",
        "image": "../assets/categories/cat6.png"
    },
    {
        "id" : 6,
        "key" : 6,
        "name": "SALADS",
        "image": "../assets/categories/cat6.png"
    },
    {
        "id" : 7,
        "key" : 7,
        "name": "SALADS",
        "image": "../assets/categories/cat6.png"
    },
    {
        "id" : 8,
        "key" : 8,
        "name": "SALADS",
        "image": "../assets/categories/cat6.png"
    },
    {
        "id" : 9,
        "key" : 9,
        "name": "SALADS",
        "image": "../assets/categories/cat6.png"
    },
    {
        "id" : 10,
        "key" : 10,
        "name": "SALADS",
        "image": "../assets/categories/cat6.png"
    },
    {
        "id" : 11,
        "key" : 11,
        "name": "SALADS",
        "image": "../assets/categories/cat6.png"
    },
    {
        "id" : 12,
        "key" : 12,
        "name": "SALADS",
        "image": "../assets/categories/cat6.png"
    },
    {
        "id" : 13,
        "key" : 13,
        "name": "SALADS",
        "image": "../assets/categories/cat6.png"
    },
    {
        "id" : 14,
        "key" : 14,
        "name": "SALADS",
        "image": "../assets/categories/cat6.png"
    },
    {
        "id" : 15,
        "key" : 15,
        "name": "SALADS",
        "image": "../assets/categories/cat6.png"
    },
    {
        "id" : 16,
        "key" : 16,
        "name": "SALADS",
        "image": "../assets/categories/cat6.png"
    },
    {
        "id" : 17,
        "key" : 17,
        "name": "SALADS",
        "image": "../assets/categories/cat6.png"
    }
]