{
  "version": 2,
  "builds": [
    {
      "src": "app.js",
      "use": "@vercel/node"
    }
  ],
  "routes": [
    {
      "src": "/auth/(.*)",
      "dest": "app.js"
    },
    {
      "src": "/admin/(.*)",
      "dest": "app.js"
    },
    {
      "src": "/skills/(.*)",
      "dest": "app.js"
    },
    {
      "src": "/editor/(.*)",
      "dest": "app.js"
    },
    {
      "src": "/posts/(.*)",
      "dest": "app.js"
    },
    {
      "src": "/freelancer/(.*)",
      "dest": "app.js"
    },
    {
      "src": "/company/(.*)",
      "dest": "app.js"
    },
    {
      "src": "/agence/(.*)",
      "dest": "app.js"
    },
    {
      "src": "/notification-freelance/(.*)",
      "dest": "app.js"
    },
    {
      "src": "/notification-agence/(.*)",
      "dest": "app.js"
    },
    {
      "src": "/notification-company/(.*)",
      "dest": "app.js"
    },
    {
      "src": "/notification-admin/(.*)",
      "dest": "app.js"
    },
    {
      "src": "/notification-posts/(.*)",
      "dest": "app.js"
    },
    {
      "src": "/jobs/(.*)",
      "dest": "app.js"
    },
    {
      "src": "/subscriptions/(.*)",
      "dest": "app.js"
    },
    {
      "src": "/api/(.*)",
      "dest": "app.js"
    },
    {
      "src": "/missions/(.*)",
      "dest": "app.js"
    },
    {
      "src": "/demands/(.*)",
      "dest": "app.js"
    },
    {
      "src": "/profil-entreprise/(.*)",
      "dest": "app.js"
    },
    {
      "src": "/profil-entreprise-agence/(.*)",
      "dest": "app.js"
    },
    {
      "src": "/profil-entreprise-company/(.*)",
      "dest": "app.js"
    },
    {
      "src": "/logs/(.*)",
      "dest": "app.js"
    }
  ]
}
