{
  "version": 2,
  "builds": [
    {
      "src": "app.js",
      "use": "@vercel/node"
    }
  ],
  "routes": [
    {
      "src": "/freelancer/(.*)",
      "dest": "app.js"
    },
    {
      "src": "/certification/(.*)",
      "dest": "app.js"
    },
    {
      "src": "/formation/(.*)",
      "dest": "app.js"
    },
    {
      "src": "/experience/(.*)",
      "dest": "app.js"
    },
    {
      "src": "/notification/(.*)",
      "dest": "app.js"
    },
    {
      "src": "/missions/(.*)",
      "dest": "app.js"
    }
  ]
}
