{
  "version": 2,
  "env": {
    "URL_FREELANCER": "http://localhost:8001",
    "URL_AGENCE": "http://localhost:8002",
    "URL_COMPANY": "http://localhost:8003",
    "EMAIL_SEND": "greenpositiv.test.dev@gmail.com",
    "EMAIL_PASSWORD": "822061894E83BC0B0CD109C926CB3385EC9C"
  },
  "build": {
    "env": {
      "URL_FREELANCER": "http://localhost:8001",
      "URL_AGENCE": "http://localhost:8002",
      "URL_COMPANY": "http://localhost:8003",
      "EMAIL_SEND": "greenpositiv.test.dev@gmail.com",
      "EMAIL_PASSWORD": "822061894E83BC0B0CD109C926CB3385EC9C"
    }
  },
  "builds": [
    {
      "src": "app.js",
      "use": "@vercel/node"
    }
  ],
  "routes": [
    {
      "src": "/email/(.*)",
      "dest": "app.js"
    }
  ]
}
