%YAML 1.1
%TAG !u! tag:unity3d.com,2011:
--- !u!114 &11400000
MonoBehaviour:
  m_ObjectHideFlags: 0
  m_CorrespondingSourceObject: {fileID: 0}
  m_PrefabInstance: {fileID: 0}
  m_PrefabAsset: {fileID: 0}
  m_GameObject: {fileID: 0}
  m_Enabled: 1
  m_EditorHideFlags: 0
  m_Script: {fileID: 11500000, guid: 016892d5abfd85845be82ee6c7e67dcf, type: 3}
  m_Name: Selenium
  m_EditorClassIdentifier: 
  symbol: Se
  fullName: Selenium
  color: {r: 1, g: 0.6313726, b: 0, a: 0}
  _maxLinks: 2
