%YAML 1.1
%TAG !u! tag:unity3d.com,2011:
--- !u!1001 &3553834912564932945
PrefabInstance:
  m_ObjectHideFlags: 0
  serializedVersion: 2
  m_Modification:
    serializedVersion: 3
    m_TransformParent: {fileID: 0}
    m_Modifications:
    - target: {fileID: 6302945559976706862, guid: a18195f6d94864847840b7ec6676ce91, type: 3}
      propertyPath: m_LocalPosition.x
      value: 7.55
      objectReference: {fileID: 0}
    - target: {fileID: 6302945559976706862, guid: a18195f6d94864847840b7ec6676ce91, type: 3}
      propertyPath: m_LocalPosition.y
      value: 10.32
      objectReference: {fileID: 0}
    - target: {fileID: 6302945559976706862, guid: a18195f6d94864847840b7ec6676ce91, type: 3}
      propertyPath: m_LocalPosition.z
      value: -10.2
      objectReference: {fileID: 0}
    - target: {fileID: 6302945559976706862, guid: a18195f6d94864847840b7ec6676ce91, type: 3}
      propertyPath: m_LocalRotation.w
      value: 0.7071067
      objectReference: {fileID: 0}
    - target: {fileID: 6302945559976706862, guid: a18195f6d94864847840b7ec6676ce91, type: 3}
      propertyPath: m_LocalRotation.x
      value: -0.7071068
      objectReference: {fileID: 0}
    - target: {fileID: 6302945559976706862, guid: a18195f6d94864847840b7ec6676ce91, type: 3}
      propertyPath: m_LocalRotation.y
      value: 0
      objectReference: {fileID: 0}
    - target: {fileID: 6302945559976706862, guid: a18195f6d94864847840b7ec6676ce91, type: 3}
      propertyPath: m_LocalRotation.z
      value: -0
      objectReference: {fileID: 0}
    - target: {fileID: 6302945559976706862, guid: a18195f6d94864847840b7ec6676ce91, type: 3}
      propertyPath: m_LocalEulerAnglesHint.x
      value: 0
      objectReference: {fileID: 0}
    - target: {fileID: 6302945559976706862, guid: a18195f6d94864847840b7ec6676ce91, type: 3}
      propertyPath: m_LocalEulerAnglesHint.y
      value: 0
      objectReference: {fileID: 0}
    - target: {fileID: 6302945559976706862, guid: a18195f6d94864847840b7ec6676ce91, type: 3}
      propertyPath: m_LocalEulerAnglesHint.z
      value: 0
      objectReference: {fileID: 0}
    - target: {fileID: 6575637411652568959, guid: a18195f6d94864847840b7ec6676ce91, type: 3}
      propertyPath: m_Name
      value: cupborad Variant
      objectReference: {fileID: 0}
    m_RemovedComponents: []
    m_RemovedGameObjects: []
    m_AddedGameObjects: []
    m_AddedComponents:
    - targetCorrespondingSourceObject: {fileID: 7586850515125628102, guid: a18195f6d94864847840b7ec6676ce91, type: 3}
      insertIndex: -1
      addedObject: {fileID: 649317560012894629}
    - targetCorrespondingSourceObject: {fileID: 7586850515125628102, guid: a18195f6d94864847840b7ec6676ce91, type: 3}
      insertIndex: -1
      addedObject: {fileID: 2741239915657227922}
    - targetCorrespondingSourceObject: {fileID: 8070618630245577352, guid: a18195f6d94864847840b7ec6676ce91, type: 3}
      insertIndex: -1
      addedObject: {fileID: 8194579595572829011}
    - targetCorrespondingSourceObject: {fileID: 8070618630245577352, guid: a18195f6d94864847840b7ec6676ce91, type: 3}
      insertIndex: -1
      addedObject: {fileID: 1466824465081165950}
  m_SourcePrefab: {fileID: 100100000, guid: a18195f6d94864847840b7ec6676ce91, type: 3}
--- !u!114 &88932032582104012 stripped
MonoBehaviour:
  m_CorrespondingSourceObject: {fileID: 3488654944702415517, guid: a18195f6d94864847840b7ec6676ce91, type: 3}
  m_PrefabInstance: {fileID: 3553834912564932945}
  m_PrefabAsset: {fileID: 0}
  m_GameObject: {fileID: 4706643022970848217}
  m_Enabled: 1
  m_EditorHideFlags: 0
  m_Script: {fileID: 11500000, guid: 519b88e747e74cd4a82989be36c895d4, type: 3}
  m_Name: 
  m_EditorClassIdentifier: 
--- !u!114 &4327279432925096794 stripped
MonoBehaviour:
  m_CorrespondingSourceObject: {fileID: 962740840261409291, guid: a18195f6d94864847840b7ec6676ce91, type: 3}
  m_PrefabInstance: {fileID: 3553834912564932945}
  m_PrefabAsset: {fileID: 0}
  m_GameObject: {fileID: 6347870260676074903}
  m_Enabled: 1
  m_EditorHideFlags: 0
  m_Script: {fileID: 11500000, guid: 519b88e747e74cd4a82989be36c895d4, type: 3}
  m_Name: 
  m_EditorClassIdentifier: 
--- !u!1 &4706643022970848217 stripped
GameObject:
  m_CorrespondingSourceObject: {fileID: 8070618630245577352, guid: a18195f6d94864847840b7ec6676ce91, type: 3}
  m_PrefabInstance: {fileID: 3553834912564932945}
  m_PrefabAsset: {fileID: 0}
--- !u!65 &8194579595572829011
BoxCollider:
  m_ObjectHideFlags: 0
  m_CorrespondingSourceObject: {fileID: 0}
  m_PrefabInstance: {fileID: 0}
  m_PrefabAsset: {fileID: 0}
  m_GameObject: {fileID: 4706643022970848217}
  m_Material: {fileID: 0}
  m_IncludeLayers:
    serializedVersion: 2
    m_Bits: 0
  m_ExcludeLayers:
    serializedVersion: 2
    m_Bits: 0
  m_LayerOverridePriority: 0
  m_IsTrigger: 0
  m_ProvidesContacts: 0
  m_Enabled: 1
  serializedVersion: 3
  m_Size: {x: 0.00009877143, y: 0.015842099, z: 0.021962976}
  m_Center: {x: 0.00019426792, y: -0.0000000023841857, z: -0.0000000071525577}
--- !u!114 &1466824465081165950
MonoBehaviour:
  m_ObjectHideFlags: 0
  m_CorrespondingSourceObject: {fileID: 0}
  m_PrefabInstance: {fileID: 0}
  m_PrefabAsset: {fileID: 0}
  m_GameObject: {fileID: 4706643022970848217}
  m_Enabled: 1
  m_EditorHideFlags: 0
  m_Script: {fileID: 11500000, guid: 8a35f6cfbfba9b548aaa00d52cfe8a50, type: 3}
  m_Name: 
  m_EditorClassIdentifier: 
  m_InteractionManager: {fileID: 0}
  m_Colliders: []
  m_InteractionLayerMask:
    serializedVersion: 2
    m_Bits: 4294967295
  m_InteractionLayers:
    m_Bits: 1
  m_DistanceCalculationMode: 1
  m_SelectMode: 0
  m_FocusMode: 1
  m_CustomReticle: {fileID: 0}
  m_AllowGazeInteraction: 0
  m_AllowGazeSelect: 0
  m_OverrideGazeTimeToSelect: 0
  m_GazeTimeToSelect: 0.5
  m_OverrideTimeToAutoDeselectGaze: 0
  m_TimeToAutoDeselectGaze: 3
  m_AllowGazeAssistance: 0
  m_FirstHoverEntered:
    m_PersistentCalls:
      m_Calls: []
  m_LastHoverExited:
    m_PersistentCalls:
      m_Calls: []
  m_HoverEntered:
    m_PersistentCalls:
      m_Calls: []
  m_HoverExited:
    m_PersistentCalls:
      m_Calls: []
  m_FirstSelectEntered:
    m_PersistentCalls:
      m_Calls: []
  m_LastSelectExited:
    m_PersistentCalls:
      m_Calls: []
  m_SelectEntered:
    m_PersistentCalls:
      m_Calls:
      - m_Target: {fileID: 88932032582104012}
        m_TargetAssemblyTypeName: OpenCupborad, Assembly-CSharp
        m_MethodName: changeStateDoor
        m_Mode: 1
        m_Arguments:
          m_ObjectArgument: {fileID: 0}
          m_ObjectArgumentAssemblyTypeName: UnityEngine.Object, UnityEngine
          m_IntArgument: 0
          m_FloatArgument: 0
          m_StringArgument: 
          m_BoolArgument: 0
        m_CallState: 2
  m_SelectExited:
    m_PersistentCalls:
      m_Calls: []
  m_FirstFocusEntered:
    m_PersistentCalls:
      m_Calls: []
  m_LastFocusExited:
    m_PersistentCalls:
      m_Calls: []
  m_FocusEntered:
    m_PersistentCalls:
      m_Calls: []
  m_FocusExited:
    m_PersistentCalls:
      m_Calls: []
  m_Activated:
    m_PersistentCalls:
      m_Calls: []
  m_Deactivated:
    m_PersistentCalls:
      m_Calls: []
  m_StartingHoverFilters: []
  m_StartingSelectFilters: []
  m_StartingInteractionStrengthFilters: []
  m_OnFirstHoverEntered:
    m_PersistentCalls:
      m_Calls: []
  m_OnLastHoverExited:
    m_PersistentCalls:
      m_Calls: []
  m_OnHoverEntered:
    m_PersistentCalls:
      m_Calls: []
  m_OnHoverExited:
    m_PersistentCalls:
      m_Calls: []
  m_OnSelectEntered:
    m_PersistentCalls:
      m_Calls: []
  m_OnSelectExited:
    m_PersistentCalls:
      m_Calls: []
  m_OnSelectCanceled:
    m_PersistentCalls:
      m_Calls: []
  m_OnActivate:
    m_PersistentCalls:
      m_Calls: []
  m_OnDeactivate:
    m_PersistentCalls:
      m_Calls: []
--- !u!1 &6347870260676074903 stripped
GameObject:
  m_CorrespondingSourceObject: {fileID: 7586850515125628102, guid: a18195f6d94864847840b7ec6676ce91, type: 3}
  m_PrefabInstance: {fileID: 3553834912564932945}
  m_PrefabAsset: {fileID: 0}
--- !u!65 &649317560012894629
BoxCollider:
  m_ObjectHideFlags: 0
  m_CorrespondingSourceObject: {fileID: 0}
  m_PrefabInstance: {fileID: 0}
  m_PrefabAsset: {fileID: 0}
  m_GameObject: {fileID: 6347870260676074903}
  m_Material: {fileID: 0}
  m_IncludeLayers:
    serializedVersion: 2
    m_Bits: 0
  m_ExcludeLayers:
    serializedVersion: 2
    m_Bits: 0
  m_LayerOverridePriority: 0
  m_IsTrigger: 0
  m_ProvidesContacts: 0
  m_Enabled: 1
  serializedVersion: 3
  m_Size: {x: 0.00017075415, y: 0.015842099, z: 0.02070004}
  m_Center: {x: -0.00009950099, y: 0.00000000834465, z: 0.0006314635}
--- !u!114 &2741239915657227922
MonoBehaviour:
  m_ObjectHideFlags: 0
  m_CorrespondingSourceObject: {fileID: 0}
  m_PrefabInstance: {fileID: 0}
  m_PrefabAsset: {fileID: 0}
  m_GameObject: {fileID: 6347870260676074903}
  m_Enabled: 1
  m_EditorHideFlags: 0
  m_Script: {fileID: 11500000, guid: 8a35f6cfbfba9b548aaa00d52cfe8a50, type: 3}
  m_Name: 
  m_EditorClassIdentifier: 
  m_InteractionManager: {fileID: 0}
  m_Colliders: []
  m_InteractionLayerMask:
    serializedVersion: 2
    m_Bits: 4294967295
  m_InteractionLayers:
    m_Bits: 1
  m_DistanceCalculationMode: 1
  m_SelectMode: 0
  m_FocusMode: 1
  m_CustomReticle: {fileID: 0}
  m_AllowGazeInteraction: 0
  m_AllowGazeSelect: 0
  m_OverrideGazeTimeToSelect: 0
  m_GazeTimeToSelect: 0.5
  m_OverrideTimeToAutoDeselectGaze: 0
  m_TimeToAutoDeselectGaze: 3
  m_AllowGazeAssistance: 0
  m_FirstHoverEntered:
    m_PersistentCalls:
      m_Calls: []
  m_LastHoverExited:
    m_PersistentCalls:
      m_Calls: []
  m_HoverEntered:
    m_PersistentCalls:
      m_Calls: []
  m_HoverExited:
    m_PersistentCalls:
      m_Calls: []
  m_FirstSelectEntered:
    m_PersistentCalls:
      m_Calls:
      - m_Target: {fileID: 4327279432925096794}
        m_TargetAssemblyTypeName: OpenCupborad, Assembly-CSharp
        m_MethodName: changeStateDoor
        m_Mode: 1
        m_Arguments:
          m_ObjectArgument: {fileID: 0}
          m_ObjectArgumentAssemblyTypeName: UnityEngine.Object, UnityEngine
          m_IntArgument: 0
          m_FloatArgument: 0
          m_StringArgument: 
          m_BoolArgument: 0
        m_CallState: 2
  m_LastSelectExited:
    m_PersistentCalls:
      m_Calls: []
  m_SelectEntered:
    m_PersistentCalls:
      m_Calls: []
  m_SelectExited:
    m_PersistentCalls:
      m_Calls: []
  m_FirstFocusEntered:
    m_PersistentCalls:
      m_Calls: []
  m_LastFocusExited:
    m_PersistentCalls:
      m_Calls: []
  m_FocusEntered:
    m_PersistentCalls:
      m_Calls: []
  m_FocusExited:
    m_PersistentCalls:
      m_Calls: []
  m_Activated:
    m_PersistentCalls:
      m_Calls: []
  m_Deactivated:
    m_PersistentCalls:
      m_Calls: []
  m_StartingHoverFilters: []
  m_StartingSelectFilters: []
  m_StartingInteractionStrengthFilters: []
  m_OnFirstHoverEntered:
    m_PersistentCalls:
      m_Calls: []
  m_OnLastHoverExited:
    m_PersistentCalls:
      m_Calls: []
  m_OnHoverEntered:
    m_PersistentCalls:
      m_Calls: []
  m_OnHoverExited:
    m_PersistentCalls:
      m_Calls: []
  m_OnSelectEntered:
    m_PersistentCalls:
      m_Calls: []
  m_OnSelectExited:
    m_PersistentCalls:
      m_Calls: []
  m_OnSelectCanceled:
    m_PersistentCalls:
      m_Calls: []
  m_OnActivate:
    m_PersistentCalls:
      m_Calls: []
  m_OnDeactivate:
    m_PersistentCalls:
      m_Calls: []
