%YAML 1.1
%TAG !u! tag:unity3d.com,2011:
--- !u!114 &11400000
MonoBehaviour:
  m_ObjectHideFlags: 0
  m_CorrespondingSourceObject: {fileID: 0}
  m_PrefabInstance: {fileID: 0}
  m_PrefabAsset: {fileID: 0}
  m_GameObject: {fileID: 0}
  m_Enabled: 1
  m_EditorHideFlags: 0
  m_Script: {fileID: 11500000, guid: 02b5c875f0406fc4b9f9777508fed52c, type: 3}
  m_Name: Ozone
  m_EditorClassIdentifier: 
  Symbol: O3
  atoms:
  - atom: {fileID: 11400000, guid: bf329d44f6a8ee5489476f925fd24ba1, type: 2}
    count: 3
