%YAML 1.1
%TAG !u! tag:unity3d.com,2011:
--- !u!1001 &7664785148056378640
PrefabInstance:
  m_ObjectHideFlags: 0
  serializedVersion: 2
  m_Modification:
    serializedVersion: 3
    m_TransformParent: {fileID: 0}
    m_Modifications:
    - target: {fileID: 279420042333933091, guid: b78bfe6dc630e584a8d8b77f340be479, type: 3}
      propertyPath: m_LocalScale.y
      value: 112.08
      objectReference: {fileID: 0}
    - target: {fileID: 279420042333933091, guid: b78bfe6dc630e584a8d8b77f340be479, type: 3}
      propertyPath: m_LocalPosition.x
      value: 0.82578
      objectReference: {fileID: 0}
    - target: {fileID: 279420042333933091, guid: b78bfe6dc630e584a8d8b77f340be479, type: 3}
      propertyPath: m_LocalPosition.y
      value: -0.0061003
      objectReference: {fileID: 0}
    - target: {fileID: 279420042333933091, guid: b78bfe6dc630e584a8d8b77f340be479, type: 3}
      propertyPath: m_LocalPosition.z
      value: -1.1891
      objectReference: {fileID: 0}
    - target: {fileID: 3808209445571988829, guid: b78bfe6dc630e584a8d8b77f340be479, type: 3}
      propertyPath: m_Name
      value: microwve Variant
      objectReference: {fileID: 0}
    - target: {fileID: 7907180546873576286, guid: b78bfe6dc630e584a8d8b77f340be479, type: 3}
      propertyPath: m_LocalScale.x
      value: 87.976654
      objectReference: {fileID: 0}
    - target: {fileID: 7907180546873576286, guid: b78bfe6dc630e584a8d8b77f340be479, type: 3}
      propertyPath: m_LocalScale.y
      value: 50.503
      objectReference: {fileID: 0}
    - target: {fileID: 7907180546873576286, guid: b78bfe6dc630e584a8d8b77f340be479, type: 3}
      propertyPath: m_LocalScale.z
      value: 50.503
      objectReference: {fileID: 0}
    - target: {fileID: 7907180546873576286, guid: b78bfe6dc630e584a8d8b77f340be479, type: 3}
      propertyPath: m_LocalPosition.x
      value: 7.383091
      objectReference: {fileID: 0}
    - target: {fileID: 7907180546873576286, guid: b78bfe6dc630e584a8d8b77f340be479, type: 3}
      propertyPath: m_LocalPosition.y
      value: 12.49
      objectReference: {fileID: 0}
    - target: {fileID: 7907180546873576286, guid: b78bfe6dc630e584a8d8b77f340be479, type: 3}
      propertyPath: m_LocalPosition.z
      value: -1.728014
      objectReference: {fileID: 0}
    - target: {fileID: 7907180546873576286, guid: b78bfe6dc630e584a8d8b77f340be479, type: 3}
      propertyPath: m_LocalRotation.w
      value: 0.49983248
      objectReference: {fileID: 0}
    - target: {fileID: 7907180546873576286, guid: b78bfe6dc630e584a8d8b77f340be479, type: 3}
      propertyPath: m_LocalRotation.x
      value: -0.49983248
      objectReference: {fileID: 0}
    - target: {fileID: 7907180546873576286, guid: b78bfe6dc630e584a8d8b77f340be479, type: 3}
      propertyPath: m_LocalRotation.y
      value: -0.50016755
      objectReference: {fileID: 0}
    - target: {fileID: 7907180546873576286, guid: b78bfe6dc630e584a8d8b77f340be479, type: 3}
      propertyPath: m_LocalRotation.z
      value: -0.5001674
      objectReference: {fileID: 0}
    - target: {fileID: 7907180546873576286, guid: b78bfe6dc630e584a8d8b77f340be479, type: 3}
      propertyPath: m_LocalEulerAnglesHint.x
      value: -90
      objectReference: {fileID: 0}
    - target: {fileID: 7907180546873576286, guid: b78bfe6dc630e584a8d8b77f340be479, type: 3}
      propertyPath: m_LocalEulerAnglesHint.y
      value: 0
      objectReference: {fileID: 0}
    - target: {fileID: 7907180546873576286, guid: b78bfe6dc630e584a8d8b77f340be479, type: 3}
      propertyPath: m_LocalEulerAnglesHint.z
      value: -90.038
      objectReference: {fileID: 0}
    m_RemovedComponents: []
    m_RemovedGameObjects: []
    m_AddedGameObjects: []
    m_AddedComponents:
    - targetCorrespondingSourceObject: {fileID: 6762375440548728791, guid: b78bfe6dc630e584a8d8b77f340be479, type: 3}
      insertIndex: -1
      addedObject: {fileID: 2549747167458101953}
    - targetCorrespondingSourceObject: {fileID: 6762375440548728791, guid: b78bfe6dc630e584a8d8b77f340be479, type: 3}
      insertIndex: -1
      addedObject: {fileID: 1524079465292742556}
    - targetCorrespondingSourceObject: {fileID: 6762375440548728791, guid: b78bfe6dc630e584a8d8b77f340be479, type: 3}
      insertIndex: -1
      addedObject: {fileID: 6144097934488309999}
  m_SourcePrefab: {fileID: 100100000, guid: b78bfe6dc630e584a8d8b77f340be479, type: 3}
--- !u!1 &4000887350722597575 stripped
GameObject:
  m_CorrespondingSourceObject: {fileID: 6762375440548728791, guid: b78bfe6dc630e584a8d8b77f340be479, type: 3}
  m_PrefabInstance: {fileID: 7664785148056378640}
  m_PrefabAsset: {fileID: 0}
--- !u!65 &2549747167458101953
BoxCollider:
  m_ObjectHideFlags: 0
  m_CorrespondingSourceObject: {fileID: 0}
  m_PrefabInstance: {fileID: 0}
  m_PrefabAsset: {fileID: 0}
  m_GameObject: {fileID: 4000887350722597575}
  m_Material: {fileID: 0}
  m_IncludeLayers:
    serializedVersion: 2
    m_Bits: 0
  m_ExcludeLayers:
    serializedVersion: 2
    m_Bits: 0
  m_LayerOverridePriority: 0
  m_IsTrigger: 0
  m_ProvidesContacts: 0
  m_Enabled: 1
  serializedVersion: 3
  m_Size: {x: 0.016639803, y: 0.0009040599, z: 0.016335422}
  m_Center: {x: -0.008344784, y: 0.000590612, z: -0.0017712959}
--- !u!114 &1524079465292742556
MonoBehaviour:
  m_ObjectHideFlags: 0
  m_CorrespondingSourceObject: {fileID: 0}
  m_PrefabInstance: {fileID: 0}
  m_PrefabAsset: {fileID: 0}
  m_GameObject: {fileID: 4000887350722597575}
  m_Enabled: 1
  m_EditorHideFlags: 0
  m_Script: {fileID: 11500000, guid: 8a35f6cfbfba9b548aaa00d52cfe8a50, type: 3}
  m_Name: 
  m_EditorClassIdentifier: 
  m_InteractionManager: {fileID: 0}
  m_Colliders: []
  m_InteractionLayerMask:
    serializedVersion: 2
    m_Bits: 4294967295
  m_InteractionLayers:
    m_Bits: 1
  m_DistanceCalculationMode: 1
  m_SelectMode: 0
  m_FocusMode: 1
  m_CustomReticle: {fileID: 0}
  m_AllowGazeInteraction: 0
  m_AllowGazeSelect: 0
  m_OverrideGazeTimeToSelect: 0
  m_GazeTimeToSelect: 0.5
  m_OverrideTimeToAutoDeselectGaze: 0
  m_TimeToAutoDeselectGaze: 3
  m_AllowGazeAssistance: 0
  m_FirstHoverEntered:
    m_PersistentCalls:
      m_Calls: []
  m_LastHoverExited:
    m_PersistentCalls:
      m_Calls: []
  m_HoverEntered:
    m_PersistentCalls:
      m_Calls: []
  m_HoverExited:
    m_PersistentCalls:
      m_Calls: []
  m_FirstSelectEntered:
    m_PersistentCalls:
      m_Calls:
      - m_Target: {fileID: 5453993334864603558}
        m_TargetAssemblyTypeName: OpenMicrowave, Assembly-CSharp
        m_MethodName: ChangeIsOpen
        m_Mode: 1
        m_Arguments:
          m_ObjectArgument: {fileID: 0}
          m_ObjectArgumentAssemblyTypeName: UnityEngine.Object, UnityEngine
          m_IntArgument: 0
          m_FloatArgument: 0
          m_StringArgument: 
          m_BoolArgument: 0
        m_CallState: 2
  m_LastSelectExited:
    m_PersistentCalls:
      m_Calls: []
  m_SelectEntered:
    m_PersistentCalls:
      m_Calls: []
  m_SelectExited:
    m_PersistentCalls:
      m_Calls: []
  m_FirstFocusEntered:
    m_PersistentCalls:
      m_Calls: []
  m_LastFocusExited:
    m_PersistentCalls:
      m_Calls: []
  m_FocusEntered:
    m_PersistentCalls:
      m_Calls: []
  m_FocusExited:
    m_PersistentCalls:
      m_Calls: []
  m_Activated:
    m_PersistentCalls:
      m_Calls: []
  m_Deactivated:
    m_PersistentCalls:
      m_Calls: []
  m_StartingHoverFilters: []
  m_StartingSelectFilters: []
  m_StartingInteractionStrengthFilters: []
  m_OnFirstHoverEntered:
    m_PersistentCalls:
      m_Calls: []
  m_OnLastHoverExited:
    m_PersistentCalls:
      m_Calls: []
  m_OnHoverEntered:
    m_PersistentCalls:
      m_Calls: []
  m_OnHoverExited:
    m_PersistentCalls:
      m_Calls: []
  m_OnSelectEntered:
    m_PersistentCalls:
      m_Calls: []
  m_OnSelectExited:
    m_PersistentCalls:
      m_Calls: []
  m_OnSelectCanceled:
    m_PersistentCalls:
      m_Calls: []
  m_OnActivate:
    m_PersistentCalls:
      m_Calls: []
  m_OnDeactivate:
    m_PersistentCalls:
      m_Calls: []
--- !u!54 &6144097934488309999
Rigidbody:
  m_ObjectHideFlags: 0
  m_CorrespondingSourceObject: {fileID: 0}
  m_PrefabInstance: {fileID: 0}
  m_PrefabAsset: {fileID: 0}
  m_GameObject: {fileID: 4000887350722597575}
  serializedVersion: 4
  m_Mass: 1
  m_Drag: 0
  m_AngularDrag: 0.05
  m_CenterOfMass: {x: 0, y: 0, z: 0}
  m_InertiaTensor: {x: 1, y: 1, z: 1}
  m_InertiaRotation: {x: 0, y: 0, z: 0, w: 1}
  m_IncludeLayers:
    serializedVersion: 2
    m_Bits: 0
  m_ExcludeLayers:
    serializedVersion: 2
    m_Bits: 0
  m_ImplicitCom: 1
  m_ImplicitTensor: 1
  m_UseGravity: 0
  m_IsKinematic: 0
  m_Interpolate: 0
  m_Constraints: 0
  m_CollisionDetection: 0
--- !u!114 &5453993334864603558 stripped
MonoBehaviour:
  m_CorrespondingSourceObject: {fileID: 2445088949352592566, guid: b78bfe6dc630e584a8d8b77f340be479, type: 3}
  m_PrefabInstance: {fileID: 7664785148056378640}
  m_PrefabAsset: {fileID: 0}
  m_GameObject: {fileID: 0}
  m_Enabled: 1
  m_EditorHideFlags: 0
  m_Script: {fileID: 11500000, guid: 3564009154c72d74a808b1b33a2d1a76, type: 3}
  m_Name: 
  m_EditorClassIdentifier: 
