%YAML 1.1
%TAG !u! tag:unity3d.com,2011:
--- !u!1001 &5429724211003968835
PrefabInstance:
  m_ObjectHideFlags: 0
  serializedVersion: 2
  m_Modification:
    serializedVersion: 3
    m_TransformParent: {fileID: 0}
    m_Modifications:
    - target: {fileID: -8679921383154817045, guid: 383805bcade239c47b6c44ebe4f546a9, type: 3}
      propertyPath: m_LocalScale.x
      value: 6.47457
      objectReference: {fileID: 0}
    - target: {fileID: -8679921383154817045, guid: 383805bcade239c47b6c44ebe4f546a9, type: 3}
      propertyPath: m_LocalScale.y
      value: 6.47457
      objectReference: {fileID: 0}
    - target: {fileID: -8679921383154817045, guid: 383805bcade239c47b6c44ebe4f546a9, type: 3}
      propertyPath: m_LocalScale.z
      value: 6.47457
      objectReference: {fileID: 0}
    - target: {fileID: -8679921383154817045, guid: 383805bcade239c47b6c44ebe4f546a9, type: 3}
      propertyPath: m_LocalPosition.x
      value: -0.117
      objectReference: {fileID: 0}
    - target: {fileID: -8679921383154817045, guid: 383805bcade239c47b6c44ebe4f546a9, type: 3}
      propertyPath: m_LocalPosition.y
      value: 1.099
      objectReference: {fileID: 0}
    - target: {fileID: -8679921383154817045, guid: 383805bcade239c47b6c44ebe4f546a9, type: 3}
      propertyPath: m_LocalPosition.z
      value: 2.0551
      objectReference: {fileID: 0}
    - target: {fileID: -8679921383154817045, guid: 383805bcade239c47b6c44ebe4f546a9, type: 3}
      propertyPath: m_LocalRotation.w
      value: 1
      objectReference: {fileID: 0}
    - target: {fileID: -8679921383154817045, guid: 383805bcade239c47b6c44ebe4f546a9, type: 3}
      propertyPath: m_LocalRotation.x
      value: 0
      objectReference: {fileID: 0}
    - target: {fileID: -8679921383154817045, guid: 383805bcade239c47b6c44ebe4f546a9, type: 3}
      propertyPath: m_LocalRotation.y
      value: -0
      objectReference: {fileID: 0}
    - target: {fileID: -8679921383154817045, guid: 383805bcade239c47b6c44ebe4f546a9, type: 3}
      propertyPath: m_LocalRotation.z
      value: -0
      objectReference: {fileID: 0}
    - target: {fileID: -8679921383154817045, guid: 383805bcade239c47b6c44ebe4f546a9, type: 3}
      propertyPath: m_LocalEulerAnglesHint.x
      value: 0
      objectReference: {fileID: 0}
    - target: {fileID: -8679921383154817045, guid: 383805bcade239c47b6c44ebe4f546a9, type: 3}
      propertyPath: m_LocalEulerAnglesHint.y
      value: 0
      objectReference: {fileID: 0}
    - target: {fileID: -8679921383154817045, guid: 383805bcade239c47b6c44ebe4f546a9, type: 3}
      propertyPath: m_LocalEulerAnglesHint.z
      value: 0
      objectReference: {fileID: 0}
    - target: {fileID: -7511558181221131132, guid: 383805bcade239c47b6c44ebe4f546a9, type: 3}
      propertyPath: m_Materials.Array.data[0]
      value: 
      objectReference: {fileID: 2100000, guid: 14ce8d97bba96e74a9cf79a383a11efe, type: 2}
    - target: {fileID: 919132149155446097, guid: 383805bcade239c47b6c44ebe4f546a9, type: 3}
      propertyPath: m_Name
      value: rock
      objectReference: {fileID: 0}
    - target: {fileID: 919132149155446097, guid: 383805bcade239c47b6c44ebe4f546a9, type: 3}
      propertyPath: m_TagString
      value: Fe
      objectReference: {fileID: 0}
    m_RemovedComponents: []
    m_RemovedGameObjects: []
    m_AddedGameObjects: []
    m_AddedComponents:
    - targetCorrespondingSourceObject: {fileID: 919132149155446097, guid: 383805bcade239c47b6c44ebe4f546a9, type: 3}
      insertIndex: -1
      addedObject: {fileID: 2683773316683437597}
    - targetCorrespondingSourceObject: {fileID: 919132149155446097, guid: 383805bcade239c47b6c44ebe4f546a9, type: 3}
      insertIndex: -1
      addedObject: {fileID: 5452173412355172778}
    - targetCorrespondingSourceObject: {fileID: 919132149155446097, guid: 383805bcade239c47b6c44ebe4f546a9, type: 3}
      insertIndex: -1
      addedObject: {fileID: 4161444060787913736}
    - targetCorrespondingSourceObject: {fileID: 919132149155446097, guid: 383805bcade239c47b6c44ebe4f546a9, type: 3}
      insertIndex: -1
      addedObject: {fileID: 2903462779702615961}
    - targetCorrespondingSourceObject: {fileID: 919132149155446097, guid: 383805bcade239c47b6c44ebe4f546a9, type: 3}
      insertIndex: -1
      addedObject: {fileID: 7502553252068608273}
  m_SourcePrefab: {fileID: 100100000, guid: 383805bcade239c47b6c44ebe4f546a9, type: 3}
--- !u!1 &5159762564748931090 stripped
GameObject:
  m_CorrespondingSourceObject: {fileID: 919132149155446097, guid: 383805bcade239c47b6c44ebe4f546a9, type: 3}
  m_PrefabInstance: {fileID: 5429724211003968835}
  m_PrefabAsset: {fileID: 0}
--- !u!54 &2683773316683437597
Rigidbody:
  m_ObjectHideFlags: 0
  m_CorrespondingSourceObject: {fileID: 0}
  m_PrefabInstance: {fileID: 0}
  m_PrefabAsset: {fileID: 0}
  m_GameObject: {fileID: 5159762564748931090}
  serializedVersion: 4
  m_Mass: 1
  m_Drag: 0
  m_AngularDrag: 0.05
  m_CenterOfMass: {x: 0, y: 0, z: 0}
  m_InertiaTensor: {x: 1, y: 1, z: 1}
  m_InertiaRotation: {x: 0, y: 0, z: 0, w: 1}
  m_IncludeLayers:
    serializedVersion: 2
    m_Bits: 0
  m_ExcludeLayers:
    serializedVersion: 2
    m_Bits: 0
  m_ImplicitCom: 1
  m_ImplicitTensor: 1
  m_UseGravity: 1
  m_IsKinematic: 0
  m_Interpolate: 0
  m_Constraints: 0
  m_CollisionDetection: 0
--- !u!64 &5452173412355172778
MeshCollider:
  m_ObjectHideFlags: 0
  m_CorrespondingSourceObject: {fileID: 0}
  m_PrefabInstance: {fileID: 0}
  m_PrefabAsset: {fileID: 0}
  m_GameObject: {fileID: 5159762564748931090}
  m_Material: {fileID: 0}
  m_IncludeLayers:
    serializedVersion: 2
    m_Bits: 0
  m_ExcludeLayers:
    serializedVersion: 2
    m_Bits: 0
  m_LayerOverridePriority: 0
  m_IsTrigger: 0
  m_ProvidesContacts: 0
  m_Enabled: 1
  serializedVersion: 5
  m_Convex: 1
  m_CookingOptions: 30
  m_Mesh: {fileID: 4068373912626513877, guid: 383805bcade239c47b6c44ebe4f546a9, type: 3}
--- !u!114 &4161444060787913736
MonoBehaviour:
  m_ObjectHideFlags: 0
  m_CorrespondingSourceObject: {fileID: 0}
  m_PrefabInstance: {fileID: 0}
  m_PrefabAsset: {fileID: 0}
  m_GameObject: {fileID: 5159762564748931090}
  m_Enabled: 1
  m_EditorHideFlags: 0
  m_Script: {fileID: 11500000, guid: 0ad34abafad169848a38072baa96cdb2, type: 3}
  m_Name: 
  m_EditorClassIdentifier: 
  m_InteractionManager: {fileID: 0}
  m_Colliders: []
  m_InteractionLayerMask:
    serializedVersion: 2
    m_Bits: 4294967295
  m_InteractionLayers:
    m_Bits: 1
  m_DistanceCalculationMode: 1
  m_SelectMode: 0
  m_FocusMode: 1
  m_CustomReticle: {fileID: 0}
  m_AllowGazeInteraction: 0
  m_AllowGazeSelect: 0
  m_OverrideGazeTimeToSelect: 0
  m_GazeTimeToSelect: 0.5
  m_OverrideTimeToAutoDeselectGaze: 0
  m_TimeToAutoDeselectGaze: 3
  m_AllowGazeAssistance: 0
  m_FirstHoverEntered:
    m_PersistentCalls:
      m_Calls: []
  m_LastHoverExited:
    m_PersistentCalls:
      m_Calls: []
  m_HoverEntered:
    m_PersistentCalls:
      m_Calls: []
  m_HoverExited:
    m_PersistentCalls:
      m_Calls: []
  m_FirstSelectEntered:
    m_PersistentCalls:
      m_Calls: []
  m_LastSelectExited:
    m_PersistentCalls:
      m_Calls: []
  m_SelectEntered:
    m_PersistentCalls:
      m_Calls: []
  m_SelectExited:
    m_PersistentCalls:
      m_Calls: []
  m_FirstFocusEntered:
    m_PersistentCalls:
      m_Calls: []
  m_LastFocusExited:
    m_PersistentCalls:
      m_Calls: []
  m_FocusEntered:
    m_PersistentCalls:
      m_Calls: []
  m_FocusExited:
    m_PersistentCalls:
      m_Calls: []
  m_Activated:
    m_PersistentCalls:
      m_Calls: []
  m_Deactivated:
    m_PersistentCalls:
      m_Calls: []
  m_StartingHoverFilters: []
  m_StartingSelectFilters: []
  m_StartingInteractionStrengthFilters: []
  m_OnFirstHoverEntered:
    m_PersistentCalls:
      m_Calls: []
  m_OnLastHoverExited:
    m_PersistentCalls:
      m_Calls: []
  m_OnHoverEntered:
    m_PersistentCalls:
      m_Calls: []
  m_OnHoverExited:
    m_PersistentCalls:
      m_Calls: []
  m_OnSelectEntered:
    m_PersistentCalls:
      m_Calls: []
  m_OnSelectExited:
    m_PersistentCalls:
      m_Calls: []
  m_OnSelectCanceled:
    m_PersistentCalls:
      m_Calls: []
  m_OnActivate:
    m_PersistentCalls:
      m_Calls: []
  m_OnDeactivate:
    m_PersistentCalls:
      m_Calls: []
  m_AttachTransform: {fileID: 0}
  m_SecondaryAttachTransform: {fileID: 0}
  m_UseDynamicAttach: 0
  m_MatchAttachPosition: 1
  m_MatchAttachRotation: 1
  m_SnapToColliderVolume: 1
  m_ReinitializeDynamicAttachEverySingleGrab: 1
  m_AttachEaseInTime: 0.15
  m_MovementType: 2
  m_VelocityDamping: 1
  m_VelocityScale: 1
  m_AngularVelocityDamping: 1
  m_AngularVelocityScale: 1
  m_TrackPosition: 1
  m_SmoothPosition: 0
  m_SmoothPositionAmount: 8
  m_TightenPosition: 0.1
  m_TrackRotation: 1
  m_SmoothRotation: 0
  m_SmoothRotationAmount: 8
  m_TightenRotation: 0.1
  m_TrackScale: 1
  m_SmoothScale: 0
  m_SmoothScaleAmount: 8
  m_TightenScale: 0.1
  m_ThrowOnDetach: 1
  m_ThrowSmoothingDuration: 0.25
  m_ThrowSmoothingCurve:
    serializedVersion: 2
    m_Curve:
    - serializedVersion: 3
      time: 1
      value: 1
      inSlope: 0
      outSlope: 0
      tangentMode: 0
      weightedMode: 0
      inWeight: 0
      outWeight: 0
    m_PreInfinity: 2
    m_PostInfinity: 2
    m_RotationOrder: 4
  m_ThrowVelocityScale: 1.5
  m_ThrowAngularVelocityScale: 1
  m_ForceGravityOnDetach: 0
  m_RetainTransformParent: 1
  m_AttachPointCompatibilityMode: 0
  m_StartingSingleGrabTransformers: []
  m_StartingMultipleGrabTransformers: []
  m_AddDefaultGrabTransformers: 1
--- !u!114 &2903462779702615961
MonoBehaviour:
  m_ObjectHideFlags: 0
  m_CorrespondingSourceObject: {fileID: 0}
  m_PrefabInstance: {fileID: 0}
  m_PrefabAsset: {fileID: 0}
  m_GameObject: {fileID: 5159762564748931090}
  m_Enabled: 1
  m_EditorHideFlags: 0
  m_Script: {fileID: 11500000, guid: 3d1e14ba0263b9841a819caa2b6caafa, type: 3}
  m_Name: 
  m_EditorClassIdentifier: 
--- !u!114 &7502553252068608273
MonoBehaviour:
  m_ObjectHideFlags: 0
  m_CorrespondingSourceObject: {fileID: 0}
  m_PrefabInstance: {fileID: 0}
  m_PrefabAsset: {fileID: 0}
  m_GameObject: {fileID: 5159762564748931090}
  m_Enabled: 1
  m_EditorHideFlags: 0
  m_Script: {fileID: 11500000, guid: 567f6ca5579ca3d4ebd4ebbe48e3ebc8, type: 3}
  m_Name: 
  m_EditorClassIdentifier: 
  smokePuff: {fileID: 0}
