%YAML 1.1
%TAG !u! tag:unity3d.com,2011:
--- !u!1001 &3720778359030298245
PrefabInstance:
  m_ObjectHideFlags: 0
  serializedVersion: 2
  m_Modification:
    serializedVersion: 3
    m_TransformParent: {fileID: 0}
    m_Modifications:
    - target: {fileID: -8679921383154817045, guid: a6b456dbf522ba4428334fc5d5cde928,
        type: 3}
      propertyPath: m_LocalScale.x
      value: 1.7160945
      objectReference: {fileID: 0}
    - target: {fileID: -8679921383154817045, guid: a6b456dbf522ba4428334fc5d5cde928,
        type: 3}
      propertyPath: m_LocalScale.y
      value: 1.074426
      objectReference: {fileID: 0}
    - target: {fileID: -8679921383154817045, guid: a6b456dbf522ba4428334fc5d5cde928,
        type: 3}
      propertyPath: m_LocalScale.z
      value: 1.7077572
      objectReference: {fileID: 0}
    - target: {fileID: -8679921383154817045, guid: a6b456dbf522ba4428334fc5d5cde928,
        type: 3}
      propertyPath: m_LocalPosition.x
      value: -0.0018619974
      objectReference: {fileID: 0}
    - target: {fileID: -8679921383154817045, guid: a6b456dbf522ba4428334fc5d5cde928,
        type: 3}
      propertyPath: m_LocalPosition.y
      value: -0.11547118
      objectReference: {fileID: 0}
    - target: {fileID: -8679921383154817045, guid: a6b456dbf522ba4428334fc5d5cde928,
        type: 3}
      propertyPath: m_LocalPosition.z
      value: -0.032675933
      objectReference: {fileID: 0}
    - target: {fileID: -8679921383154817045, guid: a6b456dbf522ba4428334fc5d5cde928,
        type: 3}
      propertyPath: m_LocalRotation.w
      value: 0.995681
      objectReference: {fileID: 0}
    - target: {fileID: -8679921383154817045, guid: a6b456dbf522ba4428334fc5d5cde928,
        type: 3}
      propertyPath: m_LocalRotation.x
      value: 0.007933207
      objectReference: {fileID: 0}
    - target: {fileID: -8679921383154817045, guid: a6b456dbf522ba4428334fc5d5cde928,
        type: 3}
      propertyPath: m_LocalRotation.y
      value: -0.09249802
      objectReference: {fileID: 0}
    - target: {fileID: -8679921383154817045, guid: a6b456dbf522ba4428334fc5d5cde928,
        type: 3}
      propertyPath: m_LocalRotation.z
      value: -0.0007369888
      objectReference: {fileID: 0}
    - target: {fileID: -8679921383154817045, guid: a6b456dbf522ba4428334fc5d5cde928,
        type: 3}
      propertyPath: m_LocalEulerAnglesHint.x
      value: 0
      objectReference: {fileID: 0}
    - target: {fileID: -8679921383154817045, guid: a6b456dbf522ba4428334fc5d5cde928,
        type: 3}
      propertyPath: m_LocalEulerAnglesHint.y
      value: 0
      objectReference: {fileID: 0}
    - target: {fileID: -8679921383154817045, guid: a6b456dbf522ba4428334fc5d5cde928,
        type: 3}
      propertyPath: m_LocalEulerAnglesHint.z
      value: 0
      objectReference: {fileID: 0}
    - target: {fileID: 919132149155446097, guid: a6b456dbf522ba4428334fc5d5cde928,
        type: 3}
      propertyPath: m_Name
      value: Body_6
      objectReference: {fileID: 0}
    - target: {fileID: 919132149155446097, guid: a6b456dbf522ba4428334fc5d5cde928,
        type: 3}
      propertyPath: m_IsActive
      value: 1
      objectReference: {fileID: 0}
    m_RemovedComponents: []
    m_RemovedGameObjects: []
    m_AddedGameObjects: []
    m_AddedComponents: []
  m_SourcePrefab: {fileID: 100100000, guid: a6b456dbf522ba4428334fc5d5cde928, type: 3}
