%YAML 1.1
%TAG !u! tag:unity3d.com,2011:
--- !u!1001 &3067025138133667316
PrefabInstance:
  m_ObjectHideFlags: 0
  serializedVersion: 2
  m_Modification:
    serializedVersion: 3
    m_TransformParent: {fileID: 0}
    m_Modifications:
    - target: {fileID: -8679921383154817045, guid: 1ff753a171d6d4c4ba854ae595ce37a4,
        type: 3}
      propertyPath: m_LocalPosition.x
      value: 746.8551
      objectReference: {fileID: 0}
    - target: {fileID: -8679921383154817045, guid: 1ff753a171d6d4c4ba854ae595ce37a4,
        type: 3}
      propertyPath: m_LocalPosition.y
      value: -9.313226e-10
      objectReference: {fileID: 0}
    - target: {fileID: -8679921383154817045, guid: 1ff753a171d6d4c4ba854ae595ce37a4,
        type: 3}
      propertyPath: m_LocalPosition.z
      value: 1384.2603
      objectReference: {fileID: 0}
    - target: {fileID: -8679921383154817045, guid: 1ff753a171d6d4c4ba854ae595ce37a4,
        type: 3}
      propertyPath: m_LocalRotation.w
      value: 1
      objectReference: {fileID: 0}
    - target: {fileID: -8679921383154817045, guid: 1ff753a171d6d4c4ba854ae595ce37a4,
        type: 3}
      propertyPath: m_LocalRotation.x
      value: 0
      objectReference: {fileID: 0}
    - target: {fileID: -8679921383154817045, guid: 1ff753a171d6d4c4ba854ae595ce37a4,
        type: 3}
      propertyPath: m_LocalRotation.y
      value: -0
      objectReference: {fileID: 0}
    - target: {fileID: -8679921383154817045, guid: 1ff753a171d6d4c4ba854ae595ce37a4,
        type: 3}
      propertyPath: m_LocalRotation.z
      value: -0
      objectReference: {fileID: 0}
    - target: {fileID: -8679921383154817045, guid: 1ff753a171d6d4c4ba854ae595ce37a4,
        type: 3}
      propertyPath: m_LocalEulerAnglesHint.x
      value: 0
      objectReference: {fileID: 0}
    - target: {fileID: -8679921383154817045, guid: 1ff753a171d6d4c4ba854ae595ce37a4,
        type: 3}
      propertyPath: m_LocalEulerAnglesHint.y
      value: 0
      objectReference: {fileID: 0}
    - target: {fileID: -8679921383154817045, guid: 1ff753a171d6d4c4ba854ae595ce37a4,
        type: 3}
      propertyPath: m_LocalEulerAnglesHint.z
      value: 0
      objectReference: {fileID: 0}
    - target: {fileID: -7511558181221131132, guid: 1ff753a171d6d4c4ba854ae595ce37a4,
        type: 3}
      propertyPath: m_Materials.Array.data[0]
      value: 
      objectReference: {fileID: 2100000, guid: a29a3fb8afa394f4285cf1a8c733b198, type: 2}
    - target: {fileID: 919132149155446097, guid: 1ff753a171d6d4c4ba854ae595ce37a4,
        type: 3}
      propertyPath: m_Name
      value: Male_TshirtSHIT
      objectReference: {fileID: 0}
    m_RemovedComponents: []
    m_RemovedGameObjects: []
    m_AddedGameObjects: []
    m_AddedComponents: []
  m_SourcePrefab: {fileID: 100100000, guid: 1ff753a171d6d4c4ba854ae595ce37a4, type: 3}
