%YAML 1.1
%TAG !u! tag:unity3d.com,2011:
--- !u!1001 &5536743606737644579
PrefabInstance:
  m_ObjectHideFlags: 0
  serializedVersion: 2
  m_Modification:
    serializedVersion: 3
    m_TransformParent: {fileID: 0}
    m_Modifications:
    - target: {fileID: -8679921383154817045, guid: 05e4cde59046cc14cb8b313cf3247abb,
        type: 3}
      propertyPath: m_LocalScale.x
      value: 45.57006
      objectReference: {fileID: 0}
    - target: {fileID: -8679921383154817045, guid: 05e4cde59046cc14cb8b313cf3247abb,
        type: 3}
      propertyPath: m_LocalScale.y
      value: 35.486732
      objectReference: {fileID: 0}
    - target: {fileID: -8679921383154817045, guid: 05e4cde59046cc14cb8b313cf3247abb,
        type: 3}
      propertyPath: m_LocalScale.z
      value: 40.312084
      objectReference: {fileID: 0}
    - target: {fileID: -8679921383154817045, guid: 05e4cde59046cc14cb8b313cf3247abb,
        type: 3}
      propertyPath: m_LocalPosition.x
      value: -0.050951507
      objectReference: {fileID: 0}
    - target: {fileID: -8679921383154817045, guid: 05e4cde59046cc14cb8b313cf3247abb,
        type: 3}
      propertyPath: m_LocalPosition.y
      value: 1.2220678
      objectReference: {fileID: 0}
    - target: {fileID: -8679921383154817045, guid: 05e4cde59046cc14cb8b313cf3247abb,
        type: 3}
      propertyPath: m_LocalPosition.z
      value: -0.015027953
      objectReference: {fileID: 0}
    - target: {fileID: -8679921383154817045, guid: 05e4cde59046cc14cb8b313cf3247abb,
        type: 3}
      propertyPath: m_LocalRotation.w
      value: 0.995681
      objectReference: {fileID: 0}
    - target: {fileID: -8679921383154817045, guid: 05e4cde59046cc14cb8b313cf3247abb,
        type: 3}
      propertyPath: m_LocalRotation.x
      value: 0.007933207
      objectReference: {fileID: 0}
    - target: {fileID: -8679921383154817045, guid: 05e4cde59046cc14cb8b313cf3247abb,
        type: 3}
      propertyPath: m_LocalRotation.y
      value: -0.09249802
      objectReference: {fileID: 0}
    - target: {fileID: -8679921383154817045, guid: 05e4cde59046cc14cb8b313cf3247abb,
        type: 3}
      propertyPath: m_LocalRotation.z
      value: -0.0007369888
      objectReference: {fileID: 0}
    - target: {fileID: -8679921383154817045, guid: 05e4cde59046cc14cb8b313cf3247abb,
        type: 3}
      propertyPath: m_LocalEulerAnglesHint.x
      value: 0
      objectReference: {fileID: 0}
    - target: {fileID: -8679921383154817045, guid: 05e4cde59046cc14cb8b313cf3247abb,
        type: 3}
      propertyPath: m_LocalEulerAnglesHint.y
      value: 0
      objectReference: {fileID: 0}
    - target: {fileID: -8679921383154817045, guid: 05e4cde59046cc14cb8b313cf3247abb,
        type: 3}
      propertyPath: m_LocalEulerAnglesHint.z
      value: 0
      objectReference: {fileID: 0}
    - target: {fileID: -7511558181221131132, guid: 05e4cde59046cc14cb8b313cf3247abb,
        type: 3}
      propertyPath: m_Materials.Array.data[0]
      value: 
      objectReference: {fileID: 2100000, guid: a9c2a3438527b284d8a321dd1f4dda5d, type: 2}
    - target: {fileID: 919132149155446097, guid: 05e4cde59046cc14cb8b313cf3247abb,
        type: 3}
      propertyPath: m_Name
      value: Body_3
      objectReference: {fileID: 0}
    - target: {fileID: 919132149155446097, guid: 05e4cde59046cc14cb8b313cf3247abb,
        type: 3}
      propertyPath: m_IsActive
      value: 1
      objectReference: {fileID: 0}
    m_RemovedComponents: []
    m_RemovedGameObjects: []
    m_AddedGameObjects: []
    m_AddedComponents: []
  m_SourcePrefab: {fileID: 100100000, guid: 05e4cde59046cc14cb8b313cf3247abb, type: 3}
