%YAML 1.1
%TAG !u! tag:unity3d.com,2011:
--- !u!1045 &1
EditorBuildSettings:
  m_ObjectHideFlags: 0
  serializedVersion: 2
  m_Scenes:
  - enabled: 1
    path: Assets/Scenes/Menu.unity
    guid: 9c4b6f5c6585f0b4babed5e11307b66f
  - enabled: 1
    path: Assets/Scenes/Firsthouse.unity
    guid: 9fc0d4010bbf28b4594072e72b8655ab
  m_configObjects:
    Unity.XR.Oculus.Settings: {fileID: 11400000, guid: 2087921d79c7bd74f8ca2faeddd822fc,
      type: 2}
    com.unity.xr.management.loader_settings: {fileID: 11400000, guid: c5c53f358c87b15469009b8a6fd39c44,
      type: 2}
