%YAML 1.1
%TAG !u! tag:unity3d.com,2011:
--- !u!114 &11400000
MonoBehaviour:
  m_ObjectHideFlags: 0
  m_CorrespondingSourceObject: {fileID: 0}
  m_PrefabInstance: {fileID: 0}
  m_PrefabAsset: {fileID: 0}
  m_GameObject: {fileID: 0}
  m_Enabled: 1
  m_EditorHideFlags: 0
  m_Script: {fileID: 11500000, guid: 6130cb2effc4cb1459f69252781c9e19, type: 3}
  m_Name: screenWire
  m_EditorClassIdentifier: 
  spherePrefab: {fileID: 2952597093345142221, guid: c1d0687dabd721242a5063d0ea4d9e9a, type: 3}
  cylinderPrefab: {fileID: 8139852093373790999, guid: 0138e1620abe1944383485fa168fc85b, type: 3}
  firstSocketPrefab: {fileID: 2952597093345142221, guid: c1d0687dabd721242a5063d0ea4d9e9a, type: 3}
  secondSocketPrefab: {fileID: 1567992301857407446, guid: 7f5d5c43b5e5868498794c7b6bbc676b, type: 3}
  wirePrefab: {fileID: 3414584867034559087, guid: 3c17f162ed135714ab635daff15d73f9, type: 3}
  WireName: ScreenWire
  firstItemAttached: 
  secondItemAttached: 
  isInstantiated: 0
