Started at Tue Feb 09 20:04:14 UTC 2021
Processing mvn test
Offering mvn test to Project Build Discarder
Finished at Tue Feb 09 20:04:14 UTC 2021. 1ms
Started at Tue Feb 09 21:04:14 UTC 2021
Processing mvn test
Offering mvn test to Project Build Discarder
Finished at Tue Feb 09 21:04:14 UTC 2021. 1ms
Started at Tue Feb 09 22:04:14 UTC 2021
Processing mvn test
Offering mvn test to Project Build Discarder
Finished at Tue Feb 09 22:04:14 UTC 2021. 1ms
Started at Tue Feb 09 23:04:14 UTC 2021
Processing mvn test
Offering mvn test to Project Build Discarder
Finished at Tue Feb 09 23:04:14 UTC 2021. 1ms
