Started at Wed Feb 10 14:10:14 UTC 2021
Processing mvn test
Offering mvn test to Project Build Discarder
Finished at Wed Feb 10 14:10:14 UTC 2021. 1ms
Started at Wed Feb 10 15:10:14 UTC 2021
Processing mvn test
Offering mvn test to Project Build Discarder
Finished at Wed Feb 10 15:10:14 UTC 2021. 2ms
Started at Wed Feb 10 16:10:14 UTC 2021
Processing mvn test
Offering mvn test to Project Build Discarder
Finished at Wed Feb 10 16:10:14 UTC 2021. 0ms
Started at Wed Feb 10 17:10:14 UTC 2021
Processing mvn test
Offering mvn test to Project Build Discarder
Finished at Wed Feb 10 17:10:14 UTC 2021. 1ms
