<svg width="20" height="20" viewBox="0 0 20 20" fill="none" xmlns="http://www.w3.org/2000/svg">
<g id="Severicons">
<path id="Vector" d="M7.14836 6.39997L9.31609 1C9.96287 1 10.5832 1.28446 11.0405 1.79081C11.4979 2.29715 11.7548 2.9839 11.7548 3.69998V7.29996H16.3558C16.5915 7.29701 16.8249 7.35081 17.0399 7.45765C17.2549 7.5645 17.4464 7.72182 17.601 7.91872C17.7557 8.11562 17.8698 8.34739 17.9355 8.59798C18.0012 8.84856 18.017 9.11197 17.9816 9.36995L16.8598 17.4699C16.801 17.8991 16.6041 18.2903 16.3053 18.5715C16.0066 18.8527 15.6261 19.0048 15.234 18.9999H6.06449H3.6258C3.19461 18.9999 2.78108 18.8102 2.47618 18.4727C2.17129 18.1351 2 17.6773 2 17.1999V10.8999C2 10.4226 2.17129 9.96472 2.47618 9.62715C2.78108 9.28959 3.19461 9.09995 3.6258 9.09995H6.06449V16.2999" stroke="white" stroke-width="2" stroke-linecap="round" stroke-linejoin="round"/>
</g>
</svg>
