<svg width="20" height="21" viewBox="0 0 20 21" fill="none" xmlns="http://www.w3.org/2000/svg">
<path d="M10.0046 0.252258C5.82993 0.252258 4.60901 0.256565 4.37168 0.276253C3.51498 0.347468 2.98188 0.482361 2.40111 0.771527C1.95353 0.993785 1.60054 1.25142 1.25217 1.61257C0.617711 2.27119 0.233194 3.08147 0.0939982 4.04464C0.026323 4.51223 0.0066357 4.60759 0.00263671 6.99598C0.00109864 7.79211 0.00263671 8.83988 0.00263671 10.2453C0.00263671 14.4166 0.00725093 15.6364 0.0272459 15.8732C0.0964591 16.7069 0.227195 17.2314 0.504048 17.8051C1.03314 18.9033 2.04366 19.7278 3.23412 20.0354C3.64633 20.1415 4.1016 20.2 4.68606 20.2276C4.93369 20.2384 7.45767 20.2461 9.98318 20.2461C12.5087 20.2461 15.0342 20.243 15.2757 20.2307C15.9524 20.1989 16.3454 20.1461 16.7799 20.0338C17.9781 19.7247 18.9701 18.9125 19.51 17.799C19.7815 17.2391 19.9191 16.6946 19.9814 15.9045C19.995 15.7322 20.0006 12.9856 20.0006 10.2426C20.0006 7.49925 19.9945 4.75771 19.981 4.58544C19.9179 3.78255 19.7802 3.24267 19.5 2.67203C19.2701 2.2049 19.0147 1.85605 18.6441 1.49936C17.9825 0.867505 17.1735 0.482976 16.2094 0.34393C15.7423 0.276407 15.6493 0.256411 13.2591 0.252258H10.0046Z" fill="url(#paint0_radial_2521_17715)"/>
<defs>
<radialGradient id="paint0_radial_2521_17715" cx="0" cy="0" r="1" gradientUnits="userSpaceOnUse" gradientTransform="translate(-3.34793 1.69258) rotate(78.678) scale(8.85763 36.5197)">
<stop stop-color="#3771C8"/>
<stop offset="0.128" stop-color="#3771C8"/>
<stop offset="1" stop-color="#6600FF" stop-opacity="0"/>
</radialGradient>
</defs>
</svg>
