<svg width="21" height="18" viewBox="0 0 21 18" fill="none" xmlns="http://www.w3.org/2000/svg">
<path d="M7.80506 8.06142C7.597 7.89603 7.25022 7.81067 6.75939 7.81067C6.26857 7.81067 5.91646 7.89603 5.71373 8.06142C5.50566 8.2268 5.4043 8.50956 5.4043 8.90969C5.4043 9.30448 5.50566 9.58724 5.71373 9.75796C5.92179 9.92334 6.26857 10.0087 6.75939 10.0087C7.25022 10.0087 7.60233 9.92334 7.80506 9.75796C8.01313 9.59257 8.11449 9.30981 8.11449 8.90969C8.11449 8.50956 8.01313 8.2268 7.80506 8.06142Z" fill="#ADC837"/>
<path d="M13.0653 8.06142C13.2734 7.89603 13.6201 7.81067 14.111 7.81067C14.6018 7.81067 14.9539 7.89603 15.1566 8.06142C15.3647 8.2268 15.4661 8.50956 15.4661 8.90969C15.4661 9.30448 15.3647 9.58724 15.1566 9.75796C14.9486 9.92334 14.6018 10.0087 14.111 10.0087C13.6201 10.0087 13.268 9.92334 13.0653 9.75796C12.8572 9.59257 12.7559 9.30981 12.7559 8.90969C12.7559 8.50956 12.8572 8.2268 13.0653 8.06142Z" fill="#ADC837"/>
<path d="M20.8653 8.18439C20.7586 5.46886 19.9637 3.5109 18.4912 2.31052C16.9067 1.01944 14.2232 0.373901 10.4353 0.373901C6.65279 0.373901 3.96926 1.01944 2.37942 2.31052C0.906955 3.5109 0.1067 5.46886 0.00533414 8.18439C0.00533414 8.2324 0 8.34444 0 8.39246V17.2699H10.4353H20.8707V8.39246C20.8707 8.34444 20.8653 8.2324 20.8653 8.18439ZM18.4272 7.81627C18.4219 8.28042 18.3365 9.27274 17.787 10.5158C17.5789 10.9479 17.1628 11.6628 16.3999 12.4097C15.2635 13.5088 13.2095 14.9919 10.4353 14.9919C7.66111 14.9919 5.60712 13.5088 4.47076 12.4097C3.70785 11.6628 3.28638 10.9479 3.08365 10.5158C2.53414 9.27807 2.44878 8.28576 2.44344 7.81627C2.44344 7.72024 2.44344 7.64555 2.44344 7.64555C2.44344 6.68524 2.83824 5.81563 3.46777 5.19144C3.71318 4.96203 4.20934 4.57791 4.95625 4.43386C6.97822 4.06041 8.17327 5.99169 8.41335 6.4345C8.42935 6.46117 8.44536 6.49318 8.46136 6.52519C8.59474 6.77594 8.73345 7.05336 8.87216 7.34145C8.89884 7.40547 9.77912 9.36343 10.2219 12.1003H10.43H10.6381C11.0809 9.36343 11.9611 7.40547 11.9878 7.34145C12.1265 7.05336 12.2652 6.77594 12.3986 6.52519C12.4146 6.49318 12.4306 6.46651 12.4466 6.4345C12.692 5.99169 13.8818 4.06041 15.9037 4.43386C16.6506 4.57791 17.1521 4.96203 17.3922 5.19144C18.0271 5.81563 18.4165 6.68524 18.4165 7.64555C18.4272 7.64555 18.4272 7.72024 18.4272 7.81627Z" fill="#ADC837"/>
</svg>
