<svg width="20" height="20" viewBox="0 0 20 20" fill="none" xmlns="http://www.w3.org/2000/svg">
<path d="M13 2C13.8582 2.19898 14.6188 2.65096 15.162 3.28467C15.7052 3.91838 16 4.69778 16 5.5C16 6.30222 15.7052 7.08162 15.162 7.71533C14.6188 8.34904 13.8582 8.80102 13 9" stroke="white" stroke-width="2" stroke-linecap="round" stroke-linejoin="round"/>
<path d="M7.5 9C9.433 9 11 7.433 11 5.5C11 3.567 9.433 2 7.5 2C5.567 2 4 3.567 4 5.5C4 7.433 5.567 9 7.5 9Z" stroke="white" stroke-width="2" stroke-linecap="round" stroke-linejoin="round"/>
<path d="M10.5847 18C11.6904 17.7744 12.567 17.4307 12.9746 16.9689C13.0318 16.385 12.9746 15.4644 12.9746 15.4644C12.9746 14.6663 12.6388 13.9009 12.0413 13.3366C10.1541 11.5545 3.84586 11.5545 1.95873 13.3366C1.36116 13.9009 1.02545 14.6663 1.02545 15.4644C1.02545 15.4644 0.96819 16.385 1.02545 16.9689C1.43297 17.4307 2.30956 17.7744 3.41527 18" stroke="white" stroke-width="2" stroke-linecap="round" stroke-linejoin="round"/>
<path d="M16 17C17.3734 16.7939 18.4622 16.48 18.9684 16.0581C19.0395 15.5246 18.9684 14.6837 18.9684 14.6837C18.9684 13.9546 18.5514 13.2555 17.8092 12.7399C17.3728 12.4369 16.7461 12.1902 16 12" stroke="white" stroke-width="2" stroke-linecap="round" stroke-linejoin="round"/>
</svg>
