<svg width="41" height="40" viewBox="0 0 41 40" fill="none" xmlns="http://www.w3.org/2000/svg">
<path d="M22.5 25L17.5 20L22.5 15" stroke="white" stroke-width="2" stroke-linecap="round" stroke-linejoin="round"/>
<rect x="1.5" y="1" width="38" height="38" rx="11" stroke="#ADC837" stroke-width="2"/>
</svg>
