{
  "realm" : "jhipster",
  "users" : [ {
    "id" : "4c973896-5761-41fc-8217-07c5d13a004b",
    "createdTimestamp" : 1505479415590,
    "username" : "admin",
    "enabled" : true,
    "totp" : false,
    "emailVerified" : true,
    "firstName" : "Admin",
    "lastName" : "Administrator",
    "email" : "admin@localhost",
    "credentials" : [ {
      "id" : "b860462b-9b02-48ba-9523-d3a8926a917b",
      "type" : "password",
      "createdDate" : 1505479429154,
      "secretData" : "{\"value\":\"4pf9K2jWSCcHC+CwsZP/qidN5pSmDUe6AX6wBerSGdBVKkExay8MWKx+EKmaaObZW6FVsD8vdW/ZsyUFD9gJ1Q==\",\"salt\":\"1/qNkZ5kr77jOMOBPBogGw==\"}",
      "credentialData" : "{\"hashIterations\":27500,\"algorithm\":\"pbkdf2-sha256\"}"
    } ],
    "disableableCredentialTypes" : [ ],
    "requiredActions" : [ ],
    "realmRoles" : [ "offline_access", "uma_authorization" ],
    "clientRoles" : {
      "account" : [ "view-profile", "manage-account" ]
    },
    "notBefore" : 0,
    "groups" : [ "/Admins", "/Users" ]
  }, {
    "id" : "231d15ef-1790-4ea0-b968-ac7304dc97e5",
    "createdTimestamp" : 1646571715928,
    "username" : "fizzbuzzadmin",
    "enabled" : true,
    "totp" : false,
    "emailVerified" : false,
    "credentials" : [ {
      "id" : "725610fd-9fab-4ef4-8694-12dd993c1b8c",
      "type" : "password",
      "createdDate" : 1646571750912,
      "secretData" : "{\"value\":\"2HiVM9P1acARlX0MnGJpxDEaBcAgeQmZTsxFkOTEqFXd65s33hzlICqjyasSvHckkndbb4RHa3/EcX1g0zh1XA==\",\"salt\":\"XNjtLND1VNgSSJ0uGML27g==\",\"additionalParameters\":{}}",
      "credentialData" : "{\"hashIterations\":27500,\"algorithm\":\"pbkdf2-sha256\",\"additionalParameters\":{}}"
    } ],
    "disableableCredentialTypes" : [ ],
    "requiredActions" : [ ],
    "realmRoles" : [ "default-roles-jhipster" ],
    "notBefore" : 0,
    "groups" : [ "/Admins", "/Users" ]
  }, {
    "id" : "b3878fdc-6616-49b6-a239-6d4ee8e8026b",
    "createdTimestamp" : 1646572355838,
    "username" : "fizzbuzzuser",
    "enabled" : true,
    "totp" : false,
    "emailVerified" : false,
    "credentials" : [ {
      "id" : "fe7f1185-e9b8-4ed7-a22c-6ff1ed60b9ee",
      "type" : "password",
      "createdDate" : 1646572395062,
      "secretData" : "{\"value\":\"9PaS3dNXokaAxK4ZEK/VqgwcxqFrYmVWIVTdvXkugBp0AL0+CsUBa42p1FDGf7SI20dKjPvpqWpp31RK02hPNQ==\",\"salt\":\"VmZ9lF0ai96sQKwG8KVOUw==\",\"additionalParameters\":{}}",
      "credentialData" : "{\"hashIterations\":27500,\"algorithm\":\"pbkdf2-sha256\",\"additionalParameters\":{}}"
    } ],
    "disableableCredentialTypes" : [ ],
    "requiredActions" : [ ],
    "realmRoles" : [ "default-roles-jhipster", "ROLE_USER" ],
    "notBefore" : 0,
    "groups" : [ "/Users" ]
  }, {
    "id" : "9b28cfbe-f225-427d-8fad-47b7bb117df1",
    "createdTimestamp" : 1626790618730,
    "username" : "numericompta",
    "enabled" : true,
    "totp" : false,
    "emailVerified" : false,
    "email" : "alerte.numericompta@numericompta.fr",
    "credentials" : [ {
      "id" : "f32e7149-a6b5-4e3d-87ae-71bd8e607c5c",
      "type" : "password",
      "createdDate" : 1626790647547,
      "secretData" : "{\"value\":\"1vxBPb5kbpOq0J4EtX8Cjj64ioy7LeY7nf+St95IjwS3eeWctesm3BFs1VJxQG0aygWZ2mu7YypQvoei5Sx5Sw==\",\"salt\":\"01WlP70HELC3fruZYTCxUw==\",\"additionalParameters\":{}}",
      "credentialData" : "{\"hashIterations\":27500,\"algorithm\":\"pbkdf2-sha256\",\"additionalParameters\":{}}"
    } ],
    "disableableCredentialTypes" : [ ],
    "requiredActions" : [ ],
    "realmRoles" : [ "default-roles-jhipster" ],
    "notBefore" : 0,
    "groups" : [ "/Admins", "/Users" ]
  }, {
    "id" : "f742ba6f-1d8a-4dec-bf15-e02dab508283",
    "createdTimestamp" : 1598681172054,
    "username" : "service-account-internal",
    "enabled" : true,
    "totp" : false,
    "emailVerified" : false,
    "serviceAccountClientId" : "internal",
    "credentials" : [ ],
    "disableableCredentialTypes" : [ ],
    "requiredActions" : [ ],
    "realmRoles" : [ "offline_access", "uma_authorization" ],
    "clientRoles" : {
      "account" : [ "view-profile", "manage-account" ]
    },
    "notBefore" : 0,
    "groups" : [ ]
  }, {
    "id" : "c4af4e2f-b432-4c3b-8405-cca86cd5b97b",
    "createdTimestamp" : 1505479373742,
    "username" : "user",
    "enabled" : true,
    "totp" : false,
    "emailVerified" : true,
    "firstName" : "",
    "lastName" : "User",
    "email" : "user@localhost",
    "credentials" : [ {
      "id" : "7821832b-1e82-45a2-b8d3-f1a6ad909e64",
      "type" : "password",
      "createdDate" : 1505479392766,
      "secretData" : "{\"value\":\"MbKsMgWPnZyImih8s4SaoCSCq+XIY/c6S9F93sXEidHF1TjPWxCqMkec0+o3860CMLXHt3az61cIJOWI0FW9aw==\",\"salt\":\"fmpBI1r8R1u75hDLMUlwBw==\"}",
      "credentialData" : "{\"hashIterations\":27500,\"algorithm\":\"pbkdf2-sha256\"}"
    } ],
    "disableableCredentialTypes" : [ ],
    "requiredActions" : [ ],
    "realmRoles" : [ "offline_access", "uma_authorization" ],
    "clientRoles" : {
      "account" : [ "view-profile", "manage-account" ]
    },
    "notBefore" : 0,
    "groups" : [ "/Users" ]
  } ]
}