{
  "project_info": {
    "project_number": "362513026657",
    "firebase_url": "https://next-technology-leaders.firebaseio.com",
    "project_id": "next-technology-leaders",
    "storage_bucket": "next-technology-leaders.appspot.com"
  },
  "client": [
    {
      "client_info": {
        "mobilesdk_app_id": "1:362513026657:android:b509fa14ac7e1d20",
        "android_client_info": {
          "package_name": "ntl.tiec.org.ntl"
        }
      },
      "oauth_client": [
        {
          "client_id": "362513026657-6sprp5c0k74bbfmam7i3h4v8a278u40t.apps.googleusercontent.com",
          "client_type": 3
        }
      ],
      "api_key": [
        {
          "current_key": "AIzaSyDWagP2HZryklbBPUmFFdmWg9QX4H5jyVU"
        }
      ],
      "services": {
        "analytics_service": {
          "status": 1
        },
        "appinvite_service": {
          "status": 1,
          "other_platform_oauth_client": []
        },
        "ads_service": {
          "status": 2
        }
      }
    }
  ],
  "configuration_version": "1"
}