{
  "posts": [
    {
      "id": 1,
      "titre": "Super les infos",
      "description": "La hausse du prix de l'energie, c'est pas ouf",
      "date": "2022-08-01"
    },
    {
      "id": 2,
      "titre": "Bravo France3",
      "description": "Je suis très décue par les infos, en ce moment",
      "date": "2022-08-14"
    },
    {
      "id": 3,
      "titre": "Super démmarrage de Lens",
      "description": "Belle victoire des sangs et or",
      "date": "2022-08-18"
    },
    {
      "id": 4,
      "titre": "Belle annonce",
      "description": "CR7 a l'OM, c'est presque fait",
      "date": "2022-07-18"
    },
    {
      "id": 6,
      "titre": "Non j'arrête pas",
      "description": "Je suis très décue de ce qui se passe en ce moment",
      "date": "2022-08-03"
    },
    {
      "titre": "Quel bosseur !!",
      "description": "Abdallah a fini le formuaire, en moins de 3 heures",
      "date": "2022-08-04",
      "id": 7
    },
    {
      "titre": "On en parle?",
      "description": "Le football, il a changé !!",
      "date": "2022-08-04",
      "id": 8
    },
    {
      "titre": "La famille Pogba",
      "description": "C'est triste ce qui leur arrive...",
      "date": "2022-08-25",
      "id": 9
    },
    {
      "titre": " Partir",
      "description": "Je suis bientôt en Vacances.",
      "date": "2022-08-31",
      "id": 10
    },
    {
      "titre": "Attendre Abdallah",
      "description": "Il est un peu en retard",
      "date": "2022-08-18",
      "id": 11
    }
  ]
}