[
    {
        "id": 1,
        "diagnosis": "Diagnosis details 4",
        "prescription": "Prescription details 1"
    },
    {
        "id": 2,
        "diagnosis": "Diagnosis details 8",
        "prescription": "Prescription details 2"
    },
      {
        "id": 3,
        "diagnosis": "Diagnosis details 2",
        "prescription": "Prescription details 1"
    },
    {
        "id": 4,
        "diagnosis": "Diagnosis details 7",
        "prescription": "Prescription details 2"
    },
      {
        "id": 5,
        "diagnosis": "Diagnosis details 8",
        "prescription": "Prescription details 5"
    },
    {
        "id": 6,
        "diagnosis": "Diagnosis details ",
        "prescription": "Prescription details 2"
    }
    
]
