// Jest Snapshot v1, https://goo.gl/fbAQLP

exports[`<MobileNav /> renders a <DesktopNav> component that has menu items with and without dropdowns for unauthenticated users (with dropdown opened) 1`] = `
Object {
  "asFragment": [Function],
  "baseElement": <body>
    .c1 {
  display: -webkit-box;
  display: -webkit-flex;
  display: -ms-flexbox;
  display: flex;
  padding: 16px;
  -webkit-align-items: center;
  -webkit-box-align: center;
  -ms-flex-align: center;
  align-items: center;
  color: #156cc4;
  cursor: pointer;
}

.c1:hover {
  color: #f26e0d;
}

.c0 {
  width: 100%;
  border-bottom: 1px solid #d7d7d7;
}

.c3 {
  color: #156cc4;
  display: block;
  -webkit-hyphens: auto;
  -moz-hyphens: auto;
  -ms-hyphens: auto;
  hyphens: auto;
}

.c3 a {
  display: block;
  padding: 8px 0;
  width: 100%;
}

.c3:hover {
  color: #f26e0d;
}

.c3:first-child a {
  padding-top: 0;
}

.c3:last-child a {
  padding-bottom: 0;
}

.c5 {
  padding: 16px;
  color: #156cc4;
  display: block;
  -webkit-hyphens: auto;
  -moz-hyphens: auto;
  -ms-hyphens: auto;
  hyphens: auto;
}

.c5:hover {
  color: #f26e0d;
}

.c4 {
  border-bottom: 1px solid #d7d7d7;
  width: 100%;
}

.c2 {
  display: -webkit-box;
  display: -webkit-flex;
  display: -ms-flexbox;
  display: flex;
  padding: 0px 36px 8px;
}

.c2 ul {
  width: 100%;
}

<div>
      <li
        class="c0"
      >
        <span
          class="c1"
        >
          a menu item
          <svg
            aria-hidden="true"
            class="MuiSvgIcon-root MuiSvgIcon-fontSizeMedium css-1jxdcj3-MuiSvgIcon-root"
            data-testid="KeyboardArrowDownIcon"
            focusable="false"
            viewBox="0 0 24 24"
          >
            <path
              d="M7.41 8.59 12 13.17l4.59-4.58L18 10l-6 6-6-6 1.41-1.41z"
            />
          </svg>
        </span>
        <div
          class="c2"
          data-testid="submenuMobile"
        >
          <ul
            class="MuiList-root MuiList-padding css-h4y409-MuiList-root"
            role="menu"
            tabindex="-1"
          >
            <li
              class="c3"
              tabindex="0"
            >
              <a
                href="/a%20menu%20subitem%20href"
              >
                a menu subitem
              </a>
            </li>
          </ul>
        </div>
      </li>
      <li
        class="c0"
      >
        <span
          class="c1"
        >
          a menu item
          <svg
            aria-hidden="true"
            class="MuiSvgIcon-root MuiSvgIcon-fontSizeMedium css-1jxdcj3-MuiSvgIcon-root"
            data-testid="KeyboardArrowDownIcon"
            focusable="false"
            viewBox="0 0 24 24"
          >
            <path
              d="M7.41 8.59 12 13.17l4.59-4.58L18 10l-6 6-6-6 1.41-1.41z"
            />
          </svg>
        </span>
      </li>
      <li
        class="c4"
      >
        <a
          class="c5"
        >
          a menu item
        </a>
      </li>
    </div>
  </body>,
  "container": <div>
    <li
      class="styles__List-cp-layout__sc-14ji2y1-1 caMONU"
    >
      <span
        class="styles__MenuItem-cp-layout__sc-14ji2y1-0 ienxCw"
      >
        a menu item
        <svg
          aria-hidden="true"
          class="MuiSvgIcon-root MuiSvgIcon-fontSizeMedium css-1jxdcj3-MuiSvgIcon-root"
          data-testid="KeyboardArrowDownIcon"
          focusable="false"
          viewBox="0 0 24 24"
        >
          <path
            d="M7.41 8.59 12 13.17l4.59-4.58L18 10l-6 6-6-6 1.41-1.41z"
          />
        </svg>
      </span>
      <div
        class="styles__Submenu-cp-layout__sc-14ji2y1-5 cjMgzb"
        data-testid="submenuMobile"
      >
        <ul
          class="MuiList-root MuiList-padding css-h4y409-MuiList-root"
          role="menu"
          tabindex="-1"
        >
          <li
            class="styles__SubmenuItem-cp-layout__sc-14ji2y1-2 hYakOW"
            tabindex="0"
          >
            <a
              href="/a%20menu%20subitem%20href"
            >
              a menu subitem
            </a>
          </li>
        </ul>
      </div>
    </li>
    <li
      class="styles__List-cp-layout__sc-14ji2y1-1 caMONU"
    >
      <span
        class="styles__MenuItem-cp-layout__sc-14ji2y1-0 ienxCw"
      >
        a menu item
        <svg
          aria-hidden="true"
          class="MuiSvgIcon-root MuiSvgIcon-fontSizeMedium css-1jxdcj3-MuiSvgIcon-root"
          data-testid="KeyboardArrowDownIcon"
          focusable="false"
          viewBox="0 0 24 24"
        >
          <path
            d="M7.41 8.59 12 13.17l4.59-4.58L18 10l-6 6-6-6 1.41-1.41z"
          />
        </svg>
      </span>
    </li>
    <li
      class="styles__MobileMenuItem-cp-layout__sc-14ji2y1-4 gnIwml"
    >
      <a
        class="styles__Anchor-cp-layout__sc-14ji2y1-3 iERZsF"
      >
        a menu item
      </a>
    </li>
  </div>,
  "debug": [Function],
  "findAllByAltText": [Function],
  "findAllByDisplayValue": [Function],
  "findAllByLabelText": [Function],
  "findAllByPlaceholderText": [Function],
  "findAllByRole": [Function],
  "findAllByTestId": [Function],
  "findAllByText": [Function],
  "findAllByTitle": [Function],
  "findByAltText": [Function],
  "findByDisplayValue": [Function],
  "findByLabelText": [Function],
  "findByPlaceholderText": [Function],
  "findByRole": [Function],
  "findByTestId": [Function],
  "findByText": [Function],
  "findByTitle": [Function],
  "getAllByAltText": [Function],
  "getAllByDisplayValue": [Function],
  "getAllByLabelText": [Function],
  "getAllByPlaceholderText": [Function],
  "getAllByRole": [Function],
  "getAllByTestId": [Function],
  "getAllByText": [Function],
  "getAllByTitle": [Function],
  "getByAltText": [Function],
  "getByDisplayValue": [Function],
  "getByLabelText": [Function],
  "getByPlaceholderText": [Function],
  "getByRole": [Function],
  "getByTestId": [Function],
  "getByText": [Function],
  "getByTitle": [Function],
  "queryAllByAltText": [Function],
  "queryAllByDisplayValue": [Function],
  "queryAllByLabelText": [Function],
  "queryAllByPlaceholderText": [Function],
  "queryAllByRole": [Function],
  "queryAllByTestId": [Function],
  "queryAllByText": [Function],
  "queryAllByTitle": [Function],
  "queryByAltText": [Function],
  "queryByDisplayValue": [Function],
  "queryByLabelText": [Function],
  "queryByPlaceholderText": [Function],
  "queryByRole": [Function],
  "queryByTestId": [Function],
  "queryByText": [Function],
  "queryByTitle": [Function],
  "rerender": [Function],
  "unmount": [Function],
}
`;

exports[`<MobileNav /> renders a <MobileNav> component that has menu items with and without dropdowns for authenticated users 1`] = `
Object {
  "asFragment": [Function],
  "baseElement": <body>
    .c1 {
  display: -webkit-box;
  display: -webkit-flex;
  display: -ms-flexbox;
  display: flex;
  padding: 16px;
  -webkit-align-items: center;
  -webkit-box-align: center;
  -ms-flex-align: center;
  align-items: center;
  color: #156cc4;
  cursor: pointer;
}

.c1:hover {
  color: #f26e0d;
}

.c0 {
  width: 100%;
  border-bottom: 1px solid #d7d7d7;
}

.c3 {
  padding: 16px;
  color: #156cc4;
  display: block;
  -webkit-hyphens: auto;
  -moz-hyphens: auto;
  -ms-hyphens: auto;
  hyphens: auto;
}

.c3:hover {
  color: #f26e0d;
}

.c2 {
  border-bottom: 1px solid #d7d7d7;
  width: 100%;
}

<div>
      <li
        class="c0"
      >
        <span
          class="c1"
        >
          a menu item
          <svg
            aria-hidden="true"
            class="MuiSvgIcon-root MuiSvgIcon-fontSizeMedium css-1jxdcj3-MuiSvgIcon-root"
            data-testid="KeyboardArrowDownIcon"
            focusable="false"
            viewBox="0 0 24 24"
          >
            <path
              d="M7.41 8.59 12 13.17l4.59-4.58L18 10l-6 6-6-6 1.41-1.41z"
            />
          </svg>
        </span>
      </li>
      <li
        class="c0"
      >
        <span
          class="c1"
        >
          a menu item
          <svg
            aria-hidden="true"
            class="MuiSvgIcon-root MuiSvgIcon-fontSizeMedium css-1jxdcj3-MuiSvgIcon-root"
            data-testid="KeyboardArrowDownIcon"
            focusable="false"
            viewBox="0 0 24 24"
          >
            <path
              d="M7.41 8.59 12 13.17l4.59-4.58L18 10l-6 6-6-6 1.41-1.41z"
            />
          </svg>
        </span>
      </li>
      <li
        class="c2"
      >
        <a
          class="c3"
        >
          a menu item
        </a>
      </li>
    </div>
  </body>,
  "container": <div>
    <li
      class="styles__List-cp-layout__sc-14ji2y1-1 caMONU"
    >
      <span
        class="styles__MenuItem-cp-layout__sc-14ji2y1-0 ienxCw"
      >
        a menu item
        <svg
          aria-hidden="true"
          class="MuiSvgIcon-root MuiSvgIcon-fontSizeMedium css-1jxdcj3-MuiSvgIcon-root"
          data-testid="KeyboardArrowDownIcon"
          focusable="false"
          viewBox="0 0 24 24"
        >
          <path
            d="M7.41 8.59 12 13.17l4.59-4.58L18 10l-6 6-6-6 1.41-1.41z"
          />
        </svg>
      </span>
    </li>
    <li
      class="styles__List-cp-layout__sc-14ji2y1-1 caMONU"
    >
      <span
        class="styles__MenuItem-cp-layout__sc-14ji2y1-0 ienxCw"
      >
        a menu item
        <svg
          aria-hidden="true"
          class="MuiSvgIcon-root MuiSvgIcon-fontSizeMedium css-1jxdcj3-MuiSvgIcon-root"
          data-testid="KeyboardArrowDownIcon"
          focusable="false"
          viewBox="0 0 24 24"
        >
          <path
            d="M7.41 8.59 12 13.17l4.59-4.58L18 10l-6 6-6-6 1.41-1.41z"
          />
        </svg>
      </span>
    </li>
    <li
      class="styles__MobileMenuItem-cp-layout__sc-14ji2y1-4 gnIwml"
    >
      <a
        class="styles__Anchor-cp-layout__sc-14ji2y1-3 iERZsF"
      >
        a menu item
      </a>
    </li>
  </div>,
  "debug": [Function],
  "findAllByAltText": [Function],
  "findAllByDisplayValue": [Function],
  "findAllByLabelText": [Function],
  "findAllByPlaceholderText": [Function],
  "findAllByRole": [Function],
  "findAllByTestId": [Function],
  "findAllByText": [Function],
  "findAllByTitle": [Function],
  "findByAltText": [Function],
  "findByDisplayValue": [Function],
  "findByLabelText": [Function],
  "findByPlaceholderText": [Function],
  "findByRole": [Function],
  "findByTestId": [Function],
  "findByText": [Function],
  "findByTitle": [Function],
  "getAllByAltText": [Function],
  "getAllByDisplayValue": [Function],
  "getAllByLabelText": [Function],
  "getAllByPlaceholderText": [Function],
  "getAllByRole": [Function],
  "getAllByTestId": [Function],
  "getAllByText": [Function],
  "getAllByTitle": [Function],
  "getByAltText": [Function],
  "getByDisplayValue": [Function],
  "getByLabelText": [Function],
  "getByPlaceholderText": [Function],
  "getByRole": [Function],
  "getByTestId": [Function],
  "getByText": [Function],
  "getByTitle": [Function],
  "queryAllByAltText": [Function],
  "queryAllByDisplayValue": [Function],
  "queryAllByLabelText": [Function],
  "queryAllByPlaceholderText": [Function],
  "queryAllByRole": [Function],
  "queryAllByTestId": [Function],
  "queryAllByText": [Function],
  "queryAllByTitle": [Function],
  "queryByAltText": [Function],
  "queryByDisplayValue": [Function],
  "queryByLabelText": [Function],
  "queryByPlaceholderText": [Function],
  "queryByRole": [Function],
  "queryByTestId": [Function],
  "queryByText": [Function],
  "queryByTitle": [Function],
  "rerender": [Function],
  "unmount": [Function],
}
`;

exports[`<MobileNav /> renders a <MobileNav> component that has menu items with and without dropdowns for unauthenticated users (no dropdowns opened) 1`] = `
Object {
  "asFragment": [Function],
  "baseElement": .c1 {
  display: -webkit-box;
  display: -webkit-flex;
  display: -ms-flexbox;
  display: flex;
  padding: 16px;
  -webkit-align-items: center;
  -webkit-box-align: center;
  -ms-flex-align: center;
  align-items: center;
  color: #156cc4;
  cursor: pointer;
}

.c1:hover {
  color: #f26e0d;
}

.c0 {
  width: 100%;
  border-bottom: 1px solid #d7d7d7;
}

.c3 {
  padding: 16px;
  color: #156cc4;
  display: block;
  -webkit-hyphens: auto;
  -moz-hyphens: auto;
  -ms-hyphens: auto;
  hyphens: auto;
}

.c3:hover {
  color: #f26e0d;
}

.c2 {
  border-bottom: 1px solid #d7d7d7;
  width: 100%;
}

<body>
    <div>
      <li
        class="c0"
      >
        <span
          class="c1"
        >
          a menu item
          <svg
            aria-hidden="true"
            class="MuiSvgIcon-root MuiSvgIcon-fontSizeMedium css-1jxdcj3-MuiSvgIcon-root"
            data-testid="KeyboardArrowDownIcon"
            focusable="false"
            viewBox="0 0 24 24"
          >
            <path
              d="M7.41 8.59 12 13.17l4.59-4.58L18 10l-6 6-6-6 1.41-1.41z"
            />
          </svg>
        </span>
      </li>
      <li
        class="c0"
      >
        <span
          class="c1"
        >
          a menu item
          <svg
            aria-hidden="true"
            class="MuiSvgIcon-root MuiSvgIcon-fontSizeMedium css-1jxdcj3-MuiSvgIcon-root"
            data-testid="KeyboardArrowDownIcon"
            focusable="false"
            viewBox="0 0 24 24"
          >
            <path
              d="M7.41 8.59 12 13.17l4.59-4.58L18 10l-6 6-6-6 1.41-1.41z"
            />
          </svg>
        </span>
      </li>
      <li
        class="c2"
      >
        <a
          class="c3"
        >
          a menu item
        </a>
      </li>
    </div>
  </body>,
  "container": <div>
    <li
      class="styles__List-cp-layout__sc-14ji2y1-1 caMONU"
    >
      <span
        class="styles__MenuItem-cp-layout__sc-14ji2y1-0 ienxCw"
      >
        a menu item
        <svg
          aria-hidden="true"
          class="MuiSvgIcon-root MuiSvgIcon-fontSizeMedium css-1jxdcj3-MuiSvgIcon-root"
          data-testid="KeyboardArrowDownIcon"
          focusable="false"
          viewBox="0 0 24 24"
        >
          <path
            d="M7.41 8.59 12 13.17l4.59-4.58L18 10l-6 6-6-6 1.41-1.41z"
          />
        </svg>
      </span>
    </li>
    <li
      class="styles__List-cp-layout__sc-14ji2y1-1 caMONU"
    >
      <span
        class="styles__MenuItem-cp-layout__sc-14ji2y1-0 ienxCw"
      >
        a menu item
        <svg
          aria-hidden="true"
          class="MuiSvgIcon-root MuiSvgIcon-fontSizeMedium css-1jxdcj3-MuiSvgIcon-root"
          data-testid="KeyboardArrowDownIcon"
          focusable="false"
          viewBox="0 0 24 24"
        >
          <path
            d="M7.41 8.59 12 13.17l4.59-4.58L18 10l-6 6-6-6 1.41-1.41z"
          />
        </svg>
      </span>
    </li>
    <li
      class="styles__MobileMenuItem-cp-layout__sc-14ji2y1-4 gnIwml"
    >
      <a
        class="styles__Anchor-cp-layout__sc-14ji2y1-3 iERZsF"
      >
        a menu item
      </a>
    </li>
  </div>,
  "debug": [Function],
  "findAllByAltText": [Function],
  "findAllByDisplayValue": [Function],
  "findAllByLabelText": [Function],
  "findAllByPlaceholderText": [Function],
  "findAllByRole": [Function],
  "findAllByTestId": [Function],
  "findAllByText": [Function],
  "findAllByTitle": [Function],
  "findByAltText": [Function],
  "findByDisplayValue": [Function],
  "findByLabelText": [Function],
  "findByPlaceholderText": [Function],
  "findByRole": [Function],
  "findByTestId": [Function],
  "findByText": [Function],
  "findByTitle": [Function],
  "getAllByAltText": [Function],
  "getAllByDisplayValue": [Function],
  "getAllByLabelText": [Function],
  "getAllByPlaceholderText": [Function],
  "getAllByRole": [Function],
  "getAllByTestId": [Function],
  "getAllByText": [Function],
  "getAllByTitle": [Function],
  "getByAltText": [Function],
  "getByDisplayValue": [Function],
  "getByLabelText": [Function],
  "getByPlaceholderText": [Function],
  "getByRole": [Function],
  "getByTestId": [Function],
  "getByText": [Function],
  "getByTitle": [Function],
  "queryAllByAltText": [Function],
  "queryAllByDisplayValue": [Function],
  "queryAllByLabelText": [Function],
  "queryAllByPlaceholderText": [Function],
  "queryAllByRole": [Function],
  "queryAllByTestId": [Function],
  "queryAllByText": [Function],
  "queryAllByTitle": [Function],
  "queryByAltText": [Function],
  "queryByDisplayValue": [Function],
  "queryByLabelText": [Function],
  "queryByPlaceholderText": [Function],
  "queryByRole": [Function],
  "queryByTestId": [Function],
  "queryByText": [Function],
  "queryByTitle": [Function],
  "rerender": [Function],
  "unmount": [Function],
}
`;
