// Jest Snapshot v1, https://goo.gl/fbAQLP

exports[`<ContactDetails /> renders a <ContactDetails> component 1`] = `
Object {
  "asFragment": [Function],
  "baseElement": .c0 {
  display: -webkit-box;
  display: -webkit-flex;
  display: -ms-flexbox;
  display: flex;
  -webkit-flex-direction: column;
  -ms-flex-direction: column;
  flex-direction: column;
  margin-bottom: 0;
}

.c1 {
  font-size: 18px;
  line-height: 1.44;
  margin: 0;
  -webkit-user-select: none;
  -moz-user-select: none;
  -ms-user-select: none;
  user-select: none;
}

.c2 {
  margin: 10px 0 0;
}

.c3 {
  display: -webkit-box;
  display: -webkit-flex;
  display: -ms-flexbox;
  display: flex;
}

.c3:first-child {
  margin-bottom: 6px;
}

.c6 {
  margin: 0 8px 0 0;
  height: -webkit-fit-content;
  height: -moz-fit-content;
  height: fit-content;
  -webkit-filter: invert(27%) sepia(18%) saturate(0%) hue-rotate(186deg) brightness(84%) contrast(93%);
  filter: invert(27%) sepia(18%) saturate(0%) hue-rotate(186deg) brightness(84%) contrast(93%);
}

.c4 {
  display: -webkit-box;
  display: -webkit-flex;
  display: -ms-flexbox;
  display: flex;
  -webkit-flex-direction: column;
  -ms-flex-direction: column;
  flex-direction: column;
}

.c7 {
  margin-left: 30px;
}

.c5 {
  color: #404040;
  -webkit-text-decoration: none;
  text-decoration: none;
  display: -webkit-box;
  display: -webkit-flex;
  display: -ms-flexbox;
  display: flex;
}

@media (max-width:599.95px) {
  .c0 {
    -webkit-align-items: center;
    -webkit-box-align: center;
    -ms-flex-align: center;
    align-items: center;
    margin-bottom: 30px;
  }
}

@media (max-width:599.95px) {
  .c3 {
    -webkit-box-pack: center;
    -webkit-justify-content: center;
    -ms-flex-pack: center;
    justify-content: center;
  }
}

@media (min-width:1280px) {
  .c7 {
    margin-left: 5px;
  }
}

@media (max-width:599.95px) {
  .c7 {
    margin-left: 0px;
  }
}

@media (max-width:599.95px) {
  .c5 {
    -webkit-box-pack: center;
    -webkit-justify-content: center;
    -ms-flex-pack: center;
    justify-content: center;
  }
}

<body>
    <div>
      <div
        class="c0"
      >
        <h5
          class="c1"
        >
          Do you have questions?
        </h5>
        <div
          class="c2"
        >
          <div
            class="c3"
          >
            <div
              class="c4"
            >
              <a
                class="c5"
                href="tel:+4930770191295"
              >
                <img
                  alt=""
                  class="c6"
                  loading="lazy"
                />
                +4930770191295
              </a>
              <div
                class="c7"
              >
                (Mo – Fr 8:30 AM to 4:30 PM (CET))
              </div>
            </div>
          </div>
          <div
            class="c3"
          >
            <img
              alt=""
              class="c6"
              loading="lazy"
            />
            <a
              class="c5"
              href="mailto:service@raisin.com"
            >
              service@raisin.com
            </a>
          </div>
        </div>
      </div>
    </div>
  </body>,
  "container": <div>
    <div
      class="styles__Wrapper-cp-layout__sc-14igvhq-0 cgXWcO"
    >
      <h5
        class="styles__Heading-cp-layout__sc-14igvhq-1 eOYQRn"
      >
        Do you have questions?
      </h5>
      <div
        class="styles__Container-cp-layout__sc-14igvhq-2 bwmwKP"
      >
        <div
          class="styles__DetailsContainer-cp-layout__sc-14igvhq-3 eAOGuo"
        >
          <div
            class="styles__ScheduleContainer-cp-layout__sc-14igvhq-5 hWKWBU"
          >
            <a
              class="styles__Anchor-cp-layout__sc-14igvhq-7 ehnZuh"
              href="tel:+4930770191295"
            >
              <img
                alt=""
                class="styles__Icon-cp-layout__sc-14igvhq-4 cZlNOg"
                loading="lazy"
              />
              +4930770191295
            </a>
            <div
              class="styles__ScheduleItem-cp-layout__sc-14igvhq-6 cGQmPP"
            >
              (Mo – Fr 8:30 AM to 4:30 PM (CET))
            </div>
          </div>
        </div>
        <div
          class="styles__DetailsContainer-cp-layout__sc-14igvhq-3 eAOGuo"
        >
          <img
            alt=""
            class="styles__Icon-cp-layout__sc-14igvhq-4 cZlNOg"
            loading="lazy"
          />
          <a
            class="styles__Anchor-cp-layout__sc-14igvhq-7 ehnZuh"
            href="mailto:service@raisin.com"
          >
            service@raisin.com
          </a>
        </div>
      </div>
    </div>
  </div>,
  "debug": [Function],
  "findAllByAltText": [Function],
  "findAllByDisplayValue": [Function],
  "findAllByLabelText": [Function],
  "findAllByPlaceholderText": [Function],
  "findAllByRole": [Function],
  "findAllByTestId": [Function],
  "findAllByText": [Function],
  "findAllByTitle": [Function],
  "findByAltText": [Function],
  "findByDisplayValue": [Function],
  "findByLabelText": [Function],
  "findByPlaceholderText": [Function],
  "findByRole": [Function],
  "findByTestId": [Function],
  "findByText": [Function],
  "findByTitle": [Function],
  "getAllByAltText": [Function],
  "getAllByDisplayValue": [Function],
  "getAllByLabelText": [Function],
  "getAllByPlaceholderText": [Function],
  "getAllByRole": [Function],
  "getAllByTestId": [Function],
  "getAllByText": [Function],
  "getAllByTitle": [Function],
  "getByAltText": [Function],
  "getByDisplayValue": [Function],
  "getByLabelText": [Function],
  "getByPlaceholderText": [Function],
  "getByRole": [Function],
  "getByTestId": [Function],
  "getByText": [Function],
  "getByTitle": [Function],
  "queryAllByAltText": [Function],
  "queryAllByDisplayValue": [Function],
  "queryAllByLabelText": [Function],
  "queryAllByPlaceholderText": [Function],
  "queryAllByRole": [Function],
  "queryAllByTestId": [Function],
  "queryAllByText": [Function],
  "queryAllByTitle": [Function],
  "queryByAltText": [Function],
  "queryByDisplayValue": [Function],
  "queryByLabelText": [Function],
  "queryByPlaceholderText": [Function],
  "queryByRole": [Function],
  "queryByTestId": [Function],
  "queryByText": [Function],
  "queryByTitle": [Function],
  "rerender": [Function],
  "unmount": [Function],
}
`;
