{
  "footer.contactDetails.title": "Do you have questions?",
  "footer.mobileBanner.appStore.alt": "Download on the App Store",
  "footer.mobileBanner.playStore.alt": "Get it on Play Store",
  "footer.mobileBanner.text": "Download the Raisin app to compare and apply for savings accounts, and manage your money on the go - any time, any place.",
  "footer.mobileBanner.title": "Manage your money on the go",
  "footer.socialMedia.title": "Follow us on",
  "footer.trustpilot.reviews.text": "Based on {countOfReviews} reviews",
  "footer.trustpilot.stars.text": "Outstanding",
  "footer.trustpilot.title": "How our customers rate us:",
  "header.buttons.login": "Log in",
  "header.buttons.register": "Register",
  "header.desktop.referAFriend": "Recommend Raisin UK and you could receive £25 for you & £25 for your friend",
  "header.logo.cooperationText": "In co-operation with",
  "header.mainNav.administration": "My account",
  "header.mainNav.banking": "My Raisin UK Account",
  "header.mainNav.blockAcc": "Freeze account",
  "header.mainNav.blockTan": "Deactivate mobile verification",
  "header.mainNav.dashboard": "Dashboard",
  "header.mainNav.fixedDeposit": "Fixed Rate Bonds",
  "header.mainNav.forms": "Show forms",
  "header.mainNav.investmentProductsConfigurator": "ETF Configurator",
  "header.mainNav.investmentProductsRobo": "ETF Robo",
  "header.mainNav.myData": "My profile",
  "header.mainNav.myInvestments": "My savings",
  "header.mainNav.noticeDeposit": "Notice Accounts",
  "header.mainNav.overnightDeposit": "Easy Access",
  "header.mainNav.payOut": "Withdrawal",
  "header.mainNav.pensionProducts": "Pension Products",
  "header.mainNav.postbox": "Messages",
  "header.mainNav.postboxDocuments": "Documents",
  "header.mainNav.postboxMessages": "Inbox",
  "header.mainNav.postboxSentMessages": "Sent",
  "header.mainNav.switchTanMethod": "Change sign method",
  "header.mainNav.taxExemption": "Tax exemption",
  "header.mainNav.transactions": "Transactions",
  "header.mobile.menuText": "Menu",
  "header.mobile.referAFriend": "Earn up to £50",
  "header.topBar.businessCustomer": "Business Customers",
  "header.topBar.extendedWelcomeMessage": "to online banking",
  "header.topBar.privateCustomer": "Private Customers",
  "header.topBar.welcomeMessage": "Welcome"
}