{
  "AddressDetails.city.label": "Stadt",
  "AddressDetails.countryCode.label": "Ländercode",
  "AddressDetails.postalCode.label": "Postleitzahl",
  "AddressDetails.section.heading": "Adressdaten",
  "AddressDetails.street.label": "Straße",
  "AddressDetails.streetNumber.label": "Hausnummer",
  "CustomerData.AccountHolder.heading": "Kontoinhaber",
  "CustomerData.toolbar.heading": "Stammdaten",
  "CustomerDetails.dateOfBirth.label": "Geburtsdatum",
  "CustomerDetails.email.label": "E-Mail-Addresse",
  "CustomerDetails.firstName.label": "Vorname",
  "CustomerDetails.industry.label": "Industrie",
  "CustomerDetails.lastName.label": "Nachname",
  "CustomerDetails.maritalStatus.label": "Familienstand",
  "CustomerDetails.nationality.label": "Staatsangehörigkeit",
  "CustomerDetails.phoneNumber.label": "Telefonnummer",
  "CustomerDetails.placeOfBirth.label": "Geburtsort",
  "CustomerDetails.profession.label": "Beruf",
  "CustomerDetails.salutation.label": "Anrede",
  "CustomerDetails.secondNationality.label": "Zweite Staatsangehörigkeit",
  "CustomerDetails.section.heading": "Kundendetails",
  "CustomerDetails.taxNumber.label": "Steuernummer",
  "CustomerDetails.taxRecidency.label": "Steuerlicher Wohnsitz",
  "CustomerDetails.title.label": "Titel",
  "CustomerMasterData.tab.activitylog": "Aktivität (Historie)",
  "CustomerMasterData.tab.address": "Adressdaten",
  "CustomerMasterData.tab.customerDetails": "Kundendetails",
  "CustomerMasterData.tab.documents": "Dokumente",
  "CustomerMasterData.tab.login": "Login / Passwort",
  "CustomerMasterData.tab.nominatedAccount": "Angegebenes Konto",
  "CustomerRetailData.tab.customerData": "Kundendaten",
  "CustomerRetailData.tab.depositProducts": "Sparprodukte",
  "CustomerRetailData.tab.investmentProducts": "Investmentprodukte",
  "CustomerRetailData.tab.pensionsProducts": "Altersvorsorgeprodukte",
  "CustomerRetailData.tab.postbox": "Posteingang",
  "CustomerRetailData.tab.transactionalAccount": "Transaktionskonto",
  "LoginDetails.password.label": "Passwort",
  "LoginDetails.section.heading": "Anmeldedaten",
  "LoginDetails.username.label": "Nutzername"
}