{
  "footer.contactDetails.title": "Haben Sie Fragen?",
  "footer.mobileBanner.appStore.alt": "Jetzt bei App Store",
  "footer.mobileBanner.playStore.alt": "Laden im Play Store",
  "footer.mobileBanner.text": "Mit der WeltSparen App haben Sie ihr WeltSpar-Konto immer schnell parat und starten mit wenigen Klicks neue Investments.",
  "footer.mobileBanner.title": "Unterwegs mal Ihre Anlagen checken?",
  "footer.socialMedia.title": "Folgen Sie uns auf",
  "footer.trustpilot.reviews.text": "Basierend auf {countOfReviews} Bewertungen",
  "footer.trustpilot.stars.text": "Hervorrangend",
  "footer.trustpilot.title": "Wie unsere Kunden uns bewerten:",
  "header.buttons.login": "Mein Konto",
  "header.buttons.register": "Kunde werden",
  "header.desktop.referAFriend": "WeltSparen empfehlen und 50 EUR + 50 EUR Prämie sichern.",
  "header.logo.cooperationText": "In Kooperation mit",
  "header.mainNav.administration": "Verwaltung",
  "header.mainNav.banking": "Mein WeltSparen",
  "header.mainNav.blockAcc": "Zugang sperren",
  "header.mainNav.blockTan": "mTAN sperren",
  "header.mainNav.dashboard": "Übersicht",
  "header.mainNav.fixedDeposit": "Festgeld",
  "header.mainNav.forms": "Formulare anzeigen",
  "header.mainNav.investmentProductsConfigurator": "ETF Configurator",
  "header.mainNav.investmentProductsRobo": "ETF Robo Advisor",
  "header.mainNav.myData": "Meine Daten",
  "header.mainNav.myInvestments": "Meine Anlagen",
  "header.mainNav.noticeDeposit": "Kündigungsgeld",
  "header.mainNav.overnightDeposit": "Tagesgeld",
  "header.mainNav.payOut": "Auszahlungen",
  "header.mainNav.pensionProducts": "Raisin Pension",
  "header.mainNav.postbox": "Postbox",
  "header.mainNav.postboxDocuments": "Dokumente",
  "header.mainNav.postboxMessages": "Nachrichten",
  "header.mainNav.postboxSentMessages": "Gesendet",
  "header.mainNav.switchTanMethod": "mTAN aktivieren",
  "header.mainNav.taxExemption": "Freistellungsauftrag",
  "header.mainNav.transactions": "Umsätze",
  "header.mobile.menuText": "Menü",
  "header.mobile.referAFriend": "WeltSparen empfehlen",
  "header.topBar.businessCustomer": "Geschäftskunden",
  "header.topBar.extendedWelcomeMessage": "im Onlinebanking",
  "header.topBar.privateCustomer": "Privatkunden",
  "header.topBar.welcomeMessage": "Willkommen"
}