{
  "baseUrl": "http://localhost:3000",
  "reporter": "mochawesome",
  "reporterOptions": {
    "reportDir": "cypress/reports/mochawesome-report",
    "overwrite": false,
    "html": false,
    "json": true
  },
  "video": false
}
