{
  "footer.contactDetails.title": "Heeft u vragen?",
  "footer.mobileBanner.appStore.alt": "Download in de App Store",
  "footer.mobileBanner.playStore.alt": "Download in de App Store",
  "footer.mobileBanner.text": "Met de Raisin App open en beheer je je deposito's en spaarrekeningen eenvoudig op je smartphone of tablet.",
  "footer.mobileBanner.title": "Je spaargeld altijd op zak",
  "footer.socialMedia.title": "Volg ons op",
  "footer.trustpilot.reviews.text": "Based on {countOfReviews} reviews",
  "footer.trustpilot.stars.text": "Outstanding",
  "footer.trustpilot.title": "How our customers rate us:",
  "header.buttons.login": "Mijn account",
  "header.buttons.register": "Word klant",
  "header.desktop.referAFriend": "Verwijs een vriend en verdien € 50 + € 50",
  "header.logo.cooperationText": "In co-operation with",
  "header.mainNav.administration": "Beheer",
  "header.mainNav.banking": "Mijn Raisin",
  "header.mainNav.blockAcc": "Account blokkeren",
  "header.mainNav.blockTan": "mTAN deactiveren",
  "header.mainNav.dashboard": "Dashboard",
  "header.mainNav.fixedDeposit": "Deposito sparen",
  "header.mainNav.forms": "Documenten",
  "header.mainNav.investmentProductsConfigurator": "ETF Configurator",
  "header.mainNav.investmentProductsRobo": "ETF Robo",
  "header.mainNav.myData": "Mijn gegevens",
  "header.mainNav.myInvestments": "Mijn producten",
  "header.mainNav.noticeDeposit": "Spaarrekening met voorwaarden",
  "header.mainNav.overnightDeposit": "Spaarrekening",
  "header.mainNav.payOut": "Uitbetaling",
  "header.mainNav.pensionProducts": "Pension Products",
  "header.mainNav.postbox": "Postvak",
  "header.mainNav.postboxDocuments": "Documenten",
  "header.mainNav.postboxMessages": "Berichten",
  "header.mainNav.postboxSentMessages": "Verzonden",
  "header.mainNav.switchTanMethod": "mTAN activeren",
  "header.mainNav.taxExemption": "Tax exemption",
  "header.mainNav.transactions": "Transacties",
  "header.mobile.menuText": "Menu",
  "header.mobile.referAFriend": "Verdien € 50 + € 50",
  "header.topBar.businessCustomer": "Business Customers",
  "header.topBar.extendedWelcomeMessage": "to online banking",
  "header.topBar.privateCustomer": "Private Customers",
  "header.topBar.welcomeMessage": "Welcome"
}