{
  "SignIn.signInUsingOkta.label": "Anmelden via Okta",
  "SignIn.timeout.label": "Ihre Sitzung ist abgelaufen und Sie wurden automatisch abgemeldet. Bitte melden Sie sich erneut an.",
  "Profile.logout.label": "Ausloggen",
  "Profile.settings.label": "Einstellungen",
  "ProfileSettings.loading.label": "Wird geladen",
  "ProfileSettings.subheading.label": "Als Admin eingeloggt",
  "Drawer.customerManagement.label": "Kundenverwaltung",
  "Timeout.countdown.label": "Sie werden ausgeloggt in:",
  "CustomerSearch.customerList.bacNumber": "BAC Nummer",
  "CustomerSearch.customerList.birthdate": "Geburtsdatum",
  "CustomerSearch.customerList.emailAddress": "E-Mail-Addresse",
  "CustomerSearch.customerList.firstName": "Vorname",
  "CustomerSearch.customerList.heading": "Kundenliste",
  "CustomerSearch.customerList.lastName": "Nachname",
  "CustomerSearch.customerList.status": "Status",
  "CustomerSearch.seachForCustomer.heading": "Suche nach einem Kunden",
  "SearchBar.input.placeholder": "Suche nach BAC Nummer",
  "SearchBar.submit.label": "Absenden",
  "components.StatusMessage.INVALID_REQUEST_PAYLOAD": "Ein technischer Fehler ist aufgetreten. Der Suchbegriff enthält möglicherweise ungültige Zeichen.",
  "components.StatusMessage.RESOURCE_NOT_FOUND": "404: Die angeforderten Daten konnten nicht gefunden werden.",
  "components.StatusMessage.UNAUTHORIZED": "Für den Zugriff auf diese Ressource ist eine Autorisierung erforderlich.",
  "components.StatusMessage.UNEXPECTED_ERROR": "Bei der Verarbeitung der Anforderung ist ein unerwarteter Fehler aufgetreten"
}
