{
  "project_info": {
    "project_number": "948250368616",
    "project_id": "login-page-experiment",
    "storage_bucket": "login-page-experiment.appspot.com"
  },
  "client": [
    {
      "client_info": {
        "mobilesdk_app_id": "1:948250368616:android:0540793f71c61f8c66b9dd",
        "android_client_info": {
          "package_name": "com.example.login_page_exp"
        }
      },
      "oauth_client": [
        {
          "client_id": "948250368616-lmkt5dfrmkou7m2bpgu2vv3dh273a15h.apps.googleusercontent.com",
          "client_type": 3
        }
      ],
      "api_key": [
        {
          "current_key": "AIzaSyCNmABScCseaQjydDzP-vXH2EH48IuDeiE"
        }
      ],
      "services": {
        "appinvite_service": {
          "other_platform_oauth_client": [
            {
              "client_id": "948250368616-lmkt5dfrmkou7m2bpgu2vv3dh273a15h.apps.googleusercontent.com",
              "client_type": 3
            }
          ]
        }
      }
    }
  ],
  "configuration_version": "1"
}